6,2,3.38554382324e-05
7,2,0.000210046768188
8,3,0.00125908851624
9,3,0.00509977340698
10,4,0.0141379833221
11,4,0.027872800827
12,5,0.0404870510101
13,5,0.0448970794678
14,5,0.0365209579468
15,5,0.0221161842346
16,4,0.00950312614441
17,3,0.00282597541809
18,2,0.000514030456543
