3,1,5.60283660889e-05
4,2,0.000399112701416
5,3,0.00236296653748
6,3,0.0728440284729
7,4,0.121208906174
8,4,0.15916800499
9,5,0.163347959518
10,5,0.129842996597
11,5,0.0810379981995
12,5,0.0382299423218
13,5,0.0131509304047
14,4,0.00317001342773
15,3,0.000469923019409
