30,is
1612,have
6,do
11,be
145,know
5077,was
342,can
746,are
532,get
217,here
51,so
1296,out
377,go
42,up
6939,got
145,now
1561,come
716,how
5521,well
19165,want
17863,think
7534,good
1678,see
652,let
2564,did
19448,why
19409,will
527,time
10301,look
2655,take
496,man
721,where
19676,would
1586,been
3775,tell
2845,had
5985,say
14157,really
2168,down
10192,little
536,way
9866,make
2309,too
11629,never
10756,mean
2145,very
1819,off
16402,sorry
6935,give
369,has
17795,thank
342,am
12724,people
1064,sure
2180,thing
3486,only
4779,sir
10743,maybe
7512,god
9669,night
2518,call
16755,talk
6598,find
1212,wait
591,put
7665,great
17891,thought
1761,day
10066,life
345,again
19598,won
471,around
670,other
1221,away
627,new
15761,stop
2005,keep
18078,told
551,big
5244,does
11655,nice
5778,name
11186,money
6463,feel
1633,believe
17798,thanks
1618,old
718,place
8582,kind
486,lot
7934,made
3220,leave
4075,girl
7541,hear
6416,father
1281,bad
7453,listen
14410,remember
2109,boy
19729,wrong
498,might
1757,house
1255,baby
1304,dad
8,done
50,mind
3222,left
431,ask
2105,car
11107,understand
2968,mother
2966,try
8186,hell
241,miss
1559,came
18650,world
7782,guess
9601,kill
2830,real
1348,room
11248,morning
1618,hold
2425,woman
622,mom
1597,friend
11317,move
9432,job
18533,went
949,son
977,best
9428,saw
6995,found
515,ready
1902,whole
532,together
11031,minute
391,head
10725,matter
8054,haven
6109,excuse
8682,idea
6362,family
10816,meet
2287,run
8536,wife
465,live
70,use
11101,took
6272,yet
16799,start
7966,happy
15220,school
13543,problem
2228,bring
185,actually
2419,business
285,sit
2771,cause
5,alone
7972,hard
17147,stuff
11708,turn
8403,honey
2463,gone
5280,door
4593,face
19661,worry
15358,second
2269,brother
2004,case
13539,probably
1554,beautiful
1271,hand
10108,year
6930,forget
586,hit
4128,crazy
123,late
5552,phone
201,end
5577,easy
5234,doctor
15819,shut
724,part
1154,die
1474,soon
7959,happen
18421,true
17328,supposed
586,eat
6685,jack
5329,town
338,afraid
6061,exactly
8623,hurt
7541,heart
6926,gave
19803,young
2871,chance
515,read
11819,number
2879,change
19315,week
10650,married
788,point
13184,police
6924,word
7149,fun
552,bit
7230,game
12531,party
1037,set
187,cut
1002,sleep
1878,shot
546,ass
2466,stand
7077,water
4036,couple
2154,break
8303,story
307,far
7162,funny
19940,goes
4518,death
4237,walk
333,fire
2517,hate
1609,gun
934,rest
2853,person
4910,different
2614,captain
8800,important
518,also
409,line
11965,office
4958,dinner
13922,quite
506,side
12885,pick
13898,question
3894,cool
698,body
8256,high
8628,husband
14171,reason
502,almost
2351,dog
18439,truth
527,met
1878,hot
10357,speak
1565,bed
11174,moment
1874,blood
15615,shall
4415,daddy
17165,stupid
15962,sister
15449,send
16372,sometimes
704,free
2002,book
344,war
8621,hurry
2275,brought
511,bet
3208,clear
1368,glad
4477,daughter
2592,city
1229,full
415,sick
458,light
11974,shoot
11642,news
2806,lose
15144,save
8519,hour
4023,country
26,able
7031,frank
8785,perfect
2028,order
6409,food
3296,luck
902,hair
5410,drive
11399,music
8487,power
5981,special
15506,serious
17062,street
68,dance
2879,hang
18183,touch
16850,team
107,company
13754,pull
17413,sweet
3357,coffee
7968,lucky
14531,sound
15037,safe
102,date
13452,president
15401,seem
309,air
12901,picture
9762,lord
48,sent
12763,perhaps
2743,catch
2153,win
1194,top
20018,scared
4486,dream
10821,meeting
11725,sense
3368,cold
3891,king
13228,poor
12300,throw
18571,write
17325,suppose
16161,small
10699,piece
8496,hospital
18604,uncle
9701,known
11329,movie
3080,christmas
3199,clean
9643,kiss
6031,evening
10985,million
456,lie
6483,felt
9913,learn
1593,fall
1731,bill
6592,finally
3178,class
13909,quiet
19599,wonder
2273,law
1561,become
14081,rather
8803,possible
899,mad
11382,murder
41,road
2985,eye
16374,somewhere
6182,explain
403,less
17398,wear
2649,careful
3219,early
14459,report
4829,state
2430,busy
89,table
1214,wake
2252,broke
1332,ball
1296,mouth
10652,marry
10770,meant
10402,lunch
10065,lieutenant
6154,expect
11644,paper
11968,officer
8515,hotel
361,agent
342,american
11095,mistake
19308,wedding
3277,clothes
19332,weird
4047,court
6765,floor
2340,building
5554,earth
6611,finish
6939,forgot
414,ship
3291,club
1129,attention
19663,worse
12367,pain
290,sing
1893,blow
3047,choice
932,ray
2566,stick
14366,relax
5075,honor
3405,colonel
12238,smart
1942,boat
412,plane
10368,lovely
14576,train
309,fair
20076,worried
15381,security
4061,cover
1298,bag
17762,terrible
2768,caught
16380,song
8479,horse
1541,ring
10453,sell
8788,personal
10897,message
5601,system
343,afternoon
1945,bob
18192,tough
159,quit
2100,box
9564,kept
8993,information
6870,fool
15914,simple
721,anywhere
17398,swear
5840,land
187,cute
6822,lying
211,dress
5274,key
8097,strong
321,fix
17035,strange
1574,rock
19064,voice
19516,window
1390,bar
18176,totally
911,army
12364,paid
15744,short
2063,bought
2638,card
982,certain
3396,college
6048,evidence
2446,fly
1376,bank
1680,besides
20082,completely
756,ran
1135,test
13688,proud
1913,fish
222,join
9882,lead
727,apartment
5852,enjoy
10013,letter
15976,situation
416,trip
1762,mark
493,star
98,accident
8746,imagine
2063,ought
13086,pleasure
1857,list
5868,rich
15431,service
4906,difference
9469,judge
110,ice
9869,lawyer
161,age
16819,station
7519,gold
15348,seat
8596,hundred
17269,summer
628,angel
10894,mess
2994,chief
13973,radio
2127,brain
16408,soul
6935,forgive
5450,drunk
4587,deep
16137,slow
13525,private
1588,beer
869,area
4444,dangerous
11959,offer
18797,upset
70,bus
2091,owe
7742,group
9587,kick
9445,joke
6476,fell
17119,truck
17643,teach
1269,ground
2707,cash
6985,forward
5074,honest
2111,boyfriend
12485,park
3579,position
5133,respect
19734,wrote
13729,public
7574,grab
724,art
5063,favor
18801,upstairs
17381,wall
5826,force
9351,jail
13818,push
28,normal
10436,machine
13677,protect
331,field
9491,jump
11754,nose
4077,hide
3099,church
11107,sun
12629,peace
13576,professor
7060,french
17900,thousand
3529,paris
6440,fear
17585,tape
9868,suit
8366,holy
7264,gas
14362,relationship
2051,bother
5981,especially
11601,nervous
471,round
4994,dirty
15,cat
2171,breakfast
305,space
8815,prison
2681,carry
164,cry
428,arm
6577,film
7568,government
17062,tree
336,foot
9679,knock
379,agree
12476,pardon
7394,gift
16431,south
2517,hat
29,board
6964,sake
11738,north
4725,department
8780,patient
1227,awful
546,sad
1606,beginning
7602,grand
15501,sergeant
9836,laugh
5304,doubt
2114,race
2991,chicken
1489,bathroom
16648,spot
4812,detective
15683,sheriff
6265,glass
18568,type
10953,west
17437,wine
40,rid
5062,sea
6739,flight
11555,neck
7746,grow
10867,mention
5524,wind
6239,extra
375,low
8803,impossible
7289,gay
3598,computer
638,angry
2369,bunch
1808,blame
3257,clock
683,tea
9647,kitchen
1902,hole
743,pal
1531,bear
11978,often
1698,wild
15898,silly
2532,camera
1603,begin
2148,reach
1519,beach
8145,heaven
472,leg
13907,quickly
19668,worst
13948,track
17646,teacher
14689,ridiculous
5417,river
4448,dare
1151,burn
1167,aunt
4553,decision
20048,surprised
13889,queen
340,fresh
9034,innocent
5744,emergency
10799,medical
2798,cell
1981,bomb
6,band
13482,price
16846,steal
19220,waste
3354,code
13463,pressure
915,rose
7178,further
10461,magic
3934,corner
3751,consider
211,address
10391,warm
16331,sold
13416,pregnant
2857,hall
5909,treat
3555,complete
186,cup
7983,hardly
2535,camp
1598,beg
5514,duty
2055,bottle
4546,decide
8408,moon
3828,continue
38,east
10706,match
6243,trial
902,chair
17142,study
1308,rain
4133,cream
6094,excited
10853,memory
2178,breathe
8568,huge
1556,beauty
12287,rule
2335,build
3056,choose
292,advice
1559,became
3309,coach
7084,friday
15133,saturday
8155,heavy
5771,empty
3449,comfortable
241,mission
724,apart
2673,pool
9344,knife
19281,weapon
14567,restaurant
15715,shirt
6335,faith
4917,dig
2611,size
11551,necessary
1849,blind
4150,credit
2817,center
40,bridge
13369,practice
11098,mister
3886,cook
8502,stage
17957,ticket
644,animal
1756,bird
6270,sight
5441,drug
2647,career
7542,nature
8549,however
13503,prince
2499,cake
9290,responsible
2175,breath
8630,sky
3484,common
325,afford
5654,tie
2217,bright
1647,belong
19728,written
6561,file
2307,skin
6567,fill
3900,operation
4782,desk
17622,taught
4772,deserve
4442,danger
10781,meat
12752,perfectly
17281,sunday
5451,dry
3693,form
10662,martin
2447,milk
1617,held
8471,horrible
11507,natural
5065,grace
1502,battle
18583,ugly
3322,coat
12065,opinion
19217,washington
17766,terrific
7340,gentleman
10316,loose
10233,local
986,shame
12167,otherwise
5857,large
4450,devil
18980,video
16539,speed
1962,oil
2976,chest
1780,bite
5077,wash
3332,stone
1862,block
8890,indeed
13469,pretend
8103,health
586,heat
10563,manager
7785,guest
6376,fantastic
7938,shake
9305,island
3414,color
1404,bell
11468,naked
17245,suggest
19371,wet
12915,pig
10888,merry
2958,cheese
16333,soldier
11211,monster
9177,planet
9045,insane
2515,california
9196,view
12047,opening
9114,insurance
16617,split
9388,jealous
2353,bullet
9176,national
413,airport
16534,speech
6647,hook
17596,target
13064,player
15876,signal
17244,sugar
692,hill
6877,football
12359,page
9021,justice
13602,project
2042,rough
4245,crowd
10767,meaning
4788,pair
3730,science
18763,usual
17179,subject
17065,strength
411,mail
7039,freak
11588,neighborhood
6607,finger
7385,ghost
10511,majesty
12683,peg
1801,smith
12307,weight
13379,pray
575,unit
17918,throat
6673,lake
4988,director
18425,truly
2221,brilliant
777,cab
2567,candy
9505,junior
12896,pocket
6631,roof
2312,bud
11296,mountain
1447,base
18225,trade
14820,romantic
6368,fan
18251,training
9774,language
492,purpose
1839,bless
11713,noise
8409,suck
6097,exciting
747,rent
6359,familiar
19291,weather
10802,medicine
17690,television
16963,stomach
9,ate
4033,county
2300,buck
11543,nearly
4108,crane
19000,village
11198,monkey
18054,toast
412,lane
16291,social
18310,travel
16370,sometime
11184,monday
13652,property
14397,remain
15369,secretary
7158,funeral
10457,magazine
9399,jerk
7049,freedom
4429,damage
7939,handsome
16297,society
5823,energy
18844,vacation
4600,defense
77,rat
7543,goodness
739,post
17345,surgery
17687,telephone
3834,contract
4288,tall
13573,professional
10008,lesson
1048,assistant
4798,tiny
704,freeze
11109,understood
10048,license
11135,model
16310,soft
753,ear
16729,staff
19194,warning
5835,engine
7363,german
10607,map
7005,square
15902,silver
17459,sydney
1845,blew
19269,weak
15344,season
2289,rush
1226,awesome
16254,snow
2866,champagne
1577,spread
1988,bond
2153,winner
9888,leader
18110,tongue
1481,bath
12779,permission
11209,monsieur
10929,mexico
2129,storm
790,appointment
15243,score
8488,shoe
11930,ocean
14151,reality
11079,shape
17364,survive
10079,style
6386,farm
9744,laid
428,alarm
6978,fortune
13772,punch
9247,invite
9196,interview
14995,russian
3043,chocolate
9314,sue
1629,grade
7689,grew
9241,investigation
10219,load
12378,painting
3505,community
1885,loss
18073,toilet
5434,drove
3939,meal
10840,member
15718,shock
7461,pie
971,artist
17818,theory
5852,joy
18232,traffic
3258,wise
10949,midnight
4663,deliver
2150,bread
1646,button
140,eve
8598,hung
2923,charming
17786,texas
4770,desert
13549,process
12517,particular
7609,grandmother
13488,pride
5250,dollar
2824,tip
5641,plant
2426,bust
1758,birth
2350,bull
19546,wire
885,rise
2038,boring
986,ashamed
3229,clever
7244,garage
3721,connection
7030,france
2695,wheel
17037,stranger
3991,wood
9484,juice
10126,lily
6015,europe
9669,knight
12937,pilot
11038,miracle
3107,cigarette
7641,grateful
7247,garden
15285,scream
182,actor
943,row
5845,grave
15453,senior
4617,flat
19539,winter
1292,badly
13491,priest
17295,super
5062,disease
12561,sword
2989,chick
17550,talent
11268,mostly
1264,bone
1602,egg
8093,quarter
17438,swing
1726,bike
8607,hunt
11109,stood
10115,likely
9367,japanese
4789,desperate
4992,dirt
11534,navy
3807,plate
3891,cooking
5146,distance
17577,tank
14483,request
7528,golf
8292,hire
145,knowledge
4068,cow
4480,dawn
1154,audience
15882,silence
10877,mercy
1454,baseball
8213,hercules
16424,soup
1425,yard
5481,duke
18857,valley
14768,robin
8829,pure
77,rate
3023,china
12883,piano
5249,doll
5462,duck
579,amount
8106,healthy
762,pen
1147,attractive
6310,fail
2884,channel
5696,elevator
1654,belt
12716,penny
1509,bay
12591,pathetic
11043,mirror
17945,thursday
4981,direction
7552,gorgeous
586,theater
145,led
10614,march
2765,tail
5210,vision
5509,dust
17041,trap
15633,sharp
6251,extremely
9390,lousy
18763,unusual
11644,newspaper
773,apple
4040,courage
18464,tuesday
6648,fishing
18714,university
8825,pulse
145,edge
8721,illegal
13002,pity
3993,couch
13678,protection
15288,screen
13391,precious
162,rob
7523,golden
14765,robbery
6453,federal
11452,mystery
11598,nerve
18207,tower
10485,maid
19146,wallet
2769,flower
924,range
6015,rope
16840,steady
8739,image
18490,turkey
5531,nasty
4737,pot
17234,suffer
18307,trash
557,ambulance
13531,prize
14097,snake
2560,cancer
6909,foreign
3445,media
16478,spanish
6722,flesh
4252,rude
20088,disappointed
15106,sandwich
11108,understanding
13196,political
2012,boom
3500,union
777,cable
7130,fruit
3090,mum
11875,objection
7013,fox
2725,castle
3113,circle
18860,value
3092,chuck
7468,glory
11054,miserable
10558,manage
2092,bowl
18979,victory
1469,basketball
4721,deny
14061,rare
8354,holiday
10942,wave
2846,chain
5754,emotional
8263,highly
8611,hunting
19629,wore
15590,shadow
6352,false
1725,horn
6293,mile
14309,refuse
2328,bug
13937,rabbit
2867,champion
3542,competition
2827,century
2590,capable
17906,threat
4879,diamond
15696,shine
9,bat
861,chip
15475,sentence
19959,thrown
2663,nation
2442,butter
3219,earl
14461,reporter
581,sand
2085,bow
19590,wolf
5370,wing
2037,bored
765,pet
2180,thin
5355,drama
416,rip
8390,homework
12328,zone
6185,explanation
1064,assure
6316,failure
3389,collect
20013,swimming
9839,launch
4668,delivery
6515,fever
9450,jordan
12560,sport
2857,challenge
16305,soda
12239,spoken
10675,mask
18430,trunk
3534,passion
13810,purse
4765,script
960,article
3766,solid
3356,education
1446,salt
5142,solve
10904,metal
357,agency
630,anger
1305,pipe
18213,trace
8495,spit
18333,treatment
5346,dragon
9129,intelligence
22,ability
5293,mouse
760,ease
9846,laundry
4074,cowboy
11805,nuclear
1426,rome
3491,motion
10543,mall
19029,virus
9503,june
3822,contest
341,africa
13048,plastic
2585,cap
3068,chose
8716,ignore
17799,thanksgiving
3366,coincidence
3367,coke
5939,quality
5902,title
5210,division
17979,tiger
11394,museum
229,minister
16857,steel
656,anniversary
6773,florida
4255,cruel
1706,bible
11142,modern
17340,surface
3393,collection
4843,device
343,noon
9404,jersey
14644,reward
7356,georgia
617,iron
6212,express
15057,saint
15027,sacrifice
1042,assignment
8270,highway
16521,specific
19117,wagon
1269,background
3297,clue
3622,concert
2133,ranch
18866,vampire
386,agreement
2534,flag
1129,tent
14865,rotten
2447,term
16216,snap
8744,imagination
10169,liquor
5019,disaster
2028,border
7135,fuel
5670,electric
3900,opera
3130,circus
4350,current
18522,turtle
15061,salad
879,argument
12230,trigger
19544,wipe
1105,tone
18212,toy
6299,factory
1914,grass
857,bishop
3890,cookie
10037,liberty
438,alcohol
13199,politics
7336,gentle
3676,confession
6198,explosion
11953,offense
8093,headquarters
6583,filthy
18456,tube
12061,operator
12810,personnel
2005,pin
4437,dancer
14127,reaction
1583,steak
3869,version
17119,struck
1816,blast
4285,crystal
19422,whiskey
9385,jay
14553,response
13172,poker
9758,landing
7820,powder
183,actress
18986,vietnam
7293,gear
3144,civil
290,sin
10772,meanwhile
3076,christian
5310,dough
3664,fed
2832,ceremony
3289,clown
14522,solution
8184,helicopter
13381,prayer
5904,entrance
416,strip
12648,pearl
15123,satellite
2448,nut
7801,guitar
13271,porter
1458,basic
1510,net
12990,pitch
14816,romance
924,arrange
9366,japan
10529,makeup
414,hip
6726,flew
2112,hood
5548,earn
6689,flash
1494,lion
6596,financial
4376,customer
16282,soap
14462,represent
5324,pour
7173,furniture
10054,rice
18853,valentine
7385,host
1319,balance
15631,shark
18015,timing
17674,technology
9246,invitation
13477,review
2465,product
2737,tap
16830,status
14240,recording
17073,stretch
14379,relief
14690,rifle
6997,foundation
6990,foul
12606,pattern
1231,awkward
4663,liver
151,corn
3984,cotton
5076,towel
9409,jet
10107,lightning
558,bush
15025,sacred
17837,thick
8797,polite
17812,theme
10677,mason
12326,oxygen
3586,pound
14387,religion
3787,construction
1160,audition
9838,laughter
17402,sweater
3472,commission
9423,jewish
15643,shave
5403,drill
7365,germany
1317,baker
4248,crown
13139,poem
15909,similar
8,ad
11386,muscle
9922,leather
2309,tooth
5757,emperor
4425,daisy
16850,steam
13784,punishment
15657,sheep
6066,exam
17257,suitcase
5937,equal
3134,citizen
13301,possession
7880,halfway
12452,paradise
2766,cattle
11848,shell
1466,basket
3547,pile
19403,whip
11193,monitor
12129,organization
1274,stroke
5832,engagement
7886,halloween
1188,rap
10136,limit
1804,blade
5369,drawer
4183,cried
3106,cigar
9658,sack
12451,parade
9289,resist
5187,dive
8025,hatch
11020,minor
6214,expression
8058,hawk
17607,task
11099,toe
1490,tub
5761,empire
5375,string
4765,description
8833,nap
13565,production
6670,pole
2763,catholic
7903,hammer
1664,neat
1499,battery
4155,editor
3026,inch
12645,peanut
14994,russia
6864,fond
12848,phase
105,pan
4838,development
15879,signature
17248,suggestion
81,accent
3377,labor
14769,robot
15231,scientist
5914,entry
5061,discussion
7318,generation
2141,brass
3650,dime
9976,lemon
1413,bargain
3198,clay
10381,loyal
3437,combination
17621,tattoo
9387,jazz
11566,needle
2325,buffalo
14916,ruby
11413,slim
2357,frog
2598,pill
17936,thumb
733,hid
10382,loyalty
2671,carpet
10561,management
15662,sheet
756,appearance
13102,plot
8329,hockey
4802,destruction
5051,discovery
3003,dish
5675,electricity
12761,perfume
3336,cock
5692,elephant
463,alike
2961,chemical
7676,greek
1202,rage
771,applause
13335,potato
33,gin
19375,whale
17016,straighten
1785,bitter
14205,reception
10390,luggage
624,nest
7150,function
10689,massage
892,arizona
9422,jewelry
16470,spain
1046,assistance
412,airplane
14655,rhythm
17130,stubborn
3615,concept
13770,pumpkin
2553,canada
9417,jew
12550,passenger
8360,holly
6889,tool
734,rod
13243,pope
1432,barrel
6117,executive
2621,capture
1609,begun
12622,payment
257,adorable
7506,goat
13262,pork
12560,passport
12495,parole
18540,twin
13112,plug
3199,lean
1579,bee
19674,worthy
4359,curtain
11522,naughty
8808,impress
2198,brick
3551,complaint
7085,fried
2010,worm
5237,document
16569,spider
17363,survival
2133,branch
5920,envelope
11788,novel
2304,bucket
779,application
144,acid
6506,festival
2794,celebration
4726,depend
12701,pencil
7587,graduation
8583,humble
11377,mummy
6187,explode
15892,silk
658,announce
14054,ransom
6114,execution
7829,gut
11559,necklace
1842,blessing
9598,kidney
729,ape
2401,burnt
15165,scale
17406,sweep
14597,retreat
2924,chart
408,aircraft
927,arrangement
6833,fog
8774,impact
15571,severe
18957,vessel
4585,deed
4520,debate
1803,ladder
3334,web
8287,hint
2185,reed
16373,somewhat
6676,flame
13571,profession
1590,wax
16301,sock
6795,fluid
8506,hostile
5477,dug
4157,creek
12248,oven
6941,fork
10167,lipstick
12729,pepper
8954,infection
19705,wrestling
4592,deer
324,flu
15805,shrimp
2810,cemetery
17921,throne
876,tin
16082,slice
9804,laser
5445,drum
16573,spill
315,affection
1174,australia
1627,fry
14304,refrigerator
422,jar
13018,plague
7033,fur
830,lung
13966,radiation
476,allergic
9105,instrument
3068,hose
1879,stream
19016,violet
2565,candle
15122,satan
958,pod
14009,rainbow
367,aggressive
1179,author
15837,sickness
6907,forehead
2118,bracelet
15703,shiny
1401,cue
14364,relative
15140,sausage
15596,shaft
1187,auto
4290,cuba
10464,magician
18405,trophy
1853,ink
709,ton
18590,umbrella
2674,carriage
290,advertising
4514,dealt
8861,income
2295,brutal
140,achieve
10231,lobster
12419,panel
9419,jewel
8402,honesty
11780,notify
6850,folk
15141,savage
8659,hysterical
40,ridge
11360,mule
3784,strict
5918,nun
7660,grease
17132,stud
4081,crab
9718,label
13091,pledge
1528,bean
15781,shovel
14066,rarely
16630,sponge
8355,holland
19865,dreamt
5004,disagree
7844,gypsy
1715,bicycle
10729,mattress
3909,copper
15073,salmon
7268,gasoline
17563,urine
959,choke
11423,mustard
10186,literature
8061,hay
18361,tribe
2830,cereal
8782,peach
1314,bake
18918,velvet
17048,straw
19496,willow
527,meter
13742,pudding
5889,entertain
3274,cloth
18734,unpleasant
19835,zeus
9570,ketchup
13323,poster
16469,spaghetti
12917,pigeon
1149,rib
18091,tomato
19160,wander
12719,pentagon
7196,fuzzy
11091,sour
16586,spine
2310,wheat
4304,cuff
18904,vegetable
4219,crooked
18052,toad
15234,scoop
224,adjust
6393,farther
3254,oak
7553,gorilla
7692,grid
8689,identical
11235,moose
2446,butterfly
2774,sew
16717,squirrel
1295,mint
992,asian
9998,leopard
435,bin
69,ant
5274,donkey
1892,blouse
991,asia
5646,egypt
8825,impulse
2635,carbon
2314,buddha
3098,hunk
17903,thread
15993,skeleton
6630,fireplace
13131,pneumonia
2531,camel
16143,slug
3397,lid
3003,childish
19290,weasel
606,atomic
18929,venus
602,arc
10217,lizard
18985,vienna
6280,fabric
6533,fierce
7593,grain
17427,swept
16407,sought
15194,scarf
4363,curve
272,cement
6788,flown
2326,buffet
468,allah
7672,greece
16115,slippery
6713,fled
8770,immune
18418,truce
3805,container
4865,diagnosis
9406,jerusalem
2582,canvas
12025,onion
12565,pasta
7931,handkerchief
14731,ripe
19002,villain
20122,counseling
18428,trumpet
16064,slavery
658,ounce
14268,reef
2343,bulb
3156,clam
17405,swedish
1070,asthma
18893,vase
10874,mercury
12351,paddle
5953,lent
15414,seizure
11016,mink
9685,knot
3826,continent
7134,fudge
2091,bowel
2854,chalk
8906,indication
10912,meteor
12655,peck
484,alligator
1674,berry
17526,taiwan
3343,cockroach
11356,muhammad
14336,regularly
14348,reindeer
16,abdomen
6712,flea
12961,pint
17793,thai
4862,diabetes
16031,skunk
17453,swollen
13975,radioactive
9049,insect
19617,wool
2968,hera
4441,dane
12327,oyster
1279,bacteria
6709,flaw
900,armadillo
17794,thailand
18910,veil
4431,damp
10152,linen
12704,penetrate
13174,poland
5252,dolphin
16713,squid
18998,viking
606,atom
7759,grub
2730,casualty
17113,troll
1994,bongo
11595,neptune
9062,insignificant
16957,stocking
4869,gram
17404,sweden
18589,ulcer
9282,irregular
11302,mourn
7619,grapefruit
12467,parasite
16308,sodium
2183,bred
13282,portuguese
3914,coral
11413,muslim
17403,sweatshirt
18923,venom
1397,barb
4567,decorate
9535,kangaroo
11257,mortar
7223,gallon
4213,crocodile
7159,fungus
4447,danish
16531,spectrum
7908,hamster
19929,smiley
6810,flute
4172,crest
9111,insulin
2504,calculate
8093,quart
1592,beetle
12068,possum
3994,cougar
11939,octopus
9673,knit
1009,aspen
19238,waterfall
2294,brussels
17030,strand
330,afghanistan
2608,capricorn
14791,rodent
16212,snail
1291,badger
10814,meek
11752,norway
10171,lisbon
6498,ferret
10460,maggot
3170,clarinet
2391,burma
5106,spat
17240,suffocate
7741,groundhog
1237,woken
1304,baghdad
9330,ivory
8268,rung
17784,tetanus
3908,copenhagen
11003,minerva
12386,pakistan
514,alps
7292,gazelle
18921,venezuela
1793,blackboard
833,aquarius
4168,crept
9802,larynx
12685,peking
2759,caterpillar
3352,cocoon
19153,walrus
1848,blimp
2041,borne
4923,digestion
16179,smelt
685,antelope
3453,comma
4271,crunchy
19519,windpipe
6614,finland
9912,leapt
16926,stinger
6797,flung
19816,yugoslavia
6777,flounder
7304,gemini
11379,munch
1792,blackbird
2804,cellophane
29,oar
19937,foretold
18665,uneven
4405,czechoslovakia
14602,retriever
18586,ukraine
1424,barnacle
7180,furthest
9703,koala
5074,shone
17625,taurus
17728,tendon
9725,labrador
0,noun
15249,scorpio
7882,halibut
5738,embroidery
19022,virgo
10391,lukewarm
17665,teaspoon
12978,pisces
16862,steeple
582,amphibian
434,alberta
5781,enchant
19782,yemen
9705,koran
708,antler
3991,cottonwood
19596,wombat
5999,estonia
8235,heron
4122,crawfish
4280,crustacean
10188,lithuania
12465,paramecium
18070,togo
2834,ceres
15121,saskatchewan
12068,opossum
5259,domesticate
6014,euphrates
958,arthropod
