9,0,4.38690185547e-05
10,1,0.00047492980957
11,2,0.00459885597229
12,3,0.0284769535065
13,4,0.125223875046
14,4,0.395844936371
15,5,0.992087125778
16,6,1.99646496773
17,6,3.23291683197
18,6,4.24763512611
19,6,4.56752681732
20,6,4.05304503441
21,6,2.92157912254
22,6,1.66952204704
23,5,0.752369880676
24,5,0.265143156052
25,5,0.0706830024719
26,4,0.0130100250244
27,3,0.00154089927673
