8,0,6.91413879395e-06
9,1,0.000424861907959
10,0,0.000329971313477
11,-1,0.000500917434692
12,2,0.000471115112305
13,1,0.000670909881592
14,2,0.000588893890381
15,2,0.0041389465332
16,-2,0.000829935073853
17,-1,0.000784158706665
18,0,0.00343489646912
19,-2,0.00104808807373
20,0,0.00163316726685
21,0,0.00442099571228
22,-2,0.00149011611938
23,-2,0.105194091797
24,-2,0.00231599807739
25,-2,0.00328087806702
