8,-1,5.60283660889e-05
9,0,0.000536918640137
10,1,0.00381302833557
11,2,0.0195260047913
12,2,0.0771081447601
13,3,0.23800611496
14,4,0.558424949646
15,5,1.04373502731
16,5,1.55438303947
17,5,1.88178992271
18,6,1.83671188354
19,6,1.44501399994
20,6,0.91281914711
21,6,0.452706813812
22,5,0.179174900055
23,4,0.0508620738983
24,3,0.0104050636292
25,2,0.00126099586487
