6,0,4.05311584473e-06
7,0,0.000156164169312
8,1,0.000292062759399
9,1,0.000257968902588
10,1,0.000345945358276
11,3,0.000418186187744
12,3,0.0133109092712
13,1,0.000565052032471
14,3,0.000963926315308
15,4,0.0211129188538
16,3,8.08238983154e-05
17,4,0.0299320220947
