18,-3,1.19209289551e-05
19,-2,0.000712871551514
20,-1,0.000694990158081
21,-2,0.000632047653198
22,-1,0.00113892555237
23,-2,0.000876188278198
24,-2,0.00101804733276
25,-2,0.00116300582886
26,-2,0.00117516517639
