7,-1,1.59740447998e-05
8,0,0.000221014022827
9,1,0.000424146652222
10,2,0.000880002975464
11,3,0.000910997390747
12,4,0.00123405456543
13,4,0.00163507461548
14,5,0.00171399116516
15,5,0.00209498405457
16,5,0.00230503082275
17,5,0.00252795219421
18,4,0.00276899337769
19,4,0.00299596786499
20,4,0.00321078300476
21,3,0.00349998474121
22,2,0.00365495681763
