6,0,2.40802764893e-05
7,1,0.000181198120117
8,2,0.000283002853394
9,2,0.000424861907959
10,2,0.000581979751587
11,3,0.000726938247681
12,3,0.000876903533936
13,3,0.00102400779724
14,3,0.00159692764282
15,3,0.00142097473145
16,2,0.00149607658386
17,1,0.00158500671387
