6,0,5.00679016113e-06
7,1,0.000200986862183
8,1,0.000198125839233
9,2,0.000400066375732
10,1,0.000291109085083
11,3,0.000362873077393
12,1,0.000464916229248
13,2,0.000468969345093
14,0,0.000504970550537
15,3,0.000720024108887
16,3,0.000703096389771
17,4,0.00104880332947
18,3,0.00162291526794
19,2,0.0010199546814
