3,1,0.000151872634888
4,2,0.00465393066406
5,2,0.0312860012054
6,3,0.0581049919128
7,3,0.0765910148621
8,3,0.080335855484
9,3,0.0627510547638
10,3,0.035856962204
11,3,0.0147230625153
12,2,0.00415587425232
13,1,0.000725030899048
