4,0,9.05990600586e-06
5,2,8.70227813721e-05
6,2,0.000155925750732
7,3,0.000234127044678
8,4,0.000314950942993
9,4,0.000395059585571
10,4,0.000574111938477
11,4,0.000548124313354
12,4,0.000607967376709
