3,1,0.000202894210815
4,2,0.00380492210388
5,3,0.588522195816
6,4,3.43707895279
7,4,28.8527371883
8,5,88.8485319614
9,6,230.005416155
10,6,501.472354889
11,7,934.893347979
12,8,1497.21462297
13,8,2063.59151816
14,8,2448.91404915
15,8,2536.9407649
16,8,2282.06540394
17,8,950.86640501
18,8,599.951853991
19,8,344.41382885
20,8,168.687984943
21,7,69.6179862022
22,7,24.3190059662
23,6,6.83768987656
24,6,1.53053212166
25,5,0.259766817093
26,4,0.0327670574188
27,3,0.00260996818542
