16,-2,6.60419464111e-05
17,-1,0.000479936599731
18,0,0.00173187255859
19,1,0.00526094436646
20,1,0.00687789916992
21,2,0.00735282897949
22,2,0.00560307502747
23,2,0.00244903564453
24,1,0.000651121139526
