3,1,0.000530004501343
4,2,0.00252413749695
5,3,0.00806784629822
6,3,0.0273230075836
7,3,0.0365278720856
8,4,0.0371840000153
9,4,0.0288891792297
10,4,0.0164601802826
11,4,0.00677704811096
12,4,0.00190186500549
13,3,0.000329971313477
