18,-2,6.60419464111e-05
19,-2,0.000662803649902
20,-2,0.00121307373047
21,-1,0.00178003311157
22,-1,0.00241303443909
23,-1,0.0023500919342
24,-1,0.00228309631348
25,-2,0.00255584716797
26,-3,0.00284504890442
