9,1,4.88758087158e-05
10,2,0.000457048416138
11,3,0.00452589988708
12,3,0.0217969417572
13,4,0.0847370624542
14,4,0.261307001114
15,4,0.614560842514
16,4,1.15300011635
17,4,1.72559380531
18,4,2.08372712135
19,4,2.01382899284
20,3,1.58450508118
21,2,0.992380857468
22,2,0.533786058426
23,1,0.208847999573
24,0,0.0575249195099
25,-1,0.011234998703
26,-2,0.00134587287903
