9,1,2.09808349609e-05
10,2,0.000332117080688
11,2,0.000641822814941
12,2,0.00098991394043
13,2,0.00135111808777
14,2,0.00183510780334
15,2,0.00218605995178
16,2,0.0026650428772
17,3,0.00300598144531
18,3,0.00339293479919
19,3,0.00385284423828
20,3,0.00427889823914
21,3,0.00465297698975
22,2,0.00494503974915
23,1,0.00531506538391
24,0,0.00572800636292
25,-1,0.00598001480103
26,-2,0.00610399246216
