685,antelope
773,apple
1255,baby
1301,bagel
1332,ball
1354,banana
1430,barracuda
1466,basket
9,bat
1488,bathrobe
1528,bean
1565,bed
1726,bike
1756,bird
1792,blackbird
1813,blanket
2328,bug
2488,cactus
2492,cage
2532,camera
2679,carrot
2769,cauliflower
3019,chimney
3257,clock
3333,cobra
3890,cookie
4122,crawfish
186,cup
4327,cupcake
4425,daisy
4438,dandelion
4723,deodorant
5249,doll
5274,donkey
1523,eagle
753,ear
5662,elbow
5692,elephant
5973,escalator
6266,eyelash
6268,eyelid
6496,fern
6607,finger
1913,fish
6692,flashlight
2769,flower
6810,flute
2357,frog
7506,goat
7618,grape
7649,gravel
7691,greyhound
7900,hamburger
7931,handkerchief
8082,headband
1725,horn
8479,horse
8488,horseshoe
1757,house
422,jar
9570,ketchup
9649,kite
9661,knee
1803,ladder
9778,lantern
9892,leaf
9976,lemon
9998,leopard
10457,magazine
10492,mailbox
10578,mango
10729,mattress
10939,microscope
11360,mule
11555,neck
335,oat
11939,octopus
12444,paprika
12496,parrot
12560,passport
12637,peacock
12706,penguin
12915,pig
12935,pillow
7237,plank
13136,pocketbook
13241,popcorn
13259,porcupine
13914,quill
13917,quilt
408,raft
14003,railroad
14097,rattlesnake
14304,refrigerator
1488,robe
581,sand
15117,sardine
15156,saxophone
15728,shoelace
14097,snake
16469,spaghetti
16510,spear
16630,sponge
17051,strawberry
17499,tablespoon
17636,taxicab
17688,telescope
17849,thimble
8060,thorn
17979,tiger
1138,tire
18052,toad
18091,tomato
3838,tractor
18263,trampoline
17062,tree
18470,tulip
18522,turtle
14918,udder
18590,umbrella
18630,undershirt
18893,vase
18982,videocassette
19153,walrus
7077,water
820,apricot
943,arrow
1469,basketball
1790,blackberry
1912,bluebird
40,bridge
272,cement
2856,chalkboard
3037,chipmunk
3105,cider
3322,coat
3984,cotton
1602,egg
5641,eggplant
6498,ferret
6780,flour
7013,fox
7474,glove
7553,gorilla
7654,gravy
902,hair
9647,kitchen
3157,lamb
3161,lamp
10017,lettuce
10054,licorice
10434,macaroni
10460,maggot
11043,mirror
11235,moose
11286,motorcycle
12248,oven
12574,pastry
1308,rain
14021,raisin
15061,salad
15194,scarf
8488,shoe
15781,shovel
15993,skeleton
16305,soda
16569,spider
9868,suit
17257,suitcase
17918,throat
18073,toilet
18135,toothpaste
19149,walnut
1590,wax
151,acorn
412,airplane
484,alligator
612,anchovy
710,anvil
428,arm
983,ash
1004,asparagus
1193,automobile
1524,beak
1539,beard
1404,bell
1757,birdhouse
1892,blouse
1910,blueberry
2021,boot
2118,bracelet
2304,bucket
2360,bumblebee
2366,bumper
1646,button
2671,carpet
2725,castle
2779,cave
2803,cello
3021,chimpanzee
3343,cockroach
151,corn
4068,cow
4079,coyote
4089,cracker
4107,cranberry
4417,daffodil
5252,dolphin
5312,doughnut
5391,dresser
5445,drum
5448,drumstick
5544,earlobe
5553,earring
6610,fingerprint
6837,foghorn
7244,garage
347,gate
7619,grapefruit
8467,hornet
8588,hummingbird
8673,icicle
9305,island
9419,jewel
9477,jug
9569,kerosene
9598,kidney
3397,lid
10102,lighthouse
3568,lime
1494,lion
2516,lip
693,log
10283,lollipop
10675,mask
10912,meteor
11296,mountain
11412,muskrat
11559,necklace
11560,necktie
13835,pyramid
13837,python
14264,redwood
14853,rosebud
15239,scooter
15341,seashell
2009,shelf
15854,sidewalk
16498,spatula
16641,spoon
1583,steak
17009,stove
17114,stroller
17387,swamp
2054,swan
2765,tail
17656,teapot
17687,telephone
1129,tent
17832,thermometer
17936,thumb
17949,thyme
18648,underwear
19018,violin
19219,wasp
19375,whale
4386,cuticle
12952,pineapple
15715,shirt
596,anaconda
1290,badge
1584,beehive
1674,berry
1804,blade
1906,blowtorch
1942,boat
1949,bobcat
1996,bonnet
2343,bulb
2446,butterfly
2531,camel
2566,candlestick
2810,cemetery
2976,chest
2989,chick
3060,chopstick
3106,cigar
3198,clay
3598,computer
4092,cradle
4119,crate
4126,crayfish
4241,crow
4720,dentist
4794,dessert
4967,diploma
5250,dollar
211,dress
5467,duckling
5920,envelope
6609,fingernail
6633,firewood
6653,fist
6846,folder
7480,glowworm
1914,grass
7741,groundhog
7918,handbag
8058,hawk
8092,headphone
8165,hedgehog
692,hill
8291,hippopotamus
8515,hotel
8577,human
8950,infant
9395,jelly
9397,jellyfish
9486,jukebox
9580,keyboard
9702,knuckle
9846,laundry
9867,lawn
10546,mallet
10607,map
11269,motel
11423,mustard
11478,napkin
11566,needle
11863,oatmeal
11965,office
1962,oil
12068,opossum
145,owl
12365,pail
12429,panther
11644,paper
753,pear
12683,peg
12981,pistachio
12996,pitcher
13137,pocketknife
13186,policeman
13322,postcard
13937,rabbit
14012,rainfall
14073,raspberry
6015,rope
15153,sawdust
15583,shack
15631,shark
15662,sheet
15774,shoulder
16212,snail
16257,snowball
16282,soap
16737,stagecoach
5327,stair
16829,statue
17403,sweatshirt
12561,sword
3825,text
18045,tissue
18054,toast
11099,toe
18110,tongue
18212,toy
18320,treadmill
18413,trousers
17563,urine
19610,woodpecker
19693,wreath
19715,wrist
19767,yarn
414,airship
1254,baboon
1343,balloon
1424,barnacle
1490,bathtub
2150,bread
2475,cabin
2661,caribou
2708,cashew
3170,clarinet
6261,eyeball
7529,gondola
8189,helmet
9739,ladybug
7879,mast
2447,milk
11772,notebook
5918,nun
12104,orchid
762,pen
7461,pie
2005,pin
412,plane
13257,porch
15812,shrub
16585,spindle
17137,student
586,theater
18983,videotape
2055,bottle
7632,grasshopper
11804,nozzle
1574,rock
16301,sock
727,apartment
900,armadillo
695,ax
1278,bacon
1298,bag
1375,banjo
1521,bead
1575,bedroom
1654,belt
1765,biscuit
1264,bone
2002,book
2100,box
2133,branch
70,bus
558,bush
2442,butter
2638,card
2854,chalk
3099,church
3274,cloth
3289,clown
3889,cookbook
4081,crab
4461,dart
3003,dish
2985,eye
6342,falcon
6447,feather
6522,fiberglass
6627,firefly
336,foot
6907,forehead
6941,fork
6987,fossil
7801,guitar
7997,harmonica
802,hen
9350,jaguar
9378,javelin
9658,knapsack
9344,knife
9734,ladle
10167,lipstick
10746,mayonnaise
10781,meat
11198,monkey
8408,moon
11265,moss
11421,mustache
11674,nightgown
12359,page
750,pea
8782,peach
12883,piano
3956,pond
13222,pony
13277,portrait
13645,propeller
13742,pudding
13770,pumpkin
13810,purse
2126,rail
14117,razor
1149,rib
915,rose
15106,sandwich
15294,screwdriver
15657,sheep
16309,sofa
16798,starfish
16928,stingray
16941,stirrup
6889,stool
89,table
17585,tape
17847,thigh
17996,timber
18056,toaster
18400,trombone
19238,waterfall
13995,weed
2010,worm
692,anthill
1210,avocado
1715,bicycle
38,breast
2267,broom
2477,cabinet
2686,cart
2710,cashier
3006,children
2753,chin
3156,clam
3347,cocoa
3363,coin
3947,corpse
4879,diamond
6685,flapjack
6712,flea
7134,fudge
7173,furniture
879,gum
8424,hoof
110,ice
9049,insect
9484,juice
5274,key
9919,leash
10441,mackerel
10594,mansion
10791,medal
11116,mitten
11754,nose
11759,nostril
12090,optometrist
12208,outhouse
701,patio
12645,peanut
12869,photograph
12984,pistol
13187,policewoman
13224,poodle
14567,restaurant
14662,ribbon
5417,river
15054,sailboat
15072,saliva
1446,salt
15353,seaweed
15625,shamrock
15790,shower
16069,sledgehammer
16253,snout
16318,softball
16717,squirrel
16963,stomach
17458,swordfish
2309,tooth
18162,tortilla
18405,trophy
6976,tuna
18490,turkey
18627,underpants
18904,vegetable
19000,village
19005,vinegar
19117,wagon
19202,wart
19241,watermelon
2310,wheat
19515,windmill
19606,woodchuck
535,aluminum
575,ammunition
1531,bear
1579,bee
1588,beer
1590,beeswax
68,bun
777,cab
2578,canteen
3107,cigarette
592,dam
5313,dove
7033,frankfurter
7288,gavel
927,gem
7822,guppy
7993,hare
2517,hat
8403,honey
2112,hood
6673,lake
10938,microphone
11264,mosquito
20039,motorway
12701,pencil
1305,pipe
15140,sausage
15834,sickle
16031,skunk
16586,spine
18057,tobacco
18571,typewriter
413,airport
823,apron
1657,bench
2092,bowl
2248,broccoli
2568,cane
2759,caterpillar
4127,crayon
4157,creek
4244,crowbar
4782,desk
4960,dinosaur
4593,face
6626,firefighter
6647,fishhook
7057,freezer
8061,hay
3068,hose
9381,jaw
9685,knot
10904,metal
12648,pearl
12652,pecan
414,ship
16102,slingshot
16323,soil
16857,steel
17244,sugar
17835,thermostat
876,tin
19854,zucchini
118,accordion
69,ant
683,anteater
708,antler
1069,asteroid
1351,bamboo
1432,barrel
1454,baseball
1874,blood
2209,briefcase
2507,calculator
2565,candle
2575,canoe
2674,carriage
15,cat
2916,chariot
3359,coffin
3661,cone
3925,cork
4178,crib
4592,deer
4770,desert
4992,dirt
5462,duck
5835,engine
6670,flagpole
7120,frosting
7564,gourd
7607,grandfather
7700,grill
7779,guava
7908,hamster
2695,heel
8405,honeybee
8629,husk
9341,jacket
9535,kangaroo
9651,kitten
9654,kiwi
10231,lobster
10750,meadow
11336,mower
11342,mud
624,nest
11930,ocean
12025,onion
1891,otter
707,ox
105,pan
12413,pancake
12565,pasta
12651,pebble
12708,peninsula
5552,phone
13208,pollen
13576,professor
13768,puma
9205,raven
14192,receipt
14651,rhubarb
10054,rice
6916,runner
15055,sailor
6648,shin
15991,skateboard
16114,slipper
20042,snowboard
16263,snowstorm
16889,stethoscope
16957,stocking
17205,subway
17514,tadpole
17562,tamale
17563,tambourine
17790,textbook
18066,tofu
5076,towel
18428,trumpet
18528,tuxedo
5207,vine
17381,wall
19201,warship
2695,wheel
19516,window
19520,windshield
5370,wing
19617,wool
19828,zebra
519,altar
1359,bandage
1481,bath
2350,bull
2760,catfish
2764,catsup
2789,ceiling
2907,charcoal
3805,container
3983,cottage
3650,dime
2351,dog
6262,eyebrow
6826,foam
7254,gargoyle
7256,garland
4075,girl
7841,gymnast
8003,harp
8203,hemp
7931,kerchief
718,lace
10160,linoleum
10612,marble
10656,marsh
11099,mistletoe
11161,mold
12327,oyster
12498,parsnip
13114,plum
13335,potato
77,rat
14690,rifle
15033,saddle
15232,scissors
16254,snow
16492,sparrow
17742,tepee
3991,wood
1981,bomb
11284,motor
29,oar
9658,sack
15252,scorpion
16077,sleeve
17119,truck
18474,tumbleweed
872,arena
1010,asphalt
1592,beetle
2198,brick
2251,broiler
2325,buffalo
2353,bullet
2567,candy
2786,cedar
2830,cereal
2951,cheek
3195,claw
3271,closet
3352,cocoon
3367,coke
3939,cornmeal
4133,cream
4213,crocodile
4298,cucumber
5347,dragonfly
5951,equipment
4775,gnat
7650,graveyard
1609,gun
1584,hive
8717,iguana
9351,jail
472,leg
10390,luggage
10543,mall
320,mat
11080,missile
5293,mouse
11397,mushroom
11694,nipple
12402,palm
12716,penny
12899,picnic
13060,platypus
15329,seafood
16030,skull
16130,sloth
16869,stencil
16989,stopper
11107,sun
17594,tarantula
17690,television
17903,thread
18863,valve
19799,yoke
19844,zipper
479,alley
2866,champagne
3994,cougar
4359,curtain
4884,diaper
4951,diner
5444,drugstore
6488,fence
7426,gladiator
6265,glass
5082,grate
9422,jewelry
9608,kiln
9851,lava
9922,leather
10250,locomotive
10357,loudspeaker
830,lung
11644,newspaper
3254,oak
12724,people
15175,scalp
15701,shingle
12237,skirt
16558,sperm
17501,tablet
18024,tinsel
18053,toadstool
18456,tube
18486,tunnel
1425,yard
433,albatross
509,alpaca
557,ambulance
651,ankle
1509,bay
1523,beagle
2140,brandy
2499,cake
3357,coffee
4248,crown
5280,door
6525,fiddle
7130,fruit
7519,gold
7546,goose
7840,gymnasium
1902,hole
8848,inchworm
19926,keypad
9853,lavatory
12097,orangutan
12470,parcel
12814,perspiration
4737,pot
1541,ring
15073,salmon
5654,tie
18529,tweed
19146,wallet
19850,zoo
1383,banner
1591,beet
1645,belly
1672,beret
29,boar
2797,celery
2991,chicken
5085,disk
5554,earth
6765,floor
6409,food
6975,fortress
7593,grain
586,heater
10044,library
10152,linen
11353,mug
11968,officer
12351,paddle
13374,prairie
11848,shell
15805,shrimp
285,sit
16460,spacecraft
17184,submarine
17577,tank
588,amplifier
729,ape
1404,barbell
1423,barn
1519,beach
1704,bib
1913,bluefish
698,body
2451,buttock
2573,cannon
2878,chandelier
3009,chili
3023,china
2592,city
3328,cob
3336,cock
3350,coconut
4477,daughter
5310,dough
5458,dryer
5696,elevator
3090,emu
5802,encyclopedia
2534,flag
6693,flask
6898,forceps
7187,fuselage
7300,gelatin
7527,goldfish
7820,gunpowder
6647,hook
9669,knight
9818,latch
10222,loaf
10351,lotion
496,man
10802,medicine
12101,orchestra
12414,pancreas
13048,plastic
13184,police
13262,pork
14001,railing
6631,roof
1348,room
5441,rug
15220,school
15314,sculpture
5062,sea
989,shore
2307,skin
16035,skylight
16369,somersault
16728,stadium
17041,strap
17515,taffy
15445,trailer
14576,train
18510,turnip
19383,wheelbarrow
19478,wildcat
17437,wine
19590,wolf
1376,bank
2389,burlap
2400,burner
2582,canvas
2692,cartridge
2999,child
7258,garment
8277,hillside
9428,jigsaw
10218,llama
10835,melon
11130,moccasin
11348,muffin
11993,okra
12450,parachute
12482,parenthesis
12576,pasture
13793,puppy
15348,seat
17157,stump
17402,sweater
493,tar
17629,tavern
17987,tightrope
18467,tugboat
19801,yolk
610,anchor
831,aquarium
1916,blueprint
1994,bongo
2595,cape
3399,collie
4181,cricket
4231,crossbow
4556,deck
4703,denim
4816,detergent
5418,driveway
1269,ground
7871,haircut
7903,hammer
9409,jet
9703,koala
3229,lever
10937,organ
2598,pillar
12939,pimple
3807,plate
13069,playground
2673,pool
13491,priest
14916,ruby
15081,saltwater
16583,spinach
17048,straw
19898,swimmer
19591,wolverine
438,alcohol
733,aphid
905,armor
1014,aspirin
1848,blimp
1876,bloodhound
2109,boy
2577,cantaloupe
3191,classroom
3277,clothes
6299,factory
6505,fertilizer
3359,fin
6920,forest
7297,gecko
7359,geranium
7680,greenhouse
7933,handlebar
9330,ivory
9738,ladybird
10570,mandolin
11341,mucus
12870,photographer
12975,piranha
5641,plant
13072,playpen
7820,powder
14251,rectangle
16290,soccer
5375,string
17486,syrup
17665,teaspoon
18059,toboggan
1906,torch
18207,tower
5183,turban
18525,tusk
19281,weapon
687,antenna
1076,astronaut
1372,banister
1646,butt
2474,cabbage
4437,dancer
5286,doorway
6573,fillet
6716,fleece
391,head
9571,kettle
5284,knob
10397,lumberjack
10437,machinery
10617,mare
10935,microchip
11133,mockingbird
11183,monastery
11588,neighborhood
12415,panda
12850,pheasant
13833,puzzle
13908,quicksand
14501,reservoir
14648,rhinoceros
41,road
14837,rooster
775,sauce
17062,street
18127,toolbox
18537,twig
14609,veal
19073,volcano
19091,vomit
19519,windpipe
1581,beef
777,cable
2643,cardinal
4531,decal
16,dome
5375,drawstring
5552,earphone
5958,eraser
8432,hoop
9466,joystick
1296,mouth
4065,overalls
12485,park
12794,persimmon
13324,postman
13472,pretzel
13760,pulley
13973,radio
5458,rye
5023,scar
16862,steeple
1074,tray
19290,weasel
19422,whiskey
1345,ballot
2628,caramel
3226,clergyman
3339,cockatoo
3911,copperhead
4065,coveralls
4955,dingo
6795,fluid
6877,football
7247,garden
7409,giraffe
10169,liquor
10465,magma
8578,mane
12068,possum
13629,prong
2133,ranch
14603,rocket
15123,satellite
16008,skillet
16189,smokestack
18093,tomb
18396,trolley
19105,vulture
19159,wand
1106,atrium
1525,beaker
435,bin
1793,blackboard
3026,chinchilla
3043,chocolate
3650,condiment
3963,corridor
4074,cowboy
3448,fort
7268,gasoline
7292,gazelle
1271,hand
8270,highway
8406,honeycomb
145,ledge
10168,liquid
10979,mill
11377,mummy
12341,package
12614,pavement
2853,person
2598,pill
13342,pottery
13345,poultry
13883,quartz
14918,rudder
4765,script
16333,soldier
16424,soup
16763,stallion
3332,stone
17106,stripe
17282,sundial
18118,tonsil
18414,trout
18857,valley
265,van
19122,waist
19546,wire
19778,yeast
499,almond
1317,baker
1857,blister
2351,bulldog
2444,buttercup
2571,canine
2688,cartilage
861,chip
3235,cliff
3254,cloak
3932,corncob
3993,couch
5417,driver
6368,fan
6577,film
7360,gerbil
9353,jam
9615,kilt
9636,kingfisher
11529,navel
11727,noodle
12162,ostrich
765,pet
12917,pigeon
13243,pope
15394,seed
15596,shaft
16078,sleigh
16713,squid
17621,tattoo
18095,tombstone
18430,trunk
18833,uterus
19112,waffle
19393,whey
16,abdomen
911,army
1161,auditorium
1295,badminton
2016,boomerang
2141,brass
2542,campground
2958,cheese
2959,cheetah
2975,chess
2979,chestnut
3220,cleaver
6265,eyeglass
7423,glacier
7532,gong
9540,kayak
9869,lawyer
10013,letter
10212,livestock
10229,lobby
5680,magnet
10579,manhole
10635,market
527,meter
11850,nylon
5106,patch
13044,plaque
13386,preacher
13715,prune
2185,reed
14268,reef
14348,reindeer
14791,rodent
15063,salamander
15501,sergeant
15892,silk
16363,sombrero
16477,spaniel
16512,spearmint
16610,spleen
16700,squash
2129,storm
17753,termite
17957,ticket
18307,trash
18523,turtleneck
5077,washer
19420,whisker
436,album
449,alfalfa
1325,bald
2127,brain
3288,clover
5190,diver
5234,doctor
5490,dumbbell
2695,eel
7033,fur
7170,furnace
7246,garbage
10126,lily
411,mail
10773,measles
11126,moat
2968,moth
11416,mussel
11842,nutmeg
12703,pendulum
12837,petroleum
12949,pincushion
4104,ramp
14643,revolver
16236,sneaker
10357,speaker
16615,splint
493,star
17288,sunrise
683,tea
18009,timer
18589,ulcer
18846,vaccine
19181,warehouse
19449,wick
19765,yardstick
3,aardvark
416,airstrip
1323,balcony
6,band
1558,beaver
1731,bill
1772,bison
2268,broth
2447,buttermilk
2554,canal
2770,caulk
4108,crane
4330,curb
4366,cushion
5478,dugout
5528,dynamite
333,fire
6625,firecracker
6630,fireplace
8236,herring
9364,janitor
4663,liver
10217,lizard
11351,muffler
12085,optician
910,pit
12896,pocket
8815,prison
15102,sandal
15193,scarecrow
15891,silicon
17374,suspenders
6501,tile
18371,tricycle
18873,vanilla
19229,watchman
19403,whip
19562,wishbone
3,ark
546,ass
1390,bar
1474,bassoon
1499,battery
1976,bolt
2064,boulder
2300,buck
2326,buffet
3375,coleslaw
3447,comet
820,cot
4289,cub
4413,dachshund
5369,drawer
6676,flame
6759,flock
7550,gopher
2857,hall
8004,harpoon
9153,intercom
11170,mollusk
11409,musket
12549,passageway
12937,pilot
13513,printer
13745,puddle
13939,raccoon
1004,rag
15119,sash
15347,seasoning
15680,shepherd
16159,smack
16653,spout
16903,sticker
17833,thermos
18232,traffic
18980,video
19128,waiter
2462,buzzer
2907,coal
3532,compass
4280,crustacean
5334,dozen
6833,fog
1188,graph
7741,hog
8674,icing
412,lane
10564,manatee
11313,mouthpiece
11381,mural
12761,perfume
13037,plankton
6670,pole
13323,poster
14809,roller
14938,ruler
15684,shield
15907,silverware
16746,staircase
18182,toucan
18617,underclothes
18957,vessel
5216,visor
445,ale
2434,butcher
3453,comma
7481,glue
7510,goblet
7609,grandmother
1701,hut
8885,incubator
12878,physician
13848,quail
14769,robot
18714,university
18783,upholstery
9540,yak
1491,baton
2340,building
2766,cattle
3383,collar
4396,cylinder
5231,dock
5292,dormitory
2446,fly
7011,fowl
8496,hospital
1606,inn
9408,jester
9020,jury
9991,lens
3239,limb
10485,maid
10604,manure
11585,neighbor
13112,plug
13792,puppet
13936,rabbi
14754,roadrunner
15515,servant
15677,shelter
16143,slug
16675,sprout
8502,stage
17921,throne
5329,town
1490,tub
18908,vehicle
19416,whirlpool
19551,wiring
959,artichoke
1461,basin
2106,boxer
2436,butler
2539,camper
115,cord
4057,courtroom
4075,cowgirl
98,dent
5738,embroidery
6280,fabric
9454,journal
10626,marionette
11288,mound
11561,nectar
958,pod
13256,porcelain
14461,reporter
15340,searchlight
15342,seashore
2307,ski
5153,stem
16881,stereo
16977,stoop
17311,supper
17685,telegram
18912,vein
19224,wastebasket
838,aqueduct
2509,calendar
2658,cargo
2971,cherry
3396,college
4291,cube
4894,dictionary
6762,flood
7285,gauze
7987,hardware
8184,helicopter
9072,inspector
10634,marker
3939,meal
11710,nod
12911,pier
13089,pleat
4114,rash
2224,rim
15936,singer
16640,spool
17765,terrier
18588,ukulele
18923,venom
19148,wallpaper
644,animal
722,aorta
1235,awning
1706,bible
2085,bow
3353,cod
3934,corner
4120,crater
4304,cuff
4468,dashboard
5739,embryo
6821,flycatcher
7572,gown
7660,grease
4709,note
12196,outdoors
12407,pamphlet
12671,peel
3586,pound
13787,pup
14103,ravine
14768,robin
15172,scallop
15650,shears
16389,soot
18520,turret
223,urn
19608,wooden
2298,bubble
2448,butternut
2716,cassette
3378,collage
19939,fungi
20037,letterbox
10913,meteorite
2968,mother
11394,museum
14983,runway
15103,sandbar
15288,screen
6889,tool
19377,wharf
602,arch
1009,aspen
1421,barley
1602,beggar
2111,boyfriend
2585,cap
2843,certificate
3207,cleanser
3636,concrete
4226,croquet
4277,crust
6386,farm
6580,filter
6722,flesh
7159,fungus
7459,globe
7487,gnome
7625,graphics
7942,handwriting
8618,hurricane
617,iron
10107,lightning
10135,limestone
10383,lozenge
10553,mammal
11329,movie
11442,muzzle
12378,painting
12401,pallet
12729,pepper
12866,phonograph
13047,plaster
13416,pregnant
15858,sieve
5079,sill
16382,songbird
62,stain
2566,stick
17232,suds
17686,telegraph
18202,tourist
177,vat
20029,windscreen
4078,worker
902,chair
2853,chairperson
4285,crystal
5525,dye
5542,eardrum
319,fir
7627,graphite
10618,margarine
11016,mink
11222,monument
9177,planet
14204,receptacle
16056,slate
16959,stockyard
18964,veteran
182,actor
776,appliance
20056,babysitter
1426,barometer
29,board
2377,buoy
3978,costume
4058,courtyard
2878,deli
98,den
7970,harbor
8209,herb
8232,heroin
8286,hinge
8644,hyena
5840,land
10550,malt
10966,mildew
11200,monogram
12833,petal
12841,petunia
8093,quart
14009,rainbow
15126,satin
15338,seaport
15889,silhouette
16043,slacks
9798,spur
17150,stuffing
17279,sunburn
17306,supermarket
17339,surf
2566,tick
18514,turntable
2099,bowling
3921,corduroy
4623,frost
7394,gift
5845,grave
1853,ink
9404,jersey
9785,lapel
10297,longhorn
10395,lumber
3298,lump
747,parent
3547,pile
2231,rink
2544,site
15996,sketch
16250,snorkel
17657,tear
18303,trapdoor
18475,tumor
18832,utensil
2108,boxing
2544,campsite
342,can
2846,chain
187,cut
3695,fuse
7692,grid
9198,intestine
10660,marsupial
10936,microcomputer
13790,pupil
2131,ram
11902,server
1877,shed
17759,terrarium
18304,trapeze
10942,wave
183,actress
1504,battlefield
1511,bayou
2804,cellophane
3280,cloud
3321,coastline
3772,constable
3949,corral
6388,farmer
2201,groom
8164,hedge
9271,iris
1295,mint
11186,money
11263,mosque
12451,parade
12829,pesticide
3969,sage
15369,secretary
15590,shadow
16565,spice
17291,sunset
17344,surgeon
17438,swing
17477,synagogue
18931,veranda
19007,vinyl
17406,weep
19646,workshop
1137,attic
2091,bowel
10800,medication
11135,model
1510,net
15676,shellfish
17712,temple
18158,tornado
19797,yoga
4,abacus
977,asbestos
1141,attorney
1397,barb
1419,bark
1489,bathroom
2576,canopy
2612,capsule
2851,chairlift
3628,conch
3909,copper
4172,crest
4245,crowd
5503,dunk
6198,explosion
6416,father
7160,funnel
7528,golf
7541,heart
8241,hexagon
9491,jump
9799,larva
3231,lick
10871,merchandise
10874,mercury
9669,night
11731,noose
2448,nut
12376,painter
12843,pewter
12901,picture
4277,rust
15575,sewage
15902,silver
7554,sling
17589,tapestry
17646,teacher
17943,thundercloud
18357,triangle
19154,waltz
904,mist
329,afghan
965,artifact
1241,axle
2782,cavity
3041,chlorine
4165,crepe
4281,crutch
4888,diary
4958,dinner
6520,fiber
7230,game
7505,goalkeeper
7951,hangar
8360,holly
8390,homework
8639,hyacinth
9742,lagoon
9802,larynx
9804,laser
409,line
10322,loot
10428,lynx
10482,mahogany
11386,muscle
11468,naked
790,ointment
12254,overcoat
13343,pouch
13496,primate
13740,puck
15683,sheriff
16206,smudge
16659,spray
16850,steam
16918,stilt
5444,store
1879,stream
1116,tack
2824,tip
18920,vendor
44,abscess
955,artery
1803,bladder
1862,block
2132,bran
2312,bud
2511,calf
2707,cash
2924,chart
3428,column
4393,cyclone
5441,drug
6066,exam
6424,faucet
6438,fax
6838,foil
7016,foxhound
7711,grindstone
7875,hairy
7919,handball
1876,hound
9643,kiss
9996,lentil
10073,lifeboat
10651,marrow
10654,mars
11210,monsoon
11257,mortar
11832,nursery
258,ore
12474,parchment
12666,pedestal
13054,platform
13832,putty
1429,rack
40,ridge
7708,rind
15083,salute
15707,shipment
9768,slide
16097,slime
18215,trachea
18942,vermin
19016,violet
11374,vitamin
19473,wigwam
19596,wombat
19645,workplace
428,alarm
1268,backgammon
2261,bronze
3070,chow
9511,junkyard
9644,kit
7455,litter
13519,prism
14475,reptile
15807,shrine
17728,tendon
162,acrobat
8,ad
1574,bedrock
1193,bile
1758,birth
3329,cobalt
3899,coop
3972,cosmonaut
4480,dawn
5460,duchess
33,gin
8025,hatch
9718,label
9723,laboratory
10608,maple
11675,nightingale
12343,packet
813,prop
14591,retina
9428,saw
15576,sewer
15691,shilling
16380,song
16465,spade
16525,speck
17740,tentacle
19371,wet
2425,woman
19607,wooded
19769,yawn
1312,bait
1855,blinker
4140,crease
4421,dairy
5518,dwarf
7844,gypsy
9461,jowl
10529,makeup
6485,male
11815,nugget
12566,paste
12719,pentagon
13531,prize
13889,queen
2916,riot
15959,siren
8630,sky
16129,slot
16445,souvenir
16523,specimen
17285,sunlight
17879,thistle
18910,veil
496,almanac
573,ammonia
695,anthrax
1780,bite
2130,brake
2196,briar
2752,catcher
2798,cell
3113,circle
586,eat
7219,gallery
8460,horizon
12664,pedal
13057,platinum
13075,plaza
13503,prince
1878,shot
1002,sleep
1096,sphere
20013,swimming
18561,twister
18918,velvet
1018,assassin
1302,baggage
2171,breakfast
2266,brook
2269,brother
2936,chauffeur
3130,circus
3134,citizen
3279,clothing
6682,flannel
7234,gang
9616,kimono
1857,list
11888,oboe
12346,pad
12707,penicillin
12731,peppermint
12930,pilgrim
12961,pint
696,polo
8093,quarter
14214,recipe
14237,recorder
14280,referee
734,rod
15879,signature
17260,sulfur
17432,swim
17730,tennis
19611,woodwind
2024,booth
3286,clove
4297,cuckoo
11406,musician
12035,opal
13042,plantain
13260,pore
3766,solid
5877,tang
435,albino
1439,barrier
1495,batter
1872,blond
2670,carpenter
3176,clasp
4236,crossroad
4363,curve
5237,document
6561,file
8482,horseback
8609,hunter
9258,iodine
6095,item
9508,juniper
9590,kickoff
9673,knit
10065,lieutenant
10157,lining
10892,mesh
11002,mineral
11166,mole
11572,needlework
728,path
12667,pedestrian
413,port
13732,publication
16283,soapy
16616,splinter
16965,stomp
19309,wedge
408,aircraft
1832,bleed
3914,coral
5403,drill
5509,dust
7989,hardwood
10277,logo
10947,midget
622,mom
12919,pigment
13452,president
17128,stub
19246,waterway
19503,winch
19838,zinc
1853,blink
2276,brow
5346,dragon
8096,headstone
9340,jackal
11830,nurse
13772,punch
13880,quartet
15165,scale
19689,wrapper
1801,blacksmith
3969,corsage
4341,curl
4859,dew
6474,feline
7694,griddle
8127,hearth
8235,heron
10785,mechanic
12149,oriole
12609,patty
13339,potion
2266,rook
15070,salesperson
15799,shred
15822,shutter
16061,slave
6981,teller
9237,vertebrate
19705,wrestling
1291,badger
2631,caravan
3247,clip
3577,composer
5684,electronics
6800,fluoride
6886,footprint
1627,fry
7195,fuzz
1302,gag
7606,granddaughter
3026,inch
9111,insulin
20111,investigator
9801,laryngitis
12573,pastor
12713,pennant
12921,pigpen
13319,postage
4288,stall
17846,thief
18290,transmitter
3334,web
586,amphitheater
909,armory
2175,breath
3928,crew
4869,diagram
4540,ember
6668,fjord
6673,flake
8593,hump
8736,illustration
10994,mincemeat
13140,poet
13846,quadruplet
16210,snack
16729,staff
16752,stalagmite
18388,triplet
18513,turnstile
18926,ventricle
18650,world
421,aisle
2535,camp
3622,concert
3655,condominium
5757,emperor
7226,gallows
10353,lotus
10751,meadowlark
11197,monk
5077,wash
19496,willow
1902,blowhole
3826,continent
4572,decoy
8245,hickory
9766,landscape
540,mate
10942,microwave
12467,parasite
12550,passenger
14504,residence
14838,root
290,sing
16787,staple
17039,strangle
17345,surgery
17941,thunder
12469,troop
19424,whisper
960,article
2174,breastbone
2690,cartoon
2806,cellulose
3084,chromium
3991,cottonwood
4357,cursor
4917,dig
6506,festival
7400,gill
7808,gully
9109,insulation
9587,kick
9938,leech
10088,ligament
11122,mixer
13197,politician
13325,postmark
13726,psychologist
7759,rub
7005,square
19959,thrown
19233,watercolor
19419,whisk
19466,widow
19702,wrestle
1199,avalanche
1259,bachelor
3190,classmate
3886,cook
68,dance
5364,drapery
6825,foal
7447,glider
7634,grassy
7864,hail
9476,judo
10920,methane
11334,mow
11346,muddy
19877,ophthalmologist
13761,pullover
14014,rainy
15143,savanna
15285,scream
16225,snapdragon
16302,socket
16819,station
17547,talc
18322,treasure
18571,writer
511,alphabet
968,artillery
546,bass
2606,capitol
2852,chairman
3457,commander
3775,constellation
4047,court
7253,gargle
7722,grocery
7823,gurgle
8243,hiccup
8329,hockey
1878,hot
10402,lunch
10499,mainland
10872,merchant
11399,music
12211,outlet
13769,pump
14765,robber
14779,rocker
2287,run
857,shop
13948,track
12230,trigger
1088,athlete
1327,bale
2374,bunk
2416,bushel
1627,elf
5730,emblem
6445,feast
6597,finch
6648,fishing
7025,frame
7135,fuel
7612,grandson
7712,grip
19875,investor
6685,jack
9374,jaundice
5528,mite
12861,phoenix
13129,plutonium
739,post
13762,pulp
15899,silo
16714,squint
16926,stinger
17041,trap
19453,wicker
19714,wrinkle
76,academy
491,alloy
771,applause
1154,audience
2028,border
1304,dad
4452,dark
4550,decimal
4893,dictator
7077,freshwater
7264,gas
8226,hermit
8571,hull
11848,nutshell
12837,petrol
16040,slab
16795,starch
16826,stationery
2737,tap
18805,uranium
19385,wheeze
546,ambassador
4656,delicatessen
5847,engraving
7293,gear
9015,inject
9796,lark
1828,leak
11812,nude
3900,opera
17113,troll
2205,bridle
4123,crawl
9105,instrument
19922,karaoke
10924,metronome
12867,phosphorus
13162,poison
15953,sinus
1179,author
1878,bloodshot
2994,chief
3658,conductor
3965,corrosion
5354,drake
6375,fang
331,field
6753,flipper
7605,grandchild
7854,hacienda
9104,instructor
1343,loon
10312,loop
10715,material
12419,panel
13748,pueblo
2119,racket
17310,supervisor
17340,surface
17842,thicket
968,tiller
144,acid
675,antacid
763,appendix
2057,bottom
3223,clench
4348,currency
4155,editor
7413,girlfriend
7846,gyroscope
7934,handmade
8558,huckleberry
10436,machine
10624,marine
11439,mutton
12925,pike
16264,snowy
16486,spark
19040,visitor
623,anemone
971,artist
2534,camouflage
2930,chasm
2963,chemist
3245,clinic
3644,condensation
4221,crop
4415,daddy
145,edge
9679,knock
485,liter
10487,maiden
13739,publisher
14878,roundhouse
15231,scientist
15496,sequin
18604,uncle
19679,wound
2224,brim
4061,cover
4401,cyst
4994,dirty
5904,entrance
6362,family
7321,generator
11765,notch
13334,potassium
15643,shave
15761,shortstop
2371,bundle
2635,carbon
4963,dip
5736,embroider
1715,icy
9838,laughter
229,minister
12353,paddock
12239,poke
13515,printing
14755,roadside
18173,tot
18847,vacuum
18571,write
1314,bake
857,bishop
436,bum
3138,citrus
3318,coast
4485,daybreak
4812,detective
4972,dipper
5674,electrician
5778,enamel
7906,hamper
8233,heroine
414,hip
8560,huddle
9836,laugh
458,light
10464,magician
1762,mark
11788,novel
12061,operator
12411,panama
13818,push
15014,saber
15813,shrug
16276,soak
16308,sodium
16479,spank
16648,spot
11095,stake
17271,summit
17293,sunshine
17297,superintendent
17473,symphony
18478,tundra
18628,underpass
1962,boil
3273,clot
3838,contractor
10670,mascot
10677,mason
11219,month
11430,mutant
10357,peak
13172,poker
13728,pterodactyl
17286,sunny
19293,weave
249,adobe
1264,backbone
1484,bathe
2147,brazil
2614,captain
81,cent
3891,cooking
4332,curd
7472,glossary
7809,gulp
10352,lottery
10934,microbe
13393,precipitate
8825,pulse
16863,steer
10212,stock
3807,template
17784,tetanus
160,acre
2884,channel
4362,curtsy
10384,lubricate
10689,massage
12246,ovary
16471,spam
16589,spiral
18866,vampire
19334,weld
724,art
1167,aunt
2665,carnivore
4013,counter
4023,country
1572,drag
5592,eclipse
5892,entertainer
6459,feed
6667,fixture
2465,product
13979,radium
15777,shout
16240,sniff
709,ton
18540,twin
19199,warrior
3166,clap
10937,organism
12655,peck
5870,roll
15280,scratch
2466,stand
18415,trowel
19436,whittle
3468,commentator
3708,congregation
3834,contract
7269,gasp
9848,laurel
9866,lawmaker
13064,player
13271,porter
13328,postscript
14602,retriever
15234,scoop
15272,scrap
15276,scrape
15852,sidestep
6022,vapor
19171,warbler
1279,bacteria
1427,baron
1625,belch
1827,bleacher
3482,committee
4403,czar
5523,dwelling
6002,etching
6406,fasten
7123,froth
5840,gland
8001,harness
8093,headquarters
9192,intersection
9538,karate
9611,kilogram
10563,manager
10706,match
11180,monarch
11527,naval
11738,north
10699,piece
5324,pour
14269,reel
949,son
16643,spore
16690,spy
18361,tribe
2823,centimeter
1736,fold
13741,pucker
19064,voice
8536,wife
1437,barrette
1755,birch
3309,coach
620,dot
6538,fiesta
7742,group
5547,muff
15896,silky
18277,transistor
18888,varnish
237,admiral
309,air
1151,burn
2743,catch
3085,chromosome
3239,climb
107,company
3878,convict
3940,cornucopia
5081,disinfectant
5994,estate
6334,fairy
2657,fare
6959,formula
7085,fried
7690,grey
8214,herd
586,hit
8628,husband
8651,hyphen
9335,jab
9667,knickknack
2389,lap
10554,mammoth
3090,mum
13156,pointer
13522,prisoner
15303,scroll
15563,settler
3764,sole
16394,soprano
16629,spokesman
17596,target
18407,trot
18538,twilight
18723,unlock
96,accessory
2599,capital
4487,daylight
5764,employee
6187,explode
19864,fastener
7020,fragment
8014,hash
8537,housework
8615,hurl
8954,infection
424,kin
3891,king
9882,lead
10001,leprosy
10186,literature
11665,nicotine
11717,nomad
12691,pelt
12871,photography
14694,rigging
15224,schoolwork
15295,scribble
15577,sex
16103,slip
16216,snap
16797,stare
17030,strand
1274,stroke
17670,technician
17968,tide
18489,turf
19755,yank
569,amethyst
4104,cramp
7720,groan
15313,sculptor
1961,bog
3414,color
7124,frown
5850,gulf
8211,herbivore
9026,inlet
13502,primrose
14514,resin
15241,scorch
16321,software
18012,timetable
19244,watershed
1048,assistant
427,baste
2178,breathe
2184,breeches
2503,calcium
3042,chlorophyll
4149,creature
4494,dead
5717,embankment
4617,flat
335,float
8255,hieroglyphic
8387,homestead
8851,incision
9613,kilometer
557,lance
9984,length
11158,moisture
11592,neon
12461,parallelogram
14093,rattle
14378,relic
7938,shake
15801,shrew
16018,skip
16530,spectator
16573,spill
16755,talk
18313,traveler
18620,underground
18645,undertaker
4237,walk
19417,whirlwind
1861,blob
19891,aquifer
1341,ballet
1879,bloodstream
2491,caffeine
2681,carry
2829,ceramic
2948,checker
3001,childbirth
3305,cluster
3393,collection
3445,comedian
3964,corrode
4033,county
4170,crescent
4265,crumble
4988,director
5788,enclosure
6001,etch
6197,explorer
1593,fall
6927,forge
8067,haze
8088,headline
8647,hymn
8709,ignite
8842,incense
9481,juggle
10305,lookout
11414,muslin
11483,narcotic
12152,ornament
12156,orphan
814,oval
12665,peddle
19879,performer
13215,polyp
4127,rayon
885,rise
4764,scribe
15372,secrete
15480,sentry
15779,shove
9963,slat
16156,slush
16190,smoky
5105,sow
12300,throw
16918,tilt
19728,written
1849,blind
2249,broil
3065,chorus
3225,clergy
4876,diameter
5187,dive
6219,expressway
7021,fragrance
7888,halo
9497,jumper
10614,march
10905,metallic
11012,mining
8833,nap
11549,nebula
12198,outfield
12613,pave
12846,pharmacist
13139,poem
13452,resident
17120,structure
18542,twine
778,applicant
850,arbor
1187,auto
1502,battle
1587,beep
1747,bingo
2518,call
3038,chirp
3298,clump
3397,collide
3451,comic
164,cry
4470,database
5477,dug
5481,duke
6040,evergreen
6117,executive
6680,flank
7517,godparent
4869,gram
8010,harvest
8336,hoist
8963,infield
9020,injury
9293,irrigation
10048,license
5091,lodge
10688,massacre
3445,median
10973,military
10975,militia
10993,mince
11156,moist
11250,morocco
579,mount
12034,ooze
12529,partridge
12990,pitch
13108,pluck
13120,plume
13121,plump
13209,pollinate
13433,prescription
14319,regiment
15262,scout
15384,sediment
15718,shock
15962,sister
9301,slam
16329,solar
1013,spire
17132,stud
17413,sweet
17837,thick
18178,totem
18284,transmission
18968,vibrate
294,vise
19226,wasteland
19531,wingspan
19544,wipe
19711,wring
1547,beat
2339,builder
959,choke
3326,coating
3793,consultant
4536,deceased
4843,device
5562,earthquake
5985,essay
6749,flip
7708,grind
10844,membrane
10897,message
11979,ogre
13754,pull
14307,refugee
252,scent
15412,seize
11974,shoot
15784,show
15803,shriek
17168,stutter
17390,swarm
8938,trio
1526,beam
1580,beech
1710,bibliography
2235,bristle
3127,circumference
3386,collard
3862,convent
3923,core
4867,diagonal
5352,drainage
6301,faculty
704,freeze
7176,furry
8281,hind
8611,hunting
8813,imprint
9485,juicy
10247,lockjaw
10836,melt
12456,paragraph
12827,pest
13395,precipitation
2268,rot
15473,sensor
15640,shatter
16617,split
17000,stormy
17228,suction
5877,tangle
18166,toss
16823,stationary
16115,slippery
12307,weight
860,archery
1152,auction
2388,burial
2401,burnt
2663,carnation
2004,case
3785,constrictor
4036,couple
4183,cried
4885,diaphragm
5437,drown
5494,dump
6067,examination
6114,execution
3564,exit
6867,font
7446,glide
7895,halves
9193,interstate
11152,module
11534,navy
11743,northeastern
11977,offspring
12195,outdoor
743,pal
13005,pixel
14217,recite
14765,robbery
943,row
15082,salty
15200,scavenger
11889,scene
2774,sew
11413,slim
16179,smelt
19929,smiley
16718,squirt
1135,test
1194,top
4828,trim
19120,wail
19248,watery
19471,wiggle
5524,wind
135,ace
2217,bright
2347,bulge
2244,cast
1761,day
6777,flounder
7223,gallon
7242,gap
12606,pattern
12842,pew
14459,report
17628,taut
17930,thrush
18450,tsar
19038,visit
19308,wedding
12622,payment
13485,prick
859,archer
1816,blast
2891,chap
3710,congress
3912,copy
102,date
5675,electricity
6739,flight
7851,habitat
2937,heap
8299,historian
9387,jazz
9601,kill
9622,kindergarten
9866,maker
10894,mess
12619,pawn
13652,property
16227,snare
16385,sonnet
3278,spin
211,address
3405,colonel
3357,fee
7361,germ
9659,knead
9888,leader
2851,lift
10899,messenger
11598,nerve
12426,pansy
12531,party
13297,posse
13486,prickly
14134,reader
14548,respiration
16773,stampede
17381,swallow
17481,tax
18228,trader
18298,transportation
18345,tremor
17154,tumble
290,advertising
740,apostrophe
1660,bend
532,ether
9509,junk
9683,knocker
11037,minuteman
11824,numeral
11902,observer
4788,pair
13983,raffle
14890,route
15716,shiver
15913,simmer
16121,sliver
16310,soft
18189,touchdown
357,agency
6120,exercise
9758,landing
4668,livery
4962,oxide
14325,register
14865,rotten
1042,assignment
1447,base
2066,bounce
2560,cancer
2961,chemical
3440,combustion
3542,competition
3672,conference
3764,console
3799,contact
4585,deed
5410,drive
6702,flatten
6793,fluffy
7486,gnaw
7759,grub
8172,height
8261,highland
8533,household
9017,injection
9173,intern
3198,lay
10498,mainframe
11434,mutilate
658,ounce
14215,recital
15300,scripture
15633,sharp
15876,signal
16233,snatch
16678,spruce
1880,thirsty
18183,touch
9562,tuck
19523,windy
19621,woolen
19779,yell
2817,center
3178,class
3368,cold
4457,darkness
5296,dose
5943,equator
1165,gust
8739,image
11706,nobleman
14035,ramrod
15696,shine
16082,slice
17389,swap
16904,tickle
18465,tuft
18713,universe
6632,fireside
9000,ingredient
9375,jaundiced
10642,maroon
12431,pantomime
14863,rotor
15614,shale
16431,south
16846,steal
18871,vane
19302,webbed
19539,winter
186,acupuncture
1388,baptize
1830,bleat
1877,bloodshed
2700,cascade
3116,circuit
4300,cuddle
4862,diabetes
5965,erosion
7158,funeral
7432,glare
7785,guest
8084,headfirst
8254,hideout
8551,howl
9597,kidnap
10394,lullaby
11741,northeast
12561,password
13131,pneumonia
13925,quiver
2042,rough
2180,thin
18629,undersea
42,up
19291,weather
628,angel
2867,champion
3092,chuck
4210,croak
4376,customer
7383,ghetto
8325,hobble
9232,inventor
11117,mix
11379,munch
11389,muscular
12885,pick
756,ran
16671,sprinkle
16715,squirm
17200,subtract
18732,unpack
427,alabaster
1234,awl
2564,candidate
4271,crunchy
4431,damp
5765,employer
6771,floppy
7894,halve
8038,haul
8607,hunt
12045,opener
12484,parish
20050,researcher
15446,senate
1801,smith
16195,smooth
769,applaud
3408,colonist
6792,fluff
6835,foggy
857,hop
11192,mongrel
3491,motion
12545,passage
793,raise
16434,southeast
17802,thaw
19098,vowel
1026,assembly
1738,billion
3120,circular
3508,commute
4219,crooked
5475,duel
5510,dusty
5694,elevation
5956,erase
6671,flail
7076,freshman
7587,graduation
7727,groove
586,heat
3098,hunk
8988,influenza
9932,lecture
11123,mixture
11673,nightfall
12047,opening
416,rip
15414,seizure
15859,sift
16170,smash
16850,team
5909,treat
18562,twitch
18631,underside
19002,villain
15575,wage
12307,weigh
745,apparatus
3203,cleaner
3291,club
3422,colorful
4192,cripple
4261,cruiser
4778,designer
6798,fluorescent
7728,grope
7941,handspring
10673,mash
12516,particle
13244,poplar
13275,portion
13657,prophet
3749,serve
289,advertisement
578,amoeba
582,amphibian
3412,colony
3700,congeal
5451,dry
9385,jay
13721,psalm
14867,rouge
3772,stable
575,unit
1236,awoke
4450,daredevil
4512,dealer
7972,hard
9626,kindling
9634,kingdom
6672,lair
8722,legible
12490,parliament
13263,porous
5979,skim
16859,steep
1071,stir
17037,stranger
17204,suburb
19806,youngster
705,antique
1494,battalion
2418,bushy
2685,carsick
3514,companion
4696,demonstration
20097,dining
5388,drench
7171,furnish
9469,judge
9967,legislator
13211,pollution
14923,ruffle
16709,squeeze
16764,stamen
416,strip
17154,stumble
18483,tunic
862,architect
9,ate
1893,blow
2805,celluloid
4346,currant
5923,environment
5959,erect
6200,explosive
6320,faint
6997,foundation
7858,hacker
8347,holder
9349,jagged
9402,jerky
9623,kindle
12197,outer
13778,punctuation
7846,scope
706,septic
17240,suffocate
1799,blackout
2426,bust
4518,death
5661,elastic
7929,handicraft
11908,obstruction
12390,palate
301,aerobics
869,area
3787,construction
6504,fertilize
7398,giggle
8139,heather
8763,immigrant
10225,loan
10945,midday
11211,monster
11403,musical
11650,nibble
12522,partition
12602,patron
13747,pudgy
3964,rode
15639,sharpen
16633,spongy
16931,stink
17016,straighten
17278,sunbathe
17406,sweep
5444,tore
1070,asthma
2154,break
2335,build
5324,downpour
5434,drove
6731,flick
9081,installation
10475,magnify
10833,melody
17707,temperature
416,trip
343,afternoon
1836,blend
4190,crinkle
5093,dismantle
5971,erupt
6039,everglade
7799,guinea
2879,hang
9839,launch
3222,left
10087,liftoff
486,lot
10868,mentor
10937,microorganism
2148,reach
14531,sound
10357,speak
17142,study
4195,crisp
4668,delivery
20113,manufacturer
11068,misprint
11375,mumble
14303,refrigerate
478,allergy
1945,bob
5427,droop
5665,elderly
1618,hold
9386,jaywalk
10514,majorette
11918,occupation
13073,plaything
14128,reactor
14240,recording
506,side
16119,slit
1577,spread
15761,stop
19370,westward
19530,winged
296,adviser
390,agriculture
808,apprentice
914,aroma
1023,assemble
1999,bony
2181,breathless
2405,burrow
3379,collapse
4968,diplomat
6689,flash
6714,flee
8140,heave
10192,little
10453,mademoiselle
10565,mandarin
10789,mechanism
11300,mountainous
15318,scurry
15884,silent
16285,soar
16440,southerner
17055,streak
7115,tier
18310,travel
1160,audition
551,big
2012,boom
4826,detour
4923,digestion
7215,galaxy
7928,handicapped
7541,hear
8563,hue
11871,object
12326,oxygen
13346,pounce
13681,protein
14199,receiver
18213,trace
1091,athletics
1991,bondage
4333,curdle
5942,equation
6048,evidence
324,flu
375,glow
9224,invasion
9246,invitation
11193,monitor
16692,squad
584,amphibious
2966,chemistry
1715,cycle
4405,echo
8930,indoor
19858,internet
10391,lukewarm
13253,population
13402,predator
14912,rubbish
2295,rut
17269,summer
17386,swam
18145,topography
19468,width
550,ambidextrous
4288,crystallize
4927,digital
4956,dingy
5035,disco
5686,element
7385,host
8705,idol
9436,jog
10219,load
6293,mile
11324,movement
13482,price
16554,spelling
344,war
19708,wriggle
1988,bond
2190,breeze
3884,convulsion
4138,creamy
5914,entry
6289,facial
7685,greeting
8271,highwayman
9190,intersect
2663,nation
12036,opaque
13602,project
5106,spat
16539,speed
16584,spinal
16907,stiff
17073,stretch
17418,sweeten
18688,unicorn
361,agent
1303,baggy
3400,collision
4132,creak
6679,flammable
8623,hurt
11382,murder
12210,outlaw
12215,outline
13479,prey
15744,short
17239,suffix
18278,transit
18341,tremble
17398,wear
8296,hiss
9744,laid
12274,overhead
15112,sanitation
6219,sway
17453,swollen
18780,uphill
19243,waterproof
19585,wobble
395,aide
607,anatomy
908,armored
2634,carbohydrate
3243,cling
3424,coloring
4801,destroyer
5123,dispose
6270,eyesight
6733,flicker
6745,flinch
1229,full
7307,gene
8554,hub
8630,husky
10900,messy
11749,northwest
11886,oblong
2114,race
5384,rear
15709,shipping
16905,sticky
17901,thrash
18386,triple
18622,undergrowth
18789,upright
18975,victim
19109,waddle
6291,facility
7148,fume
7863,haiku
7901,hamlet
8199,hemisphere
11852,nymph
1239,axis
2611,capsize
2832,ceremony
3531,compartment
3797,consumer
6850,folk
7340,gentleman
8357,holler
8911,indigestion
9639,kink
9912,leapt
465,live
3445,media
11220,monthly
11398,mushy
11584,neigh
12307,overweight
1188,rap
932,ray
15438,seller
15475,sentence
16017,skinny
9105,strum
2309,toot
2240,brittle
3014,chilly
4320,cumulus
5670,electric
5972,eruption
6240,extract
6725,fleshy
10401,lunar
11715,noisy
12810,personnel
515,read
16079,slender
16132,slouch
10391,warm
19239,waterlogged
19434,whiten
6924,word
3208,clear
3256,clobber
4199,critic
5615,edible
6706,flavor
8728,illuminate
8765,migration
15197,scatter
3727,conqueror
4397,cylindrical
4837,developer
6467,feeler
319,firm
7213,gait
8568,huge
8725,illness
10725,matter
11209,monsieur
12596,patriarch
305,space
1100,toll
1220,ware
3836,contraction
3894,cool
4569,decoration
4761,descendant
6583,filthy
9292,irrigate
12524,partner
1914,bluegrass
2258,bronchitis
3505,community
3822,contest
4492,deacon
2168,down
6132,exhibition
6924,foreword
7453,glisten
7574,grab
7656,graze
7689,grew
7935,handout
9876,layer
20114,manufacturing
11544,nearsighted
11713,noise
12070,opponent
12462,paralysis
12744,percussion
14672,riches
16053,slash
16269,snuggle
16436,southeastern
4829,state
17620,tattletale
17841,thicken
415,airsick
631,angle
2369,bunch
2464,bypass
3236,climate
3276,clothe
7892,halter
8689,identical
9505,junior
561,mend
5778,name
11724,nonfiction
11844,nutrient
11917,occupant
12136,oriental
12367,pain
12704,penetrate
13451,presidency
14184,rebuild
8268,rung
15216,scholar
15443,seminary
16755,stalk
17889,thoroughfare
18841,vacant
19840,zip
77,accelerate
252,adolescent
698,antibody
1753,biology
2950,checkup
408,craft
4187,criminal
4647,delete
5450,drunk
5679,electrode
5877,entangle
5991,establishment
7473,glossy
8585,humid
9019,injure
9228,invention
10427,lymph
10849,memorandum
11157,moisten
11809,nucleus
11903,obstacle
718,place
13750,puff
14370,relay
747,rent
14469,reproduce
162,rob
15132,saturate
15211,schedule
12560,sport
16753,stale
16808,starve
19029,virus
19315,week
19374,whack
2794,celebration
6237,extinguish
7145,fumble
9988,lengthen
7453,listen
12773,periodical
14455,replacement
16991,storage
3162,clan
4689,demolish
4945,dimmer
4998,disability
2352,doze
6389,farming
6788,flown
7705,grimace
8256,high
8462,horizontal
8675,icon
3388,league
10940,microscopic
11365,multiplication
5775,nab
7098,rigid
15500,serf
17119,struck
8409,suck
19044,vista
1216,awaken
5062,disease
6088,excerpt
8375,homeland
9452,jostle
10150,linear
3914,oral
14859,rotate
15057,saint
15618,shallow
15837,sickness
16393,sophomore
16527,spectacle
836,aquatic
2527,calorie
11248,morning
11407,musk
3900,operation
13976,radioactivity
14417,remote
14640,revolve
7769,runt
20011,shopping
17196,substance
11708,turn
18674,unfasten
10953,west
1794,blacken
34,bound
2896,chapter
3493,communicate
5771,empty
6396,fashion
8898,index
1196,liar
12262,overdress
12781,permit
13587,program
13966,radiation
15319,scurvy
16958,stocky
5183,urban
14632,volt
417,airtight
1641,bellow
5000,disable
6512,fetch
6631,fireproof
11512,naturalist
13639,proofread
13829,putter
14301,refreshment
15178,scamper
18613,uncover
156,acquaintance
732,apex
1020,assault
1275,backward
1387,baptism
2080,bounty
3439,combine
3794,consume
4450,devil
8980,inflexible
9235,invert
9710,krypton
11642,news
11696,nitrogen
11707,noblewoman
12463,paralyze
13018,plague
14644,reward
15037,safe
1037,set
11109,stood
17770,territory
779,application
1744,bind
3055,cholesterol
4567,decorate
6811,flutter
7352,geometric
8692,identification
10468,magnetic
412,plan
15406,segment
1206,aviation
1188,biography
3500,communion
4307,culprit
5673,electrical
8569,hulk
788,point
13329,posture
17185,submerge
5210,vision
19190,warmth
2183,bred
4587,deep
5734,embrace
5859,enlargement
6172,experiment
7100,fringe
7233,gander
7825,gush
8054,haven
8642,hydroelectric
12512,participant
13132,poach
15243,score
15584,shade
15819,shut
16803,starter
3500,union
529,alto
5693,elevate
5966,errand
7508,gobble
8155,heavy
8711,ignition
9102,instruction
5857,large
11105,misty
12675,peep
13384,preach
16534,speech
17843,thickness
17311,upper
18845,vaccinate
2379,buoyant
3563,complexion
3791,consul
4708,denominator
6149,expand
6594,finance
7980,harden
8972,inflammation
9196,interview
10495,maim
12872,photosynthesis
13898,question
3961,respondent
4288,tall
18364,trick
2457,buy
3959,correspondence
7022,fragrant
8815,imprison
10845,memento
12472,parch
4122,raw
10453,sell
15659,sheer
110,accomplice
606,atom
3389,collect
5974,escape
8973,inflate
9118,intake
9690,knotty
375,low
10577,mangle
15510,sermon
1110,attach
5175,distribution
5749,emission
6902,forefather
7716,grit
8272,hijack
8463,hormone
9098,institution
12754,perforate
492,pose
14814,roman
15703,shiny
15882,silence
17367,survivor
17799,thanksgiving
17986,tighten
5521,well
178,active
3148,civilization
4690,demon
5271,donation
6567,fill
6911,foreigner
8643,hydrogen
11042,mirage
11921,occupy
12585,patent
13933,quote
14343,rehearse
14437,repair
14600,retrieve
15344,season
11093,spell
16817,static
5902,title
19331,weightless
19543,wintry
658,announce
2296,brute
3206,cleanse
1401,cue
4636,dehydrate
8106,healthy
8598,hung
8734,illustrate
9068,inspect
9529,juvenile
10821,meeting
11936,octave
12768,period
12784,perpendicular
735,poll
13415,prefix
13558,produce
14054,ransom
14732,ripen
16567,spicy
18287,transmit
2813,census
4455,darken
4725,department
5682,electronic
6017,evacuate
3697,fusion
9089,instep
10852,memorize
11819,number
14731,ripe
15358,second
8303,story
18251,training
18568,type
49,absentee
19868,agricultural
2136,brand
3467,comment
3578,composite
5028,disciple
5177,district
5331,dowry
5934,epilepsy
6022,evaporate
6797,flung
8498,hospitalize
8939,industry
11093,misspell
724,part
14291,reflection
14652,rhyme
14836,roost
16786,stanza
17219,successor
17600,tarnish
17931,thrust
19862,abolitionist
152,acoustic
1729,bilingual
19913,bioluminescence
2419,business
4247,crowded
4621,deform
4150,edit
7098,frigid
7442,gleam
7776,guardian
9219,invade
11355,muggy
13381,prayer
15693,shimmer
16137,slow
16322,soggy
12239,spoken
16634,sponsor
19319,weekly
19809,youth
101,aim
422,ajar
1195,autumn
552,bit
2524,callus
2768,caught
4504,deaf
6515,fever
11169,molecule
13931,quotation
3969,sag
15938,single
16799,tart
19369,westerner
81,accent
98,accident
1269,background
3646,condense
5108,dispense
6031,evening
6755,flirt
6854,follow
9399,jerk
10779,measurement
11363,multiple
13738,publish
14169,rearrange
16098,slimy
17322,supporter
17460,syllable
621,anemia
3316,coarse
3538,compensation
4432,dampen
7332,genie
1606,inning
10805,meditate
11317,move
910,pi
13554,proclamation
14549,respiratory
16442,southwest
16444,southwestern
17100,stringed
18406,tropical
1902,whole
10108,year
609,ancestor
1380,bankrupt
2348,bulk
3470,commercial
3833,contour
5964,erode
9269,iridescent
10320,loosen
3508,mute
12222,outpatient
14372,release
9192,section
17162,stunt
17674,technology
19220,waste
1153,audible
2869,championship
3546,competitor
3780,constitution
4353,curriculum
6422,fatten
6951,formation
8040,haunch
8161,heckle
13354,pout
16753,tale
18583,ugly
60,absorption
739,apostle
939,arrive
5496,dunce
4640,eject
5750,emit
6972,fortification
10990,mimic
12775,perish
924,range
14608,reunion
16161,small
16920,stimulate
17192,subscription
17963,ticklish
2621,capture
3767,consonant
4670,delta
4802,destruction
19860,disabled
5138,dissect
5303,doubleheader
5472,due
5617,edition
8180,heir
4077,hide
8640,hybrid
10690,massive
10883,meridian
11349,muffle
11438,mutter
11747,northerner
20064,possessor
13379,pray
13551,procession
13623,promotion
13682,protest
14179,rebate
1678,see
6270,sight
7358,thermal
18420,trudge
18545,twinkle
18720,unload
9196,view
19194,warning
19463,widen
2153,winner
1435,barren
4429,damage
4591,deepen
5949,equinox
7623,graphic
8596,hundred
11172,molten
11617,network
12394,paleontology
6187,plod
13477,preview
16559,spew
19628,wordy
3601,conceal
3639,concussion
5576,easterner
6293,facsimile
6412,fatal
3664,fed
6744,flimsy
6870,fool
7329,genetics
7385,ghost
7598,grammar
9079,install
9205,intravenous
9432,job
11385,murmur
20035,nappy
12153,ornate
12296,oversleep
19893,reappear
6632,reside
16613,splice
17475,symptom
18903,veer
4520,debate
4757,descend
6047,evict
6513,feud
7154,fund
9151,intercept
10316,loose
11485,narrative
13175,polar
13845,quadruple
15343,seasick
1681,siege
18292,transparent
19317,weekday
556,amble
885,arise
1122,attend
5059,discuss
5146,distance
5669,election
5857,enlarge
6726,flew
7227,gamble
8542,hover
10786,mechanical
11004,mingle
11315,movable
13801,puritan
14450,repetition
14489,rescue
2180,thing
19775,yearly
4350,current
12459,parallel
13605,projection
18413,user
19803,young
656,anniversary
724,apart
1055,assorted
1713,bicker
2926,charter
4419,daily
4891,dictate
5142,dissolve
5336,draft
6860,follower
11098,mister
0,noun
15305,scruff
16447,soviet
17643,teach
18283,translucent
19883,acrobatic
451,algebra
465,alive
2320,budget
4308,cultivate
3646,dense
4854,devour
201,end
6421,fatigue
6713,fled
8805,impostor
9963,legislation
7352,metric
10949,midnight
13102,plot
13975,radioactive
14161,reap
14421,remove
14494,reservation
14857,rotary
14899,royal
15284,scrawny
11079,shape
5074,shone
11091,sour
16639,spook
8097,strong
17179,subject
17966,tidal
18844,vacation
19274,weakling
7886,wee
513,alphabetize
753,appear
3691,confiscate
4311,cultivation
6167,expensive
217,here
11638,newcomer
11746,northern
1202,rage
14628,revive
2611,size
17147,stuff
9203,toxic
18227,trademark
154,acoustics
1385,banshee
4617,deflate
4663,deliver
7523,golden
8971,inflammable
9070,inspection
9777,lanky
10398,luminous
13403,predecessor
14980,runny
57,absorb
1749,biodegradable
1751,biological
4506,deafen
4745,depth
5574,eastern
5823,energy
20019,fitness
7348,geography
7378,getaway
8292,hire
8645,hygiene
456,lie
10699,masterpiece
10909,metamorphosis
305,pace
13122,plunder
13444,presentation
14400,remainder
14592,retire
14614,revenue
14901,royalty
15753,shorten
15870,sightseeing
16064,slavery
17462,symbol
4798,tiny
19859,upload
1214,wake
17404,wed
59,absorbent
508,aloud
511,bet
2044,borrow
2406,burst
2592,capacity
3579,composition
3806,contaminate
4934,dilute
5102,disorder
7017,fraction
7855,hack
8066,hazardous
8519,hour
9007,inheritance
11817,numb
13700,province
14657,rhythmic
5248,self
3740,sequence
4779,sir
16200,smother
17479,synonym
19013,violent
9614,watt
19852,zoom
7347,genus
464,alimony
856,archaeology
100,dental
4800,destroy
5373,drawl
3377,labor
11383,murky
1685,stow
17900,thousand
18225,trade
18756,untangle
5209,visible
14,abbreviation
73,abyss
490,allowance
512,alphabetical
520,alter
606,anatomical
642,angular
693,anthology
937,arrival
1126,attendance
1162,auditory
1924,blunt
2283,browse
2756,cater
694,cite
3199,clean
3684,confine
3784,constrict
4616,definition
4645,delegate
1154,die
5019,disaster
5061,discussion
262,drift
5459,dual
6252,extremity
308,fable
6526,fidget
1597,friend
7094,frighten
7880,halfway
2970,hero
8321,hoarse
8861,income
8892,indent
9413,jettison
1836,lend
10236,locality
10507,maintenance
10602,manufacture
10799,medical
10824,megabyte
10840,member
11429,musty
11763,notation
11826,numerical
12756,perform
13320,postal
13463,pressure
13579,profit
14057,rapid
14180,rebel
14211,recess
14655,rhythm
546,sad
15233,scold
15356,secluded
15439,semester
15560,settlement
20075,softly
9314,sue
527,time
1105,tone
18335,treaty
6243,trial
18665,uneven
19011,violence
19083,volume
19847,zodiac
12328,zone
7501,goal
2655,take
1001,askew
1113,attachment
1165,august
1860,bloat
2077,boundary
2390,burly
3472,commission
3510,compact
3704,congratulate
3792,consult
4169,crescendo
5023,discard
5180,disturb
38,east
6128,exhaustion
6483,felt
7284,gaunt
8376,homeless
9610,kilobyte
9712,kwanza
10233,local
9762,lord
10842,membership
11031,minute
11487,narrow
11590,neighboring
11780,notify
12187,outbreak
12758,performance
14309,refuse
14369,relaxation
16693,squall
16921,stimulus
17430,swift
17567,tamper
17731,tenor
6243,terrestrial
1880,thirst
19571,withdraw
85,accept
256,adoption
970,artisan
1080,astronomy
3124,circulation
4184,crime
4371,custody
4593,deface
5506,durable
6071,example
7454,glitch
7746,grow
8101,heal
8765,immigration
10075,lifeless
10652,marry
525,native
13447,preservative
14490,research
934,rest
14595,retirement
14597,retreat
937,rival
17972,tidy
2442,utter
19055,vocabulary
19182,warfare
123,accumulate
195,add
790,appointment
680,arctic
1019,assassinate
1742,binary
3354,code
3721,connection
3953,correction
119,count
4632,degree
4762,descent
4817,deteriorate
5761,empire
5955,eradicate
20008,evaluation
6152,expansion
6310,fail
5826,force
7081,friction
7354,geometry
7367,gesture
7558,gossip
1629,grade
8773,immunize
8839,incandescent
8935,industrial
8968,inflame
9203,intoxicate
9212,introduction
9247,invite
3199,lean
10239,location
5094,may
10807,medium
11079,misshapen
11910,obtain
12129,organization
12305,overturn
13562,producer
13684,proton
13717,pry
13886,queasy
20073,quietly
14420,removal
14447,repel
6630,replace
14553,response
15196,scary
16247,snoop
16516,specialist
14576,strain
17427,swept
17483,synthetic
17689,televise
17795,thank
18200,tourism
5904,trance
18793,uproar
19288,weary
79,acceleration
125,accumulation
177,activate
888,aristocracy
2049,botany
4294,cubic
5009,disagreement
11787,nourishment
11805,nuclear
13864,quantity
14364,relative
15453,senior
415,sick
16531,spectrum
17274,summons
458,alight
589,amplify
881,arid
1444,barter
1598,beg
2032,bore
2063,bought
2188,breeding
2433,busybody
3136,citizenship
101,claim
4594,defeat
5681,electron
5871,enrollment
6160,expedition
6448,feature
6497,ferocious
6501,fertile
20108,flexibility
7434,glaring
7682,greet
5849,gross
7766,grumble
7792,guild
8303,history
9108,insulate
9955,legend
10301,look
11185,monetary
11677,nightmare
13301,possession
14408,remedy
15000,rustle
15346,seasonal
15488,separation
16331,sold
14533,source
17065,strength
1488,throb
18281,translation
18650,underworld
18701,unison
1159,visual
19598,won
19759,yap
4514,dealt
9868,lawsuit
5601,system
18275,transformation
158,acquire
224,adjust
372,agitate
442,alcoholism
966,artificial
1085,atheist
606,atomic
1556,beauty
1785,bitter
2763,catholic
2898,character
3297,clue
4070,coward
4168,crept
3356,education
6107,excursion
6221,extend
6224,extension
321,fix
6906,foreground
7039,freak
7457,global
8328,hobby
9164,interference
5861,lighten
10299,longitude
1931,luster
10421,luxurious
1193,mobile
12265,overeat
12746,perennial
13549,process
13962,radiate
14182,rebellion
14205,reception
14512,resignation
15257,scoundrel
15442,semifinal
16766,stammer
17809,theft
18333,treatment
18535,twice
19059,vocal
19793,yield
1037,asset
19870,astonishment
1078,astronomical
5893,entertainment
8242,hibernate
8724,illiterate
7542,nature
13330,postwar
13815,pursuit
14472,reproduction
15505,series
1099,atmospheric
2792,celebrate
3497,communication
3724,conquer
4805,detach
5864,enormous
6195,explore
6978,fortune
7350,geology
8604,hungry
9445,joke
10461,magic
10721,mathematical
10985,million
241,mission
14443,repeat
2289,rush
3775,tell
18266,transaction
19497,wilt
19498,wimp
1319,balance
2879,change
3011,chill
5120,disposal
6105,excrete
6611,finish
7181,fury
8105,healthful
10926,metropolitan
13903,quick
13929,quota
15237,scoot
15798,shrank
1057,sum
19192,warn
18,abduct
19890,aerodynamic
3122,circulate
3717,connect
5270,donate
19925,freeware
7568,government
8790,impersonate
9148,interact
11974,offshoot
12205,outgrow
12232,outrun
8468,horny
8993,information
14234,recommendation
14634,revolution
15457,sensation
171,action
161,age
738,apology
1039,assign
1266,backfire
3437,combination
3668,confederation
4724,depart
5011,disappear
5198,divert
5201,divide
6069,examine
6232,exterminate
6709,flaw
7019,fragile
7652,gravity
8354,holiday
8384,homesick
8849,incident
9114,insurance
9167,intergalactic
222,join
12083,optical
12514,participation
12698,penalty
12873,phrase
13677,protect
4110,rank
14366,relax
15493,sequel
5574,stern
17167,sturdy
17177,subdivide
17261,sulk
18015,timing
205,addiction
879,argument
2730,casualty
3868,converse
20122,counseling
3219,earl
5585,eavesdrop
6175,expert
7366,germinate
19935,gigabyte
9172,intermission
10410,lurk
4706,nomination
14756,roam
18781,uphold
6,verb
19825,zap
668,anoint
1688,beta
3165,clank
17607,task
17777,terrorize
69,abundant
241,admission
602,anarchist
2827,century
3574,compose
4551,decipher
5819,enemy
6193,exploration
6935,give
8750,imitation
9245,invisible
12261,overdose
12776,perishable
13571,profession
13813,pursue
14835,roomy
19829,zenith
2755,category
9176,international
10650,married
14248,recreation
15381,security
16234,sneak
16623,spoil
2447,term
18649,underweight
227,adjustment
286,advertise
1164,augment
4962,dioxide
5558,earthen
685,elope
5950,equip
7724,groggy
9161,interface
9460,jovial
10472,magnetize
627,new
11701,nobility
14286,reflect
14476,republic
13477,review
15580,shabby
16765,stamina
3809,tempo
3159,clamor
3943,corporal
5210,division
7719,grizzled
9038,inoculate
12301,overtime
13432,prescribe
14362,relationship
15027,sacrifice
15804,shrill
18174,total
18853,valentine
11751,western
462,align
659,announcement
924,arrange
3664,confederacy
3857,convene
3944,corporation
4981,direction
7103,frisk
8761,immerse
9113,insult
9564,kept
10008,lesson
11368,multiply
1944,oath
14573,restore
14609,reveal
14625,revival
5868,rich
3730,science
17272,summon
17466,symmetry
19213,washable
19269,weak
19552,wiry
232,administration
4272,crusade
5064,disfigure
5469,dud
8282,hinder
8653,hypnosis
9376,jaunt
9289,resist
70,use
3301,clumsy
4706,denomination
5004,disagree
5173,distribute
5702,eliminate
7180,furthest
9327,itemize
5953,lent
403,less
5104,orderly
13255,populous
14675,rickety
16074,sleepy
2920,charm
187,cute
5205,dividend
5898,enthusiastic
6112,execute
6163,expenditure
7848,habit
899,mad
12189,outburst
12778,permanent
12828,pester
12905,picturesque
13188,policy
13909,quiet
14324,regional
14576,restrain
877,argue
2168,breakdown
5149,distant
5832,engagement
7267,gaseous
7274,gather
9188,interruption
11973,offset
13210,pollute
14262,reduction
14429,rendezvous
14926,rugged
19897,separately
17312,supple
18753,unsteady
579,amount
2504,calculate
3714,congruent
3802,contain
4809,detain
6508,festive
9150,interaction
11501,nationality
14658,rhythmical
6964,sake
292,advice
3193,clause
3999,council
4336,curfew
8650,hyperactive
13409,preface
14252,recuperate
17190,subordinate
17349,surpass
19280,wealthy
41,abroad
180,activity
4523,debt
954,fact
10561,management
1618,old
12452,paradise
13435,presence
13525,private
13695,provide
3784,strict
17812,theme
13277,trait
18663,unequal
262,adrift
19,bid
2825,central
3491,commotion
3801,contagious
4101,cram
4150,credit
5104,disorderly
5862,enlist
307,far
6705,flattery
9011,initiate
11343,muddle
13934,quotient
15141,savage
16799,start
17769,terrify
48,absent
338,afraid
3327,coax
3555,complete
4501,deadly
5183,disturbance
140,eve
6393,farther
6948,formal
7388,ghoul
7697,grief
8022,hasty
9042,inquiry
9085,instant
12422,pang
13228,poor
14892,routine
14998,rustic
15449,send
16245,snob
17781,testament
18685,unhealthy
19062,vocation
1089,athletic
3551,complaint
4576,dedicate
5729,embezzle
5839,engineering
5867,enrage
5699,event
7062,frequency
9961,legion
10066,life
10867,mention
11204,monopoly
11627,neutron
16,omen
12481,parental
14195,receive
18280,translate
365,aggression
1381,bankruptcy
1839,bless
2467,byte
132,custom
4442,danger
4573,decrease
4575,decree
5326,downsize
5659,elaborate
5970,error
6151,expanse
9067,insomnia
11530,navigate
12126,organic
13543,problem
14246,recovery
14519,resistance
8252,seek
17188,submit
1212,wait
19575,withhold
3771,conspire
4874,dialect
5194,diversion
6587,final
7969,harass
8323,hoax
9310,isolate
9880,lazy
9866,make
11708,nocturnal
343,noon
20094,partially
13545,procedure
6631,proof
14987,rural
16882,sterile
10079,style
17634,taxation
2153,win
3707,congregate
4500,deadline
4526,debug
5167,distort
5171,distress
6985,forward
8748,imitate
9226,invent
12495,parole
13199,politics
13782,punish
2318,budge
5713,elude
7078,fret
8659,hysterical
11022,minority
13704,provision
1147,attractive
1196,auxiliary
3547,compile
6729,flexible
7674,greedy
8694,identify
13567,productive
14243,recover
20099,remaining
3956,respond
19409,will
737,apologize
2383,burden
19872,cleanliness
4018,counterpart
4865,diagnosis
5918,enunciate
20046,environmental
7323,generic
7514,goddess
7939,handsome
8621,hurry
8835,inaugurate
10694,master
11069,mispronounce
11480,narcissus
11503,nationwide
12406,pamper
13067,playful
11069,pronounce
14299,refresh
17355,surrender
17908,threaten
3489,wealth
2917,charity
3682,confident
4141,create
5439,drowsy
5521,dwell
6102,exclude
6533,fierce
8506,hostile
145,led
13270,portable
14067,rascal
13455,residential
16439,southern
5171,stress
980,ascent
4080,cozy
5795,encourage
6052,evolution
3684,fine
8253,hideous
8878,increase
498,mighty
11020,minor
13091,pledge
11725,sense
14522,solution
17151,stuffy
3549,complain
3786,construct
4486,dream
7965,happiness
8820,improvement
8907,indict
9479,juggernaut
123,late
12864,phonetic
13298,possess
14745,ritual
48,sent
15835,sickly
6224,tension
277,adventure
446,alert
504,aloha
1413,bargain
3816,content
5126,disprove
5218,dizzy
6458,feeble
8240,hesitation
8774,impact
9162,interfere
10422,luxury
12285,overpower
12513,participate
12795,persist
13079,plead
13548,proceeds
13565,production
14483,request
17664,tease
17706,temperate
19275,weakness
8942,inedible
527,met
13786,puny
5985,say
17724,tender
593,amuse
756,appearance
3539,compete
3673,confess
4944,diminutive
5599,economy
6440,fear
9058,insert
9194,interval
9297,irritation
9458,journey
2273,law
11928,occurrence
13448,preserve
14590,retarded
12287,rule
16320,soften
19336,welfare
598,analysis
1603,begin
4597,defective
5937,equal
7644,gratitude
7966,happy
8764,immigrate
922,rouse
5153,temper
2228,bring
3760,consistency
4208,critique
5889,entertain
7152,functional
8655,hypocrite
79,ratio
14125,react
15869,sightless
17364,survive
18979,victory
19661,worry
367,aggressive
19869,approximately
1754,bionic
2647,career
3410,colonize
5053,discriminate
6058,exact
6214,expression
7031,frank
9831,latitude
9968,legislature
10470,magnetism
10515,majority
241,miss
13355,poverty
13634,pronunciation
2131,ramble
16267,snug
16297,society
638,angry
3002,childhood
4692,demonstrate
5984,espionage
6234,extinct
6995,found
7336,gentle
431,ask
3003,childish
3525,compare
4121,crave
4559,declaration
4715,density
5367,drawback
6596,financial
7289,gay
7464,gloomy
7735,grouchy
8825,impulse
9241,investigation
1808,lame
10213,livid
6822,lying
7934,made
10541,malignant
11067,misplace
11658,niche
11912,occasion
12073,oppose
12764,peril
13369,practice
14439,repay
14486,requirement
4252,rude
2418,shy
17743,tepid
17906,threat
18751,unstable
19513,windfall
10648,marriage
113,accomplishment
19881,adulthood
481,alliance
587,ample
783,apply
1056,assortment
1555,beautify
1606,beginning
3901,cooperative
4319,cumbersome
4806,detail
4942,diminish
5041,discontinue
6853,folklore
6909,foreign
8476,horror
8524,hourly
8945,inert
9039,input
19933,interactive
10756,mean
50,mind
11063,mishap
11978,often
12220,outnumber
12276,overjoyed
12572,pastime
8780,patient
13678,protection
591,put
20098,rapidly
77,rate
2830,real
14202,recent
14390,religious
7694,riddle
20018,scared
20048,surprised
18192,tough
1075,astrology
1192,automation
1254,boon
3609,concentrate
4000,counsel
4596,defect
5827,enforcement
6095,excitement
6100,exclamation
6305,fade
7958,haphazard
5079,illusion
8752,immaculate
8925,individually
9100,instruct
9184,interrogate
9221,invalid
11215,monstrous
11287,motto
13497,prime
13540,probation
11069,pronoun
13676,prosperous
15417,select
16048,slang
17309,supervise
5290,dormant
6010,ethnic
6519,fib
8852,incite
9170,interjection
9238,invest
1664,neat
7642,ratify
14384,relieve
17262,sullen
18418,truce
525,alternative
20080,closely
3869,conversion
4857,devout
5359,dramatize
5701,eligible
6206,exposition
6239,extra
7787,guidance
7998,harmony
8238,hesitate
9132,intelligent
9865,lawful
11144,modernize
12848,phase
13784,punishment
14570,restless
15724,shocking
15748,shortage
15909,similar
309,affair
1880,bloodthirsty
3516,companionship
4100,crafty
4600,defense
5134,disrupt
8394,homonym
593,muse
11847,nutritious
13518,prior
14379,relief
17398,swear
18609,unconscious
562,amendment
2522,callous
5752,emotion
4594,feat
8266,highness
9467,jubilant
12515,participle
12714,penniless
13293,positive
15032,sadden
18191,touchy
31,abolition
8,adjective
1064,assure
1968,bold
2771,cause
4765,description
5723,embarrassment
6044,everyday
6236,extinction
7105,frivolous
8770,immune
8946,inertia
9252,involve
9282,irregular
9295,irritate
9889,leadership
10792,meddle
7905,mock
12137,orientation
12239,outspoken
12790,persecution
13894,quench
15571,severe
15796,showy
16518,specialty
17774,terror
8699,idiom
11064,mislay
12317,ownership
18349,trend
19097,vow
193,adapt
488,allow
630,anger
696,anthropology
1211,avoid
2123,brag
2558,cancel
3743,conservation
3848,contribution
4499,deaden
4838,development
5119,disposable
5744,emergency
5812,endorse
6098,exclaim
6300,factual
6425,fault
6453,federal
7698,grieve
7764,gruff
7768,grumpy
8186,hell
9116,insure
9136,intense
10156,linger
5253,main
10888,merry
11065,mislead
13399,precision
14127,reaction
4235,refer
14410,remember
17863,think
18619,undergo
18792,uprising
18797,upset
3676,confession
5013,disappearance
6990,foul
12275,overhear
13671,prospect
9282,regular
14350,reject
17671,technique
570,amiable
3688,confirmation
4354,curse
4740,depression
5548,earn
6208,exposure
309,fair
7090,friendship
7281,gaudy
8274,hilarious
8860,incoherent
256,option
13707,provoke
14224,recognition
16136,slovenly
19899,unclear
19096,vouch
26,able
130,accusation
19867,agility
378,agony
463,alike
641,anguish
4660,delightful
5092,dismal
6138,exist
6391,farsighted
6891,forbade
20110,historically
8780,impatient
9041,inquire
10853,memory
142,achievement
3570,complimentary
4128,crazy
5033,disclose
8126,heartbroken
9456,journalism
5852,joy
2005,keep
11008,minimize
11049,mischievous
11582,negotiation
20096,pleased
13250,popularity
15361,secondary
253,adopt
532,altogether
3828,continue
4853,devotion
6304,fad
6352,false
7797,guilty
9126,intellect
9206,intricate
11053,miser
11226,moody
13401,precocious
13407,prediction
13428,prepare
13553,proclaim
13581,profitable
13951,racism
14219,reckless
16400,sorrow
18812,urgent
1923,blunder
5153,distemper
8753,immature
9774,language
11532,navigation
12300,overthrow
18886,various
258,adore
1182,authority
5355,drama
5849,engross
5896,enthusiasm
6086,exceptional
7049,freedom
7402,gimmick
9178,interpret
13473,prevent
13569,profess
111,accomplish
306,aesthetic
814,approval
1149,attribute
3449,comfortable
4164,creepy
4193,crisis
4638,deity
4815,deter
5169,distract
8287,hint
8831,inaccurate
11302,mourn
11452,mystery
14623,revise
15615,shall
9307,slander
17207,succeed
19827,zeal
561,amend
1197,availability
1940,boast
3735,consciousness
4730,dependent
6094,excited
6432,favorable
7088,friendly
9794,largely
498,might
13431,preposition
14940,ruling
379,agree
1178,authentic
3346,cocky
3840,contradictory
5809,ending
9858,lavish
12135,orient
13727,psychology
15552,settle
15758,shortly
777,applicable
1051,association
1129,attention
4651,delicate
4658,delight
4674,delusion
4698,demonstrative
6041,lasting
10300,longtime
3534,passion
18597,unbecoming
375,aglow
2605,capitalize
4739,depress
5055,discrimination
5716,emancipate
5852,enjoy
10368,lovely
11875,objection
12586,paternal
13879,quarterly
14177,reassure
316,affectionate
4448,dare
5196,diversity
6246,extravagant
6463,feel
6933,forgetful
7782,guess
8103,health
11573,needy
11625,neutralize
15759,shortsighted
17234,suffer
18008,timely
11107,understand
19160,wander
42,abrupt
3492,communicable
9240,investigate
13674,prosper
16291,social
17354,surprising
18743,unruly
9221,valid
19834,zest
105,accompaniment
363,aggravate
1034,assess
1458,basic
3364,coincide
5042,discord
7642,gratify
8844,incentive
11577,neglect
13694,proverb
131,accuse
29,adverb
1666,benefit
1680,besides
5524,dwindle
3219,early
5902,entitle
6090,excessive
7065,frequent
7326,generous
7552,gorgeous
8989,inform
2806,lose
11010,minimum
14510,resign
15924,simultaneous
16840,steady
788,appoint
1144,attraction
3697,confusion
3839,contradict
5030,discipline
5137,dissatisfied
5192,diverse
5550,earnest
77,era
3668,federation
8508,hostility
9129,intelligence
11101,mistook
13221,ponder
13445,presently
14257,redeem
986,shame
16830,status
18742,unrest
215,adept
283,adverse
5378,dreadful
6064,exaggerate
8007,harsh
8809,impression
12238,outsmart
12517,particular
17248,suggestion
18994,viewpoint
19464,widespread
184,actual
315,affection
386,agreement
5595,economical
8716,ignore
8949,inexpensive
8991,informal
10118,likeness
10814,meek
12777,perjury
13418,prejudice
17480,synonymous
18013,timid
2966,try
18715,unkind
9223,valuable
18995,vigilant
68,abundance
711,anxiety
2590,capable
3143,civics
4788,despair
5230,docile
6106,excruciating
6212,express
8760,immense
11146,modest
11440,mutual
11790,novelty
12233,outset
8788,personal
9057,sensitive
16295,socialism
18317,treacherous
18763,unusual
20076,worried
3487,commonplace
5161,distinguish
6082,excellence
6338,faithful
6442,fearful
8471,horrible
9913,learn
15898,silly
30,abolish
3216,clearance
4553,decision
4680,demerit
5259,domesticate
5514,duty
4732,epic
6921,foretell
7996,harmful
8263,highly
5084,interested
10228,loathsome
11676,nightly
11816,nuisance
12258,overdo
13663,propose
14545,respectful
20102,routinely
17550,talent
19228,watchful
19444,wholly
3187,classical
20082,completely
4848,devious
9074,inspiration
11655,nice
16521,specific
17130,stubborn
100,accidental
1689,betray
3086,chronic
3548,complacent
3680,confidence
3825,context
4606,defiance
5856,enjoyment
9388,jealous
11304,mourning
11455,myth
13364,powerful
16004,skill
19025,virtual
5912,entrust
13248,popular
20068,carefully
3716,conjunction
4113,cranky
4729,dependence
4906,difference
6011,etiquette
6081,excel
6136,exile
8958,infer
9294,irritable
18878,vanity
28,abnormal
3466,commend
4201,critical
5165,distinguished
5440,drudgery
5722,embarrass
6075,exasperate
6523,fiction
7761,grudge
8097,headstrong
8800,important
8870,inconsiderate
9009,inhuman
9965,legislative
10079,lifestyle
8806,practical
18824,useful
2037,bored
4444,dangerous
4820,determine
6241,extraordinary
40,rid
4793,despise
5262,dominate
5622,educate
5758,emphasis
6281,fabulous
9464,joyful
11893,observation
14462,represent
15421,selective
18681,unfriendly
1198,available
1699,bewitch
2857,challenge
3633,conclusion
4255,cruel
5065,disgrace
5154,distinct
6061,exactly
6083,excellent
7482,glum
8782,impeach
8985,influence
1751,logical
11944,oddity
18079,tolerance
18761,untrue
19450,wicked
4314,cultural
5124,disposition
7034,frantic
7466,glorify
8756,immediate
15506,serious
1121,tempt
18343,tremendous
18392,trivial
19905,unsatisfactory
4829,vast
12839,petty
15,abdicate
3638,concur
3920,cordial
4251,crucial
4799,destitute
5157,distinction
620,dote
6918,foresee
11062,misguided
12805,personality
276,advantageous
384,agreeable
942,arrogant
2038,boring
2078,bountiful
2221,brilliant
20083,correctly
4204,criticism
4607,defiant
20118,developmental
5783,enchanting
6331,fairly
6367,famous
6897,forceful
7512,god
8034,hateful
8195,helpless
8587,humiliate
8808,impress
8877,incorrect
8924,individuality
8996,infuriate
9199,intimate
9373,jargon
10120,likewise
11044,misbehave
11059,misfortune
11760,nosy
12772,periodic
13688,proud
14149,realistic
17766,terrific
9202,tolerant
18235,tragedy
18606,uncomfortable
19494,willing
1808,blame
239,admire
613,ancient
2775,caution
3858,convenience
390,culture
4541,decent
4709,denote
5603,ecstasy
5632,effective
5886,enterprise
5921,enviable
6976,fortunate
10227,loathe
10510,majestic
10540,malign
10666,marvelous
11046,miscellaneous
11057,misery
11880,obligation
12109,ordeal
670,other
13086,pleasure
8487,power
13611,prolong
13893,queer
5133,respect
15130,satisfy
6293,simile
18944,versatile
18973,vicious
294,advise
669,anonymous
819,approximate
2727,casual
3967,corrupt
4206,criticize
4929,dignity
5748,eminent
6359,familiar
8854,inclination
9431,jinx
11268,mostly
14337,regulate
15976,situation
18321,treason
19706,wretched
274,advantage
542,amaze
813,appropriate
1220,aware
1697,beware
2051,bother
3185,classic
4932,dilemma
5040,discontented
5132,disreputable
5800,encouraging
5816,endurance
5817,endure
7381,ghastly
8451,hopefully
20091,increasingly
10558,manage
11246,moreover
11762,notable
11879,obligate
12086,optimistic
12600,patriotism
13391,precious
13406,predict
13853,qualification
14038,random
14297,reform
14339,regulation
16929,stingy
19674,worthy
4053,courteous
4910,different
5998,estimation
7387,ghostly
2517,hate
8906,indication
11054,miserable
11141,moderate
12244,outwit
12591,pathetic
14060,rapture
19101,vulgar
3258,wise
746,are
1171,austere
2145,bravery
3641,condemn
3745,conservative
3809,contemporary
6358,fame
6964,forsake
8163,hectic
8797,impolite
8832,inadequate
9231,inventive
11571,needless
11639,newfangled
12662,peculiarity
15307,scrupulous
17895,thoughtful
19586,woe
279,adventurous
12660,peculiar
89,acceptable
293,advisable
1292,badly
4067,covet
5535,eager
324,fluent
7128,frugal
8167,heed
8401,honestly
8880,incredible
9171,intermediate
9390,lousy
11176,momentary
5100,obedient
12012,ominous
1412,rely
17303,superiority
19165,want
1227,awful
20088,disappointed
7218,gallant
11580,negligent
15802,shrewd
6080,exceedingly
13336,potential
18734,unpleasant
2995,chiefly
3150,civilize
4792,desperation
5046,discourage
7585,gradual
19874,inexperienced
9062,insignificant
12089,optional
12599,patriotic
12819,persuasion
16402,sorry
9107,sufficient
18443,truthful
18763,usual
543,amazement
1225,awe
1624,belated
3534,compassion
4640,dejected
7671,greatly
8766,imminent
10265,lofty
11543,nearly
13618,promising
3731,conscientious
7178,further
12071,opportunity
17471,sympathy
13002,pity
18711,universal
257,adorable
2649,careful
10474,magnificent
16408,soul
17035,strange
3860,convenient
11915,occasional
9205,ravenous
1060,assumption
6251,extremely
11925,occur
270,advanced
518,also
4528,debut
5152,distasteful
10473,magnificence
11735,normally
15189,scarcely
17722,tendency
3590,comprehensive
16529,spectacular
19601,wonderful
236,admirable
5590,eccentric
7665,great
4974,dire
6241,ordinary
13467,presume
16611,splendid
7641,grateful
15025,sacred
10115,likely
1057,assume
13311,possibly
1412,barely
14066,rarely
8402,honesty
10743,maybe
14157,really
