3,1,0.000100135803223
4,2,0.000530958175659
5,3,0.00234794616699
6,4,0.0186219215393
7,4,0.0360419750214
8,4,0.0365388393402
9,5,0.0285348892212
10,6,0.016252040863
11,6,0.00666809082031
12,6,0.00188016891479
13,6,0.000327110290527
