3,1,0.000354051589966
4,2,0.00371599197388
5,3,0.0224289894104
6,3,0.359223842621
7,4,0.84675693512
8,5,1.60515499115
9,5,2.50516891479
10,6,3.15523695946
11,6,3.41038298607
12,6,2.97875905037
13,6,2.23348617554
14,6,2.26404595375
15,5,1.00587201118
16,5,0.347146034241
17,4,0.0907769203186
18,3,0.0165278911591
19,2,0.00190401077271
