8,-1,2.00271606445e-05
9,0,0.000268936157227
10,1,0.000571012496948
11,2,0.001051902771
12,2,0.001060962677
13,2,0.00140404701233
14,2,0.00163602828979
15,2,0.00194215774536
16,2,0.00224709510803
17,2,0.00258898735046
18,2,0.00286984443665
19,2,0.00317692756653
20,1,0.00351405143738
21,0,0.00366306304932
22,0,0.00399088859558
23,-1,0.00531482696533
