9,1,1.00135803223e-05
10,2,0.000488042831421
11,2,0.000592947006226
12,0,0.000741004943848
13,1,0.000922918319702
14,1,0.00122094154358
15,0,0.00120615959167
16,-1,0.00100207328796
17,0,0.00118708610535
18,1,0.0011899471283
19,-2,0.00158405303955
20,-2,0.0021390914917
21,1,0.00317907333374
22,-2,0.00137591362
23,0,0.00318312644958
24,-1,0.0032639503479
25,-2,0.00548815727234
26,-2,0.00353097915649
27,-3,0.00389099121094
