17,1,1.09672546387e-05
18,2,0.000477075576782
19,1,0.000622987747192
20,1,0.000825166702271
21,0,0.00102186203003
22,1,0.00126504898071
23,0,0.000926971435547
24,0,0.00143790245056
25,-3,0.000124931335449
