8,1,2.88486480713e-05
9,2,0.000443935394287
10,3,0.00086784362793
11,4,0.00131893157959
12,4,0.00202393531799
13,5,0.00231719017029
14,5,0.00214004516602
15,5,0.00219893455505
16,6,0.00266814231873
17,6,0.00289511680603
18,6,0.00328183174133
19,6,0.00357604026794
20,6,0.00405097007751
21,5,0.00424790382385
22,5,0.00462484359741
23,4,0.00494694709778
24,3,0.00513195991516
25,2,0.00536394119263
