19,1,1.19209289551e-05
20,1,0.000540971755981
21,1,0.000611066818237
22,1,0.000765085220337
23,1,0.00085711479187
24,2,0.000840187072754
25,2,0.00209403038025
26,2,0.00177383422852
27,-1,0.000144958496094
28,1,0.0893630981445
