9,0,4.60147857666e-05
10,1,0.000478982925415
11,2,0.00471186637878
12,2,0.0314869880676
13,3,0.145334005356
14,4,0.510179042816
15,4,1.37557601929
16,5,2.99154520035
17,6,5.38844394684
18,6,7.62069177628
19,6,8.96810722351
20,6,8.85977506638
21,6,7.10218286514
22,6,4.85406303406
23,5,2.60581016541
24,5,1.1077580452
25,4,0.356699943542
26,3,0.0888631343842
27,2,0.0155279636383
28,1,0.00171399116516
