6,-1,3.79085540771e-05
7,0,0.000240087509155
8,0,0.00142502784729
9,0,0.00585389137268
10,1,0.014771938324
11,1,0.0277099609375
12,1,0.0408048629761
13,2,0.0445470809937
14,2,0.0363368988037
15,1,0.0218949317932
16,0,0.00979685783386
17,-1,0.00280404090881
18,-2,0.000510931015015
