6,0,5.00679016113e-06
7,1,0.000159978866577
8,1,0.000223159790039
9,3,0.000241994857788
10,3,0.00102400779724
11,1,0.000313997268677
12,3,0.00149607658386
13,-1,0.00049614906311
14,2,0.000610828399658
15,2,7.89165496826e-05
16,2,7.79628753662e-05
17,1,7.79628753662e-05
