4235,canadian
2077,lemur
103,amphibian
3,adjective
4234,punjabi
165,armadillo
278,bark
411,boast
461,breeze
2676,petunia
389,bleach
946,daffodil
1852,imitate
3093,role
465,briefcase
2608,rake
810,connection
1481,fowl
1671,hail
3162,saxophone
879,cozy
2363,movement
2206,mammal
3866,toucan
3580,stool
2190,maine
4103,wheat
3353,siren
3213,seesaw
2003,koala
1838,idaho
1057,disappoint
1929,janitor
2789,portugal
3076,ripe
995,light
788,competition
1780,hollow
2296,midnight
3388,slight
2783,poppy
3917,trunk
2912,quack
3433,sofa
741,coal
1133,duck
825,convenient
1510,fuel
2995,recycle
3153,sandal
45,affect
2114,lily
245,bagel
3800,thorn
4199,yogurt
508,burrow
2433,nevada
432,bottle
0,noun
2675,petal
2314,mississippi
2642,peacock
3598,tray
376,birdhouse
972,debt
2044,laughter
2531,operate
3595,straw
1027,diaper
4190,yawn
2681,photograph
254,ball
1089,donkey
4026,violet
687,chipmunk
479,brush
1122,driveway
1682,hammer
3383,sleepy
1083,doll
1545,gentle
232,backpack
2563,outdoor
2990,recite
3335,silence
3713,tailor
1066,towel
764,comb
1199,empty
3902,triangle
303,bay
1089,key
547,camera
481,bucket
1066,tow
1927,jam
2527,open
886,rash
533,calculator
3764,tennessee
3052,view
2896,puppy
3789,thief
3938,tunnel
1717,hay
1600,goose
2599,panda
2484,nurse
226,baby
78,alike
249,baker
397,bloom
1040,digital
2537,opossum
2904,purse
3390,slipper
3883,tractor
1587,goat
2162,louisiana
368,cycle
1837,icing
2697,piglet
6,verb
949,daisy
3267,sheep
4186,xylophone
1138,dutch
2647,peep
3698,swing
127,antler
1880,injury
3934,tulip
2338,moo
1620,grape
3578,stone
2949,raisin
2048,lawn
3914,truck
1955,juice
2314,sip
736,clown
1798,horse
2787,porcupine
3889,train
1969,kentucky
3164,scale
709,clam
4134,windmill
710,lap
3308,shower
986,definite
1272,experience
1476,forward
3254,shallow
2934,rabbit
3305,shovel
830,cookie
3655,suitcase
2577,paddle
280,barn
1882,insect
486,bug
1617,grandmother
3283,shoe
884,crane
2265,medicine
4160,wool
953,dandelion
388,blanket
1765,pot
2809,pouch
1231,escalator
2018,lamb
3088,rock
1121,driver
2739,player
2567,oval
3249,shade
3928,tuba
4145,wisconsin
2840,pretzel
378,birthday
261,banana
2940,railroad
500,bunny
1483,fox
3431,sock
943,cylinder
3196,seashore
3427,snowball
277,barge
407,blueberry
717,clean
215,avocado
2747,plug
4014,vermont
4008,vase
638,chair
413,bobcat
615,cattle
1042,dine
1174,eighth
1278,explore
1528,gallop
2212,manner
2550,organize
2647,peep
3314,sibling
3638,subway
3847,tomorrow
3974,uniform
2814,powder
3057,ribbon
1707,hat
312,bear
2292,microphone
913,crown
3241,settle
3407,smoke
919,cry
889,crayon
1784,nest
907,crocodile
2694,pig
2182,magazine
875,cow
2579,pail
2651,pencil
1109,drawing
1205,engine
1322,fan
557,canal
3408,smooth
4041,wagon
574,car
3102,root
3973,unicorn
2316,missouri
2456,noise
3692,weep
727,close
2372,mug
2654,pennsylvania
2310,mirror
3101,rooster
2028,lantern
3967,umbrella
1439,flute
480,bubble
2575,package
3326,sideways
2652,penguin
1412,fix
1896,introduce
227,sit
710,clap
3580,tool
3472,spatula
260,bamboo
616,flower
4027,violin
444,box
3588,stove
475,broom
3179,scoop
267,bang
2187,mail
1695,pine
2710,pipe
85,one
4051,wallet
3561,stethoscope
1125,rug
328,bee
2396,nap
2750,pocket
3880,track
258,balloon
883,cracker
2551,ostrich
2645,pedal
2700,pillow
751,coffee
32,dress
1706,harvest
2775,pony
1123,drop
2291,michigan
3841,toe
123,ant
546,camel
882,crack
173,row
398,blossom
3384,sleet
926,cup
375,bird
517,busy
2706,pink
3837,toast
312,bear
3152,sand
935,curtain
3729,tape
1948,jolly
3489,spice
4023,village
65,airplane
3194,seal
3351,sink
3689,sweater
14,bat
3832,tissue
2891,pumpkin
1988,kitchen
345,lie
3521,squirrel
3877,tower
98,ambulance
1218,tire
3199,seat
1536,gasoline
2887,pull
333,beetle
1503,frog
2646,peel
1962,kangaroo
1991,knee
483,buffalo
1105,draw
217,awake
1925,jaguar
1622,grass
2774,pond
4189,yarn
394,block
2334,monkey
3381,sled
726,clock
2135,load
3518,square
522,button
1796,horn
10,cord
65,plane
1082,dog
4174,wound
2353,motorcycle
81,alligator
243,bag
3365,skateboard
953,lion
420,book
2355,mouse
400,blow
3846,tomato
4072,wax
473,broken
586,caribou
952,dancer
1539,geese
1846,illustrate
2176,lynx
1799,hose
298,tub
2748,plumber
1221,tree
3200,weed
424,boot
2397,napkin
2908,puzzle
204,australia
3879,toy
3168,scarf
3004,reindeer
324,beaver
51,noon
72,alaska
701,cinnamon
490,bulb
1659,guitar
2511,ohio
295,bath
371,bike
590,carpet
902,crib
616,cauliflower
2900,purple
399,blouse
589,pen
2895,puppet
2015,lady
2220,march
412,boat
2928,quilt
3424,snout
2149,loop
146,apple
3551,steam
2013,ladder
2935,raccoon
2630,path
360,berry
1938,jeans
1636,grocery
2301,milk
1053,dirt
2234,match
592,carrot
2627,paste
4040,wag
1790,hook
614,tail
4143,wipe
417,oil
1457,print
593,carry
2643,peanut
1940,jew
2744,please
1408,fish
2566,outside
3266,shave
535,calf
8,den
241,badger
846,cottage
2081,leopard
3505,spoon
2318,mitten
1801,hot
2998,refrigerator
702,circle
3492,spill
135,where
406,blue
1090,door
265,bandage
591,carriage
1895,interrupt
2790,portuguese
3034,reptile
638,hair
3393,sloth
2251,meadow
2204,mall
2598,pancake
355,bench
4104,wheel
4175,wrap
3508,spot
1185,elephant
749,coconut
3375,skunk
4123,wife
1108,drawer
1534,gas
1789,hoof
13,acorn
3377,sky
670,chick
275,barber
2460,noodle
443,bowl
3104,rose
3933,tugboat
2778,poor
350,belly
2894,pup
1286,eye
3854,tooth
463,ride
1098,down
2178,machine
1601,gorilla
2075,lemon
3200,seaweed
742,coast
2480,nowhere
2539,opposite
3195,search
629,cereal
983,deer
1295,factory
3256,shape
1176,elbow
3197,season
549,flag
1630,green
740,coach
1987,kiss
2994,rectangle
2386,star
1117,drip
68,lab
1695,pin
247,rain
770,table
1329,farm
472,broccoli
1754,high
1681,hamburger
2468,nose
4054,want
994,delicious
995,delight
1167,eel
616,flow
2280,meow
2379,music
2508,officer
2960,rare
3768,tepee
4053,wander
3532,starfish
752,coin
1696,happy
3410,snail
3425,snow
289,basket
2685,piano
3211,seed
4043,waist
1085,dolphin
2497,octopus
1114,sing
232,pack
1734,heavy
1393,finger
1989,kite
3429,soap
3594,strap
3455,sore
1924,jacket
595,cart
438,bouquet
936,curve
3916,trumpet
951,dance
1949,jordan
3188,screen
1431,floor
330,hive
2008,label
2225,market
89,read
3969,uncle
1218,tire
382,bite
1434,flour
326,bed
668,chew
4102,whale
4206,zebra
2578,page
1415,flake
3112,royal
4009,vegetable
235,bacon
323,beauty
958,dark
3282,shirt
1081,doctor
1818,red
2352,motor
2801,post
4193,yellow
512,bus
856,counter
3873,tour
4185,wyoming
228,back
2134,lizard
2658,pepper
3887,traffic
3261,sharp
3654,suit
1289,lid
125,tea
3268,sheet
3278,shine
3599,stream
439,bow
141,ear
230,round
3784,there
850,couch
2398,narrow
3663,sunflower
1828,hurt
2282,mess
3845,toilet
2346,mosquito
513,bush
1574,glove
457,breakfast
86,alphabet
679,chimney
665,chest
1387,find
655,cheek
733,clothing
1560,ghana
1996,knob
2220,march
3765,tennis
3412,snap
1741,help
2813,pour
187,sleep
1359,fence
1939,jelly
1067,wash
3985,upstairs
2438,paper
316,beard
918,crutch
2689,picture
68,alabama
1398,fire
3055,rhyme
188,astronaut
725,climb
1437,flu
2096,lick
351,belong
3411,snake
1130,dry
54,go
1917,israel
1071,dive
2317,take
3255,shampoo
4135,window
3743,tear
3817,tiger
3438,soldier
3906,tricycle
1616,grandma
126,hill
3303,shout
3520,squeeze
2378,mushroom
1564,giggle
2626,past
3804,thread
3177,scissors
4210,zoo
1537,gate
2585,paint
2824,prepare
792,put
3135,sad
744,coat
2371,muffin
4157,wood
3496,spine
115,ankle
671,chicken
1451,foot
4067,water
1142,eagle
1992,knife
3047,restaurant
2519,olive
210,automobile
1521,further
680,pan
464,bridge
882,rack
2316,sour
451,brave
2446,niece
1683,hamster
1998,knot
2803,poster
755,collar
1340,faucet
1532,garbage
2734,plate
3541,station
3576,stir
1533,garden
1576,glue
636,chain
1563,gift
1096,dough
749,nut
445,boy
1716,hawk
1820,hungarian
2487,obey
2852,privacy
3661,sundae
1097,doughnut
643,hand
2885,pudding
2886,puddle
13,corn
311,bean
369,big
3139,sail
1570,glass
2093,library
3556,step
391,blind
700,cigarette
376,house
1424,flight
413,cat
3769,terrible
2267,medium
2506,office
3459,soup
3893,trash
3154,sandwich
692,choke
1102,town
589,carpenter
89,ready
877,girl
135,here
1107,drawbridge
1118,drive
4101,wet
2377,museum
4111,whisker
349,bell
2417,necklace
354,belt
2040,later
1904,iowa
2938,radio
1495,fresh
2547,oregon
589,enter
1618,grandpa
421,shelf
3204,secret
3491,spider
3696,swim
681,chin
2789,tug
160,gum
1530,garage
2020,lamp
809,cut
1116,drink
3685,wall
1104,dragon
1565,giraffe
128,anxious
2746,plenty
3752,television
1180,electricity
2625,passenger
2497,top
613,pill
1127,store
732,clothes
2827,present
195,tent
3849,tongue
1252,everywhere
427,ring
4024,vine
495,bump
1468,fork
392,ink
69,arm
529,cafeteria
3094,roll
1394,nail
1326,fantasy
4120,wide
3373,skirt
2698,pile
3430,soccer
4086,web
250,bakery
872,cover
4004,vanilla
2273,member
1933,jar
3807,throw
1460,forehead
3743,tear
674,child
1024,diamond
1362,festival
2298,mild
2307,minnesota
2752,poem
3022,remove
3808,thumb
1835,skate
1595,golf
619,cave
3448,somersault
528,cactus
751,off
3206,see
894,cream
762,color
3692,sweep
417,boil
644,hang
3252,shadow
559,candle
219,away
3750,telephone
1877,information
301,battery
1985,king
2435,new
112,angry
760,leg
2632,patient
3387,slide
400,blow
4068,waterfall
4132,wind
443,owl
3453,song
2854,prize
1517,fur
1312,fall
217,wake
774,man
763,colorado
1617,moth
2969,reach
1253,evil
3050,turn
617,cause
1693,happen
3088,rock
113,animal
307,beach
1604,governor
2776,pool
3904,trick
608,catch
1240,rope
3493,spin
1345,fear
1635,grind
2705,pineapple
3650,sudden
920,cub
394,lock
1781,home
454,break
1769,hit
3751,telescope
597,too
225,baboon
2731,plant
4011,vet
3668,supper
3971,wear
996,deliver
3609,string
2610,park
2568,oven
2498,odd
3454,soon
3325,sidewalk
297,room
3814,tickle
4151,wolf
3409,snack
776,common
876,cowboy
2181,madagascar
1358,male
2742,pleasant
2769,polish
4017,veterinarian
4085,weave
730,cloth
603,cash
3113,rub
2335,monster
1464,get
2304,mine
2771,polite
1588,gobble
2636,paw
2173,lunch
3512,spread
1800,hospital
2217,maple
1044,dinosaur
2847,princess
922,cube
729,closet
1502,frighten
3084,roast
527,cabinet
1092,dot
2418,need
3258,share
471,road
308,beak
1492,french
2274,memory
1422,flavor
2617,party
377,birth
1061,sea
1011,sign
462,brick
136,apart
1752,hide
2216,map
2172,lullaby
3601,street
3038,rescue
4148,witch
82,low
962,daughter
1361,ferry
2262,mechanic
1509,fry
561,candy
1350,feed
2786,porch
384,black
285,baseball
2875,roof
521,fly
1540,general
2839,pretty
2701,pilot
2472,notebook
1445,fold
3922,trust
525,cabbage
1064,dish
1817,hump
1775,hold
2879,protect
3948,turtle
3971,underwear
659,cheese
3166,scare
3087,robot
1786,honey
4181,writer
248,bake
1132,dryer
1137,dust
2086,letter
2717,pitcher
1265,exercise
344,belgium
1330,farmer
1588,gobble
2922,quick
3470,spain
3612,stripe
230,ground
2230,marshmallow
453,bread
1427,flipper
2128,litter
2735,play
3652,sugar
2916,quart
3272,shell
995,light
2147,look
841,corner
2637,pay
861,up
847,cotton
2611,parrot
1223,iron
2272,melt
4166,worm
1291,face
2662,perfume
734,loud
1121,river
2438,newspaper
2441,nice
3115,rubber
3136,safe
52,again
1280,press
63,air
2515,oklahoma
2905,push
1103,dozen
4137,wine
869,court
3391,slippery
433,bottom
2357,mouth
568,pit
2766,pole
888,crawl
1363,fever
530,cage
565,cap
383,bitter
1039,dig
3146,shake
3723,tall
653,check
3867,touch
61,head
4116,white
1489,freedom
2193,make
2248,mayonnaise
3337,silly
3184,scratch
716,clay
652,heat
928,cupboard
3134,wand
1778,holiday
2259,measure
1977,kick
1623,hop
2129,little
599,carve
3367,ski
3735,tattle
3325,walk
2340,moon
2415,neck
1506,sting
1765,pop
2422,neighbor
380,bit
4119,why
3385,sleeve
3511,spray
2234,match
3507,sport
3525,stamp
704,circus
1997,knock
436,bounce
753,cold
469,bring
1003,dentist
2088,lettuce
2494,ocean
422,boom
487,bugle
911,crowd
1972,kettle
2032,last
2116,limit
2144,lonely
3133,russian
4124,wiggle
2394,name
101,can
2720,pizza
2686,pick
1093,double
256,let
3774,texas
3432,soda
2768,police
680,chimpanzee
2292,phone
66,airport
809,connecticut
1186,elevator
1878,ingredient
2031,large
3403,smell
4032,volcano
3813,ticket
3978,university
236,bad
497,bun
1467,give
1076,out
274,barbecue
684,hip
372,bill
3434,soft
2419,needle
1450,fool
693,choose
2339,mood
3984,upset
829,cook
1678,halloween
44,ice
1101,downstairs
447,braid
576,card
2268,meet
2283,message
1804,hotel
3389,slip
527,net
1737,heel
4132,wind
2606,parade
3260,shark
1310,fairy
1403,lace
1994,knit
2892,punish
2897,pure
449,branch
910,crow
2631,tie
2373,tip
1043,dinner
1403,place
688,chocolate
1415,lake
2846,prince
3554,steer
3469,spaghetti
1518,furniture
2931,quite
3301,shoulder
431,swan
954,danger
3105,rough
3315,sick
3458,sound
3939,turkey
1800,spit
331,beer
2104,lift
4146,wise
2126,listen
1623,shop
621,ceiling
1506,frosting
734,cloud
1404,work
1013,desk
1395,finish
4126,wild
1529,game
252,balcony
317,beast
1430,flood
1826,hurricane
1928,jamaica
2191,major
1169,egg
2713,pirate
3247,sew
3501,splash
1768,story
3958,twist
1926,jail
1347,feather
203,aunt
1501,ship
1109,wing
567,cape
457,fast
3758,temperature
4179,write
622,rat
1474,tuna
579,cardboard
2354,mountain
3710,tadpole
1508,fruit
2745,pleasure
2733,plastic
3526,stand
1646,growl
390,bleed
524,buy
639,chalk
1726,hear
2138,lobster
3306,show
3842,together
2844,rice
69,alarm
2327,mom
4108,while
3451,somewhere
560,stick
986,fin
1343,favor
2092,librarian
2663,perhaps
727,lose
2655,penny
385,board
644,change
2806,potato
152,aquarium
4150,wizard
1758,highway
531,cake
1561,ghost
2890,pump
1777,hole
3809,thunder
863,courage
1866,indian
2791,position
1462,forest
520,butter
3054,rhinoceros
446,race
262,band
3145,salt
1036,difficult
1642,group
1596,good
3555,stem
3701,sword
37,do
1957,jump
3120,rule
1729,heart
147,appointment
171,arrival
808,connect
984,defeat
1021,development
2631,patience
3050,return
2331,money
2641,peach
466,right
3456,sorry
753,old
3733,taste
2688,picnic
4144,wire
3483,speed
79,live
571,captain
478,run
356,bend
1885,instrument
980,decoration
931,curl
3497,spirit
845,costume
1978,kid
325,come
673,chief
4114,whistle
287,basement
1850,imagination
2963,rather
167,armor
1427,lip
521,fly
2247,maybe
4117,whole
93,way
165,mad
511,bury
1045,dip
3806,throat
3826,tiny
1111,dream
1849,imaginary
3681,surround
194,ten
1462,rest
3196,shore
2319,mix
329,beef
3158,sauce
3342,simple
3484,spell
812,side
563,canoe
1433,florida
2669,person
880,crab
1075,dizzy
1999,now
2369,mud
4100,western
2066,leave
78,like
446,bracelet
1921,itch
2541,orange
3358,situation
8,accident
3693,sweet
998,delivery
3400,smash
697,christmas
909,cross
3722,talk
2386,mustard
2169,luck
339,have
604,cashier
1019,detergent
1267,exist
1692,hanukkah
2629,pasture
3884,trade
3896,treasure
1417,flash
1813,huge
684,chip
4198,yet
3794,think
12,ache
1663,gun
1511,full
191,attach
125,eat
3544,statue
3667,sunset
3998,valentine
3172,school
3929,tube
299,batter
723,cliff
3603,stretch
729,set
1234,special
1993,night
1943,job
140,log
886,crash
2939,raft
4159,wooden
2481,number
1420,flat
4029,visit
79,alive
2359,move
3911,trouble
2920,queen
1654,guide
2043,laugh
4069,watermelon
3406,smile
1916,island
4192,yell
1247,evening
3586,storm
2590,pair
419,bone
623,cell
2769,polish
2926,quiet
1384,final
2232,mask
1698,hard
2844,price
1457,footprint
3142,sale
504,burn
2989,recipe
3310,shrimp
378,day
2474,notice
3277,sheriff
477,own
427,ring
3818,tight
1327,far
651,chase
65,lane
3417,sneaker
1643,grow
2691,piece
3284,shoot
266,bandit
1290,fabric
2208,manage
2252,meal
2660,perfect
3056,rhythm
11,count
560,stick
4142,winter
733,thin
699,church
379,son
488,build
1747,hero
1379,fill
1150,earth
489,building
3658,sun
67,aisle
3581,stop
136,part
851,cough
1774,hockey
706,city
514,shy
1341,fault
421,elf
1722,heal
3160,save
718,clear
1619,parent
3706,system
336,begin
4167,worry
135,anywhere
3834,title
1676,hall
3963,ugly
2524,onion
50,africa
682,china
2837,pretend
3465,space
1373,fight
1617,mother
1283,extra
1449,food
716,lay
4113,whisper
846,tag
1499,friend
811,serve
917,crust
2605,parachute
1034,different
945,dad
4066,watch
65,plan
414,body
1389,fine
3997,vacation
269,bank
605,castle
3449,time
3418,sneeze
3229,serious
941,cute
2986,receive
351,long
924,cucumber
1512,fun
3398,small
550,camp
2317,mistake
2261,meat
1971,ketchup
2870,promise
1605,grab
3141,salad
1232,escape
1547,georgia
1982,kind
3163,say
2294,wave
4153,woman
3396,slow
178,ashamed
3862,tornado
3968,umpire
425,order
3138,safety
268,glad
14,rob
977,deck
542,calm
479,rush
1765,hippopotamus
2150,loose
556,canada
3626,style
1463,forever
3010,relax
580,care
1920,italy
2110,lightning
536,california
1855,impossible
3960,type
4187,yard
1222,envelope
733,thing
178,ham
2241,matter
2254,mean
3611,trip
3092,rocket
3366,skeleton
330,beehive
52,gain
1888,intelligent
2411,near
4064,waste
4105,when
2063,leash
759,collection
827,conversation
789,plain
2991,recognize
1959,jungle
2237,material
3786,thick
1068,miss
2045,laundry
1942,wish
519,butcher
650,chart
1888,tell
715,law
1836,icicle
49,afraid
1562,giant
534,calendar
2815,power
2294,microwave
2917,quarter
3550,steal
4183,wrong
730,lot
587,nation
2427,nervous
2486,oak
1999,know
1990,kitten
2183,magic
775,commercial
844,cost
905,crisp
3680,surprise
1982,kind
172,arrive
2680,photo
2328,moment
282,base
998,very
537,call
3957,twin
715,claw
1665,guy
1740,helmet
2364,movie
1965,keep
3685,swallow
466,bright
662,try
160,argument
1303,fair
126,ill
3083,roam
3539,statement
1536,line
194,end
212,avenue
1657,guinea
3731,target
2071,left
2228,marry
1207,land
793,concert
2076,lemonade
3624,stupid
1625,great
1708,hatch
1807,how
4080,weak
3312,shut
140,apologize
3148,same
3371,skip
104,use
476,brother
3181,score
3449,sometime
797,condition
1444,foal
2729,planet
3292,short
2186,magician
1352,feel
1504,front
147,point
3897,treat
270,bar
722,clever
4155,wonder
99,america
1868,indiana
664,chess
458,breath
2308,minute
1615,grandfather
3245,seventh
4000,valley
3295,shot
1069,distance
1084,dollar
3187,scream
1652,guest
1960,just
1389,fine
1416,flame
955,dangerous
4087,wedding
835,copy
1407,first
1160,echo
1936,jay
4031,voice
4130,willing
3002,regular
3339,silver
92,also
2259,sure
2595,palace
1978,kid
139,ape
2005,wait
339,behave
1428,float
3129,runner
18,action
86,bet
1334,fashion
3815,tide
2893,punishment
48,tan
392,blink
3701,word
1902,invite
1484,frame
392,link
683,chinese
1227,equipment
3333,signal
3748,teenager
2289,mexico
3908,troll
3118,ruin
1319,family
302,battle
1839,idea
1339,father
4165,world
1594,goldfish
2102,life
2412,neat
109,anger
1478,four
2573,oxygen
2580,pain
2876,proper
3354,sister
1490,freeze
3549,steak
4098,west
1830,husband
3632,submarine
89,already
2405,natural
1993,knight
4177,wreck
2992,record
2690,pie
342,being
1827,hurry
1884,instead
2136,loaf
72,ask
772,comic
84,almost
1009,desert
141,appear
1723,health
2981,realize
1264,excuse
2443,nickel
3362,size
2344,morning
735,love
3591,strange
4057,warm
3536,state
465,case
947,daily
1464,forget
1068,miss
2254,mean
3495,spinach
2496,october
646,chapter
3778,theater
782,company
3471,spanish
1958,june
965,dead
46,afford
1833,iceberg
3602,strength
3369,skin
1004,department
4062,washington
1572,globe
1194,emergency
643,chandelier
2115,lime
2463,north
558,cancel
3594,trap
396,blood
3419,sniff
1592,gold
3739,teach
1015,dessert
4030,visitor
173,arrow
916,crush
1613,grand
939,customer
4200,young
3863,tortoise
3593,stranger
878,coyote
4178,wrist
1651,guess
151,april
779,community
1061,disease
1139,duty
1317,familiar
1411,five
2293,microscope
2473,nothing
3977,universe
3995,utah
144,pet
1207,england
889,ray
3446,someday
1125,drug
2764,poisonous
221,awful
597,cartoon
158,tin
1109,win
3613,strong
2696,pigeon
1854,important
3597,strawberry
3915,true
3515,spring
3720,tale
474,brook
3674,suppose
1937,jealous
3450,sometimes
1007,describe
4011,velvet
2956,ranger
3781,then
588,carnival
1178,electric
347,believe
1486,free
501,burglar
39,adventure
979,decorate
3212,seem
194,attend
197,attitude
273,barbados
425,border
450,brass
627,central
774,command
778,communicate
976,decision
1168,effort
1358,female
1485,france
1670,habitat
1784,honest
1911,irish
1942,jewish
2124,liquid
2214,mansion
2320,mixture
1195,motion
2387,mutter
2593,pakistan
2707,pint
2782,popcorn
2848,principal
2877,property
2933,quiz
3015,remain
3171,schedule
2537,sum
3757,teller
3761,temporary
3936,tune
796,dime
2218,marble
3622,stuff
721,early
498,bunch
3502,spoil
3374,skull
3,able
1858,inch
695,christian
2811,pound
51,afternoon
2534,operation
168,army
3017,remember
3234,service
3682,survive
138,apartment
3836,toad
1792,hoop
3657,summer
1821,hungary
526,cabin
2109,lighthouse
2525,only
218,war
3923,truth
386,blade
897,creature
61,ahead
1590,god
1947,joke
2303,mind
3378,skyscraper
72,as
1033,difference
4207,zero
629,real
624,cent
1667,gym
2143,lollipop
1325,fancy
3227,september
251,balance
134,anyway
1609,grain
22,activity
3368,skill
2865,program
737,club
712,class
1855,possible
971,death
1380,film
3482,speech
857,country
2375,muscle
800,cone
3386,slice
439,bow
1919,italian
2439,next
3686,swamp
4018,video
1271,expensive
1203,enemy
2543,orchard
3178,scold
156,area
818,test
3380,slave
974,decide
2831,president
2058,leaf
1956,july
3725,tame
864,course
871,cousin
195,attention
1162,edge
2295,middle
1795,hope
2476,november
4140,wink
982,deep
515,business
1208,english
4035,vote
4045,waiter
3695,well
2437,news
724,climate
1467,forgive
2002,knowledge
2424,neighborhood
3428,snowman
1374,figure
1204,energy
2763,poison
3421,sniffle
169,arrange
3116,rude
677,chili
3053,reward
1675,half
2062,learn
4059,warn
82,allow
3695,well
1002,mark
367,hut
1258,example
3447,somehow
3607,strike
3020,remind
3869,tough
2551,rich
74,be
635,chad
973,december
2510,often
622,celebrate
3864,total
2084,lesson
1550,germany
3747,teaspoon
15,act
956,danish
1274,experiment
1941,jewelry
3201,second
1018,detective
1901,invitation
1344,favorite
121,answer
2546,ordinary
1805,hour
3619,student
3225,separate
3553,steep
1338,fat
4191,year
2337,month
452,brazil
2479,nowadays
75,album
1932,japanese
2943,rainbow
1584,goal
4090,week
3040,responsibility
2189,main
1527,gallon
3182,scorpion
102,amount
4088,wednesday
3157,saturday
1498,friday
3662,sunday
3931,tuesday
1650,guatemala
3980,usual
3699,swiss
1170,egypt
3443,somalia
1909,ireland
1240,europe
1931,japan
1865,india
545,cambodia
3132,russia
