9,1,5.96046447754e-06
10,2,0.000391006469727
11,1,0.000379085540771
12,2,0.000434875488281
13,-2,0.000460863113403
14,3,0.000658988952637
15,-1,0.000540018081665
16,-3,0.00077486038208
17,0,0.00161004066467
18,0,0.000949144363403
19,-1,0.00173902511597
20,-1,0.00104689598083
21,1,0.00257301330566
22,1,0.00327587127686
23,0,0.00488996505737
24,-1,0.00185704231262
25,-1,0.00183510780334
26,-2,0.00214695930481
