4,0,1.12056732178e-05
5,0,8.79764556885e-05
6,0,0.000153064727783
7,0,0.000226974487305
8,0,0.000339031219482
9,0,0.000431060791016
10,0,0.000452995300293
11,0,0.000521183013916
12,1,0.000578880310059
