3,1,0.000128984451294
4,2,0.000562906265259
5,3,0.00875091552734
6,4,2.67892289162
7,5,11.8997108936
8,5,62.6254310608
9,6,171.631803989
10,6,394.020015001
11,7,775.405903101
12,7,1990.78581095
13,8,3780.89435196
14,8,4798.52411199
15,8,5317.62166595
16,9,3271.82027411
17,9,2222.06286502
18,9,1624.42289495
19,9,1022.33906388
20,8,555.242334127
21,8,257.811568022
22,8,103.667802095
23,7,34.0306830406
24,6,9.10879707336
25,5,1.94767093658
26,4,0.317898035049
27,3,0.0380599498749
28,1,0.00292992591858
