4,-1,1.09672546387e-05
5,0,0.000109910964966
6,0,0.000176906585693
7,0,0.000265836715698
8,1,0.000355958938599
9,1,0.000481843948364
10,2,0.000545978546143
11,2,0.000637769699097
12,1,0.000726938247681
13,0,0.000782012939453
