3,1,0.000187873840332
4,2,0.00701093673706
5,3,0.034893989563
6,3,0.267956018448
7,4,0.58770608902
8,4,1.02725887299
9,4,1.46458411217
10,4,1.67214107513
11,4,1.54623818398
12,4,1.15600204468
13,4,0.699867963791
14,4,0.331430912018
15,4,0.123555898666
16,3,0.0342578887939
17,2,0.00664114952087
18,1,0.000809192657471
