3,1,0.00016188621521
4,2,0.0100378990173
5,3,0.217632055283
6,3,2.38975191116
7,4,8.04773592949
8,4,22.3375799656
9,4,52.0215320587
10,5,101.278472185
11,5,166.851387024
12,5,236.043148994
13,6,284.406368971
14,6,294.138203144
15,6,260.825493813
16,6,199.068809986
17,6,128.834290981
18,5,70.4369549751
19,5,32.2972841263
20,4,12.2229337692
21,3,3.77862620354
22,2,0.940536975861
23,1,0.178261041641
24,0,0.0239868164062
25,-1,0.00206303596497
