10,-1,6.91413879395e-06
11,0,0.000623941421509
12,1,0.000346899032593
13,2,0.00117206573486
14,2,0.000549077987671
15,2,0.000617980957031
16,2,0.0013689994812
17,3,0.00389790534973
18,5,0.00627613067627
19,2,0.00109195709229
20,3,0.00139403343201
21,7,0.00871706008911
22,6,0.00324106216431
23,4,0.00166296958923
24,5,0.00238513946533
25,5,0.00202918052673
26,5,0.00212383270264
27,3,0.00282692909241
28,5,0.00282502174377
29,4,0.000149011611938
