3,1,0.000899076461792
4,2,0.014181137085
5,3,0.161595821381
6,4,3.99042987823
7,5,22.256729126
8,6,84.762280941
9,6,480.201470137
10,7,1155.39204001
11,7,2383.83531904
12,7,4263.33183098
13,8,6658.666363
14,8,9008.98102999
15,9,10382.791002
16,9,5635.31305385
17,9,5064.5573051
18,9,4008.34646797
19,9,3614.0119431
20,8,1631.48813605
21,8,844.498010874
22,8,382.633533955
23,7,143.309296131
24,7,44.5618038177
25,6,11.3990619183
26,5,2.34833192825
27,4,0.371287107468
28,3,0.042062997818
29,2,0.00320291519165
