5,0,2.90870666504e-05
6,1,0.000165939331055
7,2,0.000908136367798
8,3,0.00333595275879
9,3,0.0083920955658
10,4,0.0151040554047
11,4,0.0189988613129
12,4,0.0181879997253
13,4,0.0123250484467
14,3,0.00661706924438
15,2,0.00197887420654
16,1,0.000394821166992
