5,0,2.28881835938e-05
6,0,0.000123977661133
7,1,0.00021505355835
8,2,0.00032901763916
9,3,0.000442981719971
10,3,0.000561952590942
11,4,0.000679016113281
12,4,0.000792980194092
13,4,0.00140690803528
14,4,0.000999927520752
15,3,0.00107288360596
