3,1,7.79628753662e-05
4,2,0.00119590759277
5,3,0.014123916626
6,3,2.7307908535
7,3,8.33736300468
8,4,20.7244210243
9,5,43.1076631546
10,5,74.0230710506
11,5,63.1477358341
12,6,66.2213749886
13,6,68.551774025
14,6,59.9745490551
15,6,44.2941968441
16,6,27.5066099167
17,6,14.2538430691
18,5,6.06427598
19,4,2.08793497086
20,3,0.566406965256
21,2,0.118443012238
22,1,0.0177781581879
23,-1,0.00168609619141
