19,1,9.01222229004e-05
20,1,0.000657081604004
21,2,0.00278210639954
22,3,0.00830411911011
23,3,0.0151610374451
24,3,0.0190567970276
25,3,0.0169451236725
26,2,0.00989198684692
27,2,0.00394892692566
28,1,0.000937938690186
