3,1,0.000103950500488
4,2,0.000371932983398
5,2,0.00942397117615
6,3,0.0158560276031
7,4,0.018501996994
8,4,0.0161218643188
9,4,0.0104289054871
10,4,0.00477290153503
11,4,0.00148105621338
12,4,0.000279903411865
