7,-1,3.69548797607e-05
8,0,0.000259876251221
9,0,0.00171804428101
10,1,0.00855803489685
11,2,0.0230450630188
12,2,0.0503079891205
13,3,0.0821290016174
14,3,0.102386951447
15,3,0.0967929363251
16,3,0.0699789524078
17,3,0.0378670692444
18,2,0.0149660110474
19,1,0.00395607948303
20,0,0.000659942626953
