6,0,5.00679016113e-06
7,1,0.00019907951355
8,1,0.000195980072021
9,1,0.000385999679565
10,3,0.000428199768066
11,3,0.000335216522217
12,4,0.00134706497192
13,2,0.000617980957031
14,4,0.00103282928467
15,4,0.00270199775696
16,5,0.0320789813995
17,5,0.000842809677124
18,3,9.08374786377e-05
19,4,0.0010781288147
