3,1,0.000903844833374
4,2,0.0240588188171
5,3,0.12605714798
6,3,0.558933973312
7,3,1.40716195107
8,4,2.85664701462
9,4,4.81834220886
10,4,6.62191390991
11,5,7.48385810852
12,5,7.04683709145
13,5,5.42396903038
14,5,3.43640303612
15,5,1.77926492691
16,4,0.73920917511
17,3,0.236202001572
18,2,0.0582849979401
19,1,0.010057926178
20,0,0.0010998249054
