20,3,8.51154327393e-05
21,4,0.000667095184326
22,5,0.00308609008789
23,5,0.00912117958069
24,5,0.0164849758148
25,5,0.0208659172058
26,5,0.0181620121002
27,4,0.0109031200409
28,3,0.00458598136902
29,2,0.00106191635132
