8,1,9.05990600586e-06
9,2,0.000365018844604
10,2,0.000399112701416
11,2,0.000577926635742
12,2,0.000564098358154
13,3,0.00217819213867
14,3,0.000892877578735
15,1,0.00068211555481
16,3,0.000773191452026
17,0,0.000777959823608
18,4,0.0474128723145
19,3,0.000979900360107
20,0,0.00110721588135
21,2,0.00129508972168
22,3,0.00298810005188
23,2,0.00156712532043
24,2,0.00183796882629
