17,1,7.00950622559e-05
18,2,0.000473022460938
19,2,0.00238013267517
20,2,0.00475811958313
21,2,0.00756502151489
22,2,0.00813007354736
23,1,0.00597620010376
24,0,0.00267100334167
25,-1,0.000714063644409
