strict digraph  {
0 [nam="accomplish;v;01", label="accomplish;v;01\n(0)"];
1 [nam="action;n;01", label="action;n;01\n(1)"];
2 [nam="action;n;02", label="action;n;02\n(2)"];
3 [nam="apart;r;01", label="apart;r;01\n(3)"];
4 [nam="condition;n;01", label="condition;n;01\n(4)"];
5 [nam="detail;n;01", label="detail;n;01\n(5)"];
6 [nam="different;a;01", label="different;a;01\n(6)"];
7 [nam="do;v;01", label="do;v;01\n(7)"];
8 [nam="else;r;01", label="else;r;01\n(8)"];
9 [nam="general;a;01", label="general;a;01\n(9)"];
10 [nam="have;v;01", label="have;v;01\n(10)"];
11 [nam="importance;n;01", label="importance;n;01\n(11)"];
12 [nam="important;a;01", label="important;a;01\n(12)"];
13 [nam="instead;r;01", label="instead;r;01\n(13)"];
14 [nam="like;a;01", label="like;a;01\n(14)"];
15 [nam="make;v;01", label="make;v;01\n(15)"];
16 [nam="mention;v;01", label="mention;v;01\n(16)"];
17 [nam="need;n;01", label="need;n;01\n(17)"];
18 [nam="other;a;01", label="other;a;01\n(18)"];
19 [nam="own;v;01", label="own;v;01\n(19)"];
20 [nam="particular;a;01", label="particular;a;01\n(20)"];
21 [nam="place;n;01", label="place;n;01\n(21)"];
22 [nam="position;n;01", label="position;n;01\n(22)"];
23 [nam="possess;n;01", label="possess;n;01\n(23)"];
24 [nam="possession;n;01", label="possession;n;01\n(24)"];
25 [nam="process;n;01", label="process;n;01\n(25)"];
26 [nam="process;v;01", label="process;v;01\n(26)"];
27 [nam="produce;v;01", label="produce;v;01\n(27)"];
28 [nam="qualify;v;01", label="qualify;v;01\n(28)"];
29 [nam="quality;n;01", label="quality;n;01\n(29)"];
30 [nam="refer;v;01", label="refer;v;01\n(30)"];
31 [nam="similar;a;01", label="similar;a;01\n(31)"];
32 [nam="something;n;01", label="something;n;01\n(32)"];
33 [nam="state;n;01", label="state;n;01\n(33)"];
34 [nam="succeed;v;01", label="succeed;v;01\n(34)"];
35 [nam="success;n;01", label="success;n;01\n(35)"];
36 [nam="thing;n;01", label="thing;n;01\n(36)"];
37 [nam="thing;n;02", label="thing;n;02\n(37)"];
38 [nam="not;r;01", label="not;r;01\n(38)"];
39 [nam="negative;a;01", label="negative;a;01\n(39)"];
0 -> 7;
0 -> 35;
1 -> 16;
1 -> 26;
2 -> 25;
3 -> 8;
3 -> 18;
4 -> 33;
5 -> 9;
6 -> 3;
6 -> 25;
6 -> 29;
7 -> 0;
7 -> 1;
7 -> 2;
7 -> 17;
7 -> 26;
7 -> 27;
8 -> 3;
8 -> 6;
8 -> 13;
8 -> 14;
8 -> 18;
8 -> 30;
8 -> 31;
9 -> 33;
9 -> 36;
9 -> 37;
10 -> 5;
10 -> 12;
10 -> 17;
10 -> 19;
10 -> 23;
10 -> 24;
10 -> 28;
10 -> 31;
10 -> 34;
11 -> 5;
11 -> 12;
12 -> 9;
12 -> 11;
13 -> 8;
14 -> 6;
14 -> 31;
15 -> 27;
15 -> 29;
15 -> 38;
16 -> 30;
17 -> 25;
17 -> 26;
17 -> 28;
18 -> 29;
19 -> 10;
19 -> 23;
19 -> 24;
20 -> 4;
20 -> 7;
20 -> 21;
20 -> 28;
20 -> 32;
21 -> 3;
21 -> 13;
21 -> 22;
22 -> 21;
23 -> 10;
24 -> 19;
24 -> 23;
24 -> 37;
25 -> 1;
27 -> 15;
27 -> 25;
27 -> 26;
28 -> 12;
28 -> 14;
28 -> 20;
28 -> 39;
29 -> 28;
29 -> 31;
30 -> 11;
30 -> 16;
30 -> 20;
30 -> 32;
30 -> 36;
30 -> 37;
31 -> 14;
32 -> 0;
32 -> 1;
32 -> 3;
32 -> 4;
32 -> 6;
32 -> 7;
32 -> 8;
32 -> 9;
32 -> 11;
32 -> 13;
32 -> 14;
32 -> 15;
32 -> 18;
32 -> 29;
32 -> 30;
32 -> 31;
32 -> 35;
32 -> 36;
32 -> 39;
33 -> 4;
33 -> 24;
34 -> 0;
35 -> 34;
36 -> 2;
36 -> 5;
36 -> 9;
36 -> 12;
36 -> 20;
36 -> 22;
36 -> 28;
36 -> 29;
36 -> 32;
38 -> 5;
38 -> 6;
38 -> 9;
38 -> 39;
39 -> 38;
}