6,0,1.19209289551e-05
7,1,0.000138998031616
8,2,0.000262022018433
9,3,0.000402927398682
10,4,0.000552892684937
11,4,0.000710010528564
12,4,0.000961065292358
13,4,0.001216173172
14,4,0.00116610527039
15,3,0.00129508972168
16,2,0.00145387649536
17,1,0.00151586532593
