3,0,0.000360012054443
4,2,0.000626087188721
5,1,0.000164985656738
6,1,0.000580072402954
7,2,0.000447988510132
8,3,0.00206899642944
9,4,0.000613927841187
10,4,0.000176906585693
11,4,0.00174784660339
12,3,0.000997066497803
13,4,0.00403213500977
14,4,0.00243306159973
15,4,0.00188088417053
16,4,0.00458407402039
17,4,0.100209951401
18,3,0.000198841094971
19,2,0.00325393676758
20,1,0.000185966491699
21,2,0.000172138214111
22,2,0.00258803367615
23,0,0.000169038772583
24,-1,0.000169992446899
25,-2,0.000161170959473
