3,0,0.000212907791138
4,0,0.000292062759399
5,0,0.00048303604126
6,1,0.000883817672729
7,2,0.00170707702637
8,2,0.000996828079224
9,1,0.0011510848999
10,2,0.00132894515991
11,2,0.00155806541443
12,2,0.00177192687988
13,1,0.0019690990448
14,0,0.00224590301514
15,0,0.00260496139526
16,0,0.00263285636902
17,-1,0.0026490688324
18,-3,0.00282907485962
