3,1,0.0001060962677
4,2,9.89437103271e-05
5,2,0.192322969437
6,3,0.694137096405
7,4,1.8653190136
8,4,4.08431601524
9,4,7.5045030117
10,5,11.1754591465
11,5,14.2584249973
12,5,27.4888730049
13,5,26.6413869858
14,5,19.0452148914
15,5,11.1974041462
16,4,5.42968297005
17,4,2.10547304153
18,3,0.638177871704
19,2,0.147834062576
20,1,0.0241301059723
21,0,0.00249695777893
