3,1,6.98566436768e-05
4,2,0.00103902816772
5,3,0.344591856003
6,3,1.49402403831
7,4,4.0347430706
8,4,8.8390879631
9,4,15.9849050045
10,5,23.7282760143
11,5,29.3852028847
12,5,22.8915140629
13,6,26.158039093
14,6,18.6800761223
15,5,11.0635790825
16,5,5.35909795761
17,5,2.08326506615
18,4,0.628931999207
19,4,0.146017074585
20,3,0.0237820148468
21,2,0.0024619102478
