3,1,0.00039005279541
4,2,0.000316858291626
5,3,0.00159502029419
6,4,0.000787019729614
7,4,0.00215101242065
8,5,0.00124788284302
9,5,0.00172019004822
10,5,0.00150299072266
11,6,0.000454902648926
12,5,0.00226497650146
13,5,0.00254583358765
14,5,0.00168514251709
15,6,0.0046660900116
16,5,0.00230002403259
17,5,0.00253701210022
18,6,0.00307297706604
19,4,0.00343799591064
20,4,0.00379681587219
21,4,0.00434899330139
22,3,0.00489282608032
23,4,0.00516891479492
24,4,0.00599193572998
25,3,0.00603795051575
26,2,0.00714993476868
27,1,0.00803399085999
28,0,0.00802087783813
