3,0,0.000208139419556
4,0,0.000266075134277
5,0,0.000365972518921
6,0,0.000504970550537
7,0,0.000631809234619
8,0,0.000777006149292
9,0,0.000945806503296
10,1,0.00114893913269
11,1,0.00131106376648
12,1,0.0023181438446
13,0,0.00184011459351
14,-1,0.00180387496948
15,-2,0.00191903114319
16,-2,0.00192213058472
