3,0,0.000185966491699
4,2,0.000401973724365
5,3,0.000750064849854
6,3,0.00113821029663
7,4,0.00128102302551
8,5,0.00182294845581
9,5,0.00358510017395
10,3,0.00271105766296
11,6,0.0037100315094
12,5,0.00226807594299
13,6,0.00192189216614
14,6,0.0018470287323
15,6,0.00621604919434
16,7,0.00539517402649
17,6,0.00557804107666
18,6,0.00931715965271
19,6,0.00920414924622
20,7,0.00694894790649
21,8,0.0107691287994
22,6,0.00628519058228
23,6,0.00699710845947
24,6,0.00802683830261
25,5,0.0059289932251
26,5,0.00721406936646
27,4,0.0108377933502
28,3,0.00815010070801
29,2,0.000187873840332
