3,0,0.000265121459961
4,0,0.000274181365967
5,1,0.000240087509155
6,0,0.000954866409302
7,1,0.000784873962402
8,2,0.00126910209656
9,2,0.00119495391846
10,2,0.00117993354797
11,2,0.00287485122681
12,2,0.00303196907043
13,1,0.00195503234863
14,2,0.00389194488525
15,0,0.0011739730835
16,-2,0.000110149383545
17,-3,0.000108003616333
18,-1,0.00262999534607
