3,1,0.000326871871948
4,2,0.00234889984131
5,3,0.0112059116364
6,3,0.112303972244
7,3,0.206666946411
8,4,0.300343990326
9,4,0.354099988937
10,4,0.322114944458
11,4,0.233914136887
12,4,0.133264064789
13,4,0.055655002594
14,4,0.017678976059
15,3,0.00390601158142
16,2,0.00054407119751
