3,0,0.000777006149292
4,1,0.000893831253052
5,0,0.000872850418091
6,0,0.000409841537476
7,3,0.00100898742676
8,0,0.000755071640015
9,3,0.000661134719849
10,1,0.00137901306152
11,0,0.000771999359131
12,2,0.00587606430054
13,-1,0.00171709060669
14,-1,0.00111103057861
15,0,0.00233221054077
16,5,0.00532603263855
17,1,0.00497221946716
18,1,0.00853300094604
19,1,0.00623607635498
20,0,0.00209498405457
21,-1,0.00636291503906
22,-3,0.00250887870789
23,0,0.00881910324097
24,-2,0.00931406021118
25,-4,0.00346612930298
26,-2,0.00651407241821
27,-3,0.00396490097046
