3,1,0.00021505355835
4,2,0.0382540225983
5,3,0.282923936844
6,3,4.63109207153
7,4,15.756911993
8,5,43.8248708248
9,5,102.694978952
10,6,200.480802059
11,6,330.805901051
12,7,465.995035172
13,7,562.99934411
14,7,582.924972057
15,7,517.125175953
16,8,394.921517849
17,8,255.561729908
18,8,140.010298014
19,8,64.2668919563
20,7,24.5222229958
21,6,7.58946990967
22,5,1.88902592659
23,4,0.351347923279
24,3,0.0478610992432
25,2,0.00412106513977
