3,1,0.000185012817383
4,2,0.0294110774994
5,3,0.472820997238
6,3,3.06491303444
7,4,10.8206298351
8,4,31.7082879543
9,4,78.3672320843
10,5,161.386667967
11,5,282.790202856
12,6,424.510063887
13,6,552.033633947
14,6,612.390912056
15,6,590.436645031
16,6,490.686048031
17,6,349.133276224
18,5,212.333513021
19,5,109.728360176
20,5,47.6707849503
21,4,17.2059650421
22,3,5.17180395126
23,2,1.21017694473
24,1,0.215173006058
25,0,0.0271158218384
26,-1,0.00224709510803
