3,0,0.000174999237061
4,1,0.000247001647949
5,2,0.000330924987793
6,1,0.00043797492981
7,2,0.000638961791992
8,1,0.000648021697998
9,3,0.000777006149292
10,4,0.000952959060669
11,3,0.00207591056824
12,4,0.00138092041016
13,3,0.001384973526
