3,0,0.000262975692749
4,0,0.000277042388916
5,1,0.000345945358276
6,1,0.00832080841064
7,2,0.00033712387085
8,2,0.000458002090454
9,1,0.000473022460938
10,3,0.00424599647522
11,3,0.00115704536438
12,4,0.000853061676025
13,4,0.000888109207153
14,3,0.00107192993164
15,3,0.0407431125641
