3,1,0.000169038772583
4,2,0.0068941116333
5,3,0.0723929405212
6,4,0.686803817749
7,5,8.76181578636
8,5,61.3226830959
9,6,168.34313798
10,7,385.729236841
11,7,756.070574045
12,8,1297.58979797
13,8,3724.9220469
14,8,4752.86219096
15,8,5276.61429596
16,8,4718.239748
17,8,2161.25360203
18,8,1918.36313581
19,8,1990.34329391
20,8,1077.4158802
21,7,500.53062892
22,7,199.359215975
23,6,65.2518451214
24,5,17.4891910553
25,4,3.73919582367
26,3,0.614352941513
27,2,0.073869228363
28,1,0.00562620162964
