3,1,0.000365972518921
4,1,0.000631093978882
5,1,0.000359058380127
6,3,0.000424861907959
7,4,0.000530958175659
8,3,0.000639200210571
9,5,0.000759124755859
10,4,0.000952959060669
11,6,0.000977039337158
12,6,0.00106287002563
13,5,0.00118398666382
