3,1,0.000185012817383
4,1,0.000195980072021
5,0,0.000321865081787
6,0,0.000566959381104
7,2,0.000493049621582
8,0,7.20024108887e-05
9,2,0.000773191452026
10,4,0.000945806503296
11,3,0.00211095809937
12,5,0.00133013725281
13,3,0.00162196159363
14,5,0.0327079296112
