3,0,0.000208139419556
4,1,0.00032901763916
5,1,0.000402927398682
6,3,0.000573873519897
7,1,0.00073504447937
8,2,0.000927925109863
9,3,0.00110793113708
10,4,0.00133299827576
11,3,0.0018310546875
12,4,0.00176906585693
13,4,0.00199508666992
14,4,0.00217390060425
15,3,0.00244498252869
16,3,0.00267696380615
17,2,0.00316190719604
18,1,0.00314593315125
