3,0,0.000286102294922
4,1,0.000401020050049
5,1,0.000573873519897
6,3,0.000800848007202
7,3,0.00103998184204
8,4,0.00136995315552
9,3,0.00164103507996
10,4,0.00201296806335
11,5,0.00240707397461
12,4,0.00416994094849
13,4,0.00400710105896
14,6,0.00357508659363
15,6,0.00422096252441
16,5,0.00560188293457
17,6,0.00500798225403
18,6,0.00603103637695
19,7,0.00578594207764
20,6,0.00630307197571
21,6,0.00702214241028
22,5,0.00773906707764
23,4,0.00752687454224
24,3,0.0089259147644
25,2,0.00894594192505
