3,0,0.000217199325562
4,0,0.000298976898193
5,1,0.000427007675171
6,3,0.000602960586548
7,3,0.000839948654175
8,4,0.00098991394043
9,5,0.00120496749878
10,5,0.00159502029419
11,6,0.00236201286316
12,6,0.00188708305359
13,7,0.00258016586304
14,7,0.00313591957092
15,6,0.00307512283325
16,5,0.00394892692566
17,5,0.00382685661316
18,5,0.007080078125
19,4,0.00403904914856
