3,1,3.981590271e-05
4,2,0.0319399833679
5,3,0.193325042725
6,4,1.28845191002
7,4,4.17679691315
8,4,10.3424348831
9,5,21.5039708614
10,6,36.9510481358
11,6,53.5116198063
12,6,65.5493090153
13,7,67.8685050011
14,8,104.85807085
15,8,86.9451050758
16,8,54.089594841
17,8,28.0603709221
18,8,11.9342079163
19,7,4.10938501358
20,6,1.11657500267
21,5,0.233445167542
22,4,0.0341539382935
23,3,0.0031750202179
