3,0,0.000316143035889
4,0,0.000392913818359
5,1,0.000275135040283
6,1,0.00032901763916
7,1,0.000958204269409
8,1,0.000392913818359
9,1,0.000494956970215
10,4,0.00329494476318
11,3,0.00284504890442
12,2,0.000946044921875
13,1,0.00245189666748
14,3,0.00366902351379
15,3,0.00124716758728
16,0,0.00125098228455
17,1,0.000104904174805
