%YAML 1.1
%TAG !u! tag:unity3d.com,2011:
--- !u!1045 &1
EditorBuildSettings:
  m_ObjectHideFlags: 0
  serializedVersion: 2
  m_Scenes:
  - enabled: 1
    path: Assets/Scenes/menu.unity
    guid: d3172a121c904ec4f8aca86a8b32bc61
  - enabled: 1
    path: Assets/Scenes/firstsolution 1.unity
    guid: 8b27d41a4fad86c459eb4988fc1060dc
  - enabled: 1
    path: Assets/Scenes/thirdsolution.unity
    guid: 9fc0d4010bbf28b4594072e72b8655ab
  m_configObjects: {}
