[
         {
                  "label": "RN ten Doeschate",
                  "y": 4
         },
         {
                  "label": "J Yadav",
                  "y": 4.142857142857143
         },
         {
                  "label": "V Kohli",
                  "y": 5.454545454545454
         },
         {
                  "label": "R Ashwin",
                  "y": 5.871794871794871
         },
         {
                  "label": "S Nadeem",
                  "y": 6.142857142857143
         },
         {
                  "label": "Parvez Rasool",
                  "y": 6.2
         },
         {
                  "label": "MC Henriques",
                  "y": 6.56
         },
         {
                  "label": "Z Khan",
                  "y": 6.5793103448275865
         },
         {
                  "label": "M Vijay",
                  "y": 7
         },
         {
                  "label": "GB Hogg",
                  "y": 7.0476190476190474
         }
]