[
         {
                  "label": "Rising Pune Supergiants",
                  "y": 108
         },
         {
                  "label": "Royal Challengers Bangalore",
                  "y": 156
         },
         {
                  "label": "Mumbai Indians",
                  "y": 102
         },
         {
                  "label": "Kolkata Knight Riders",
                  "y": 122
         },
         {
                  "label": "Sunrisers Hyderabad",
                  "y": 107
         },
         {
                  "label": "Kings XI Punjab",
                  "y": 100
         },
         {
                  "label": "Gujarat Lions",
                  "y": 98
         },
         {
                  "label": "Delhi Daredevils",
                  "y": 106
         }
]