match_id,inning,batting_team,bowling_team,over,ball,batsman,non_striker,bowler,is_super_over,wide_runs,bye_runs,legbye_runs,noball_runs,penalty_runs,batsman_runs,extra_runs,total_runs,player_dismissed,dismissal_kind,fielder
578,1,Delhi Daredevils,Kolkata Knight Riders,1,1,MA Agarwal,Q de Kock,AD Russell,0,0,0,0,0,0,4,0,4,,,
578,1,Delhi Daredevils,Kolkata Knight Riders,1,2,MA Agarwal,Q de Kock,AD Russell,0,0,0,0,0,0,0,0,0,,,
578,1,Delhi Daredevils,Kolkata Knight Riders,1,3,MA Agarwal,Q de Kock,AD Russell,0,1,0,0,0,0,0,1,1,,,
578,1,Delhi Daredevils,Kolkata Knight Riders,1,4,MA Agarwal,Q de Kock,AD Russell,0,0,0,0,0,0,1,0,1,,,
578,1,Delhi Daredevils,Kolkata Knight Riders,1,5,Q de Kock,MA Agarwal,AD Russell,0,0,0,0,0,0,0,0,0,,,
578,1,Delhi Daredevils,Kolkata Knight Riders,1,6,Q de Kock,MA Agarwal,AD Russell,0,0,0,0,0,0,2,0,2,,,
578,1,Delhi Daredevils,Kolkata Knight Riders,1,7,Q de Kock,MA Agarwal,AD Russell,0,0,0,0,0,0,5,0,5,,,
578,1,Delhi Daredevils,Kolkata Knight Riders,2,1,Q de Kock,MA Agarwal,UT Yadav,0,0,0,0,0,0,0,0,0,,,
578,1,Delhi Daredevils,Kolkata Knight Riders,2,2,Q de Kock,MA Agarwal,UT Yadav,0,0,0,0,0,0,0,0,0,,,
578,1,Delhi Daredevils,Kolkata Knight Riders,2,3,Q de Kock,MA Agarwal,UT Yadav,0,0,0,0,0,0,0,0,0,,,
578,1,Delhi Daredevils,Kolkata Knight Riders,2,4,Q de Kock,MA Agarwal,UT Yadav,0,0,0,0,0,0,4,0,4,,,
578,1,Delhi Daredevils,Kolkata Knight Riders,2,5,Q de Kock,MA Agarwal,UT Yadav,0,0,0,0,0,0,6,0,6,,,
578,1,Delhi Daredevils,Kolkata Knight Riders,2,6,Q de Kock,MA Agarwal,UT Yadav,0,0,0,0,0,0,0,0,0,,,
578,1,Delhi Daredevils,Kolkata Knight Riders,3,1,MA Agarwal,Q de Kock,AD Russell,0,0,0,0,0,0,1,0,1,,,
578,1,Delhi Daredevils,Kolkata Knight Riders,3,2,Q de Kock,MA Agarwal,AD Russell,0,0,0,0,0,0,0,0,0,Q de Kock,caught,YK Pathan
578,1,Delhi Daredevils,Kolkata Knight Riders,3,3,MA Agarwal,SS Iyer,AD Russell,0,0,0,0,0,0,1,0,1,,,
578,1,Delhi Daredevils,Kolkata Knight Riders,3,4,SS Iyer,MA Agarwal,AD Russell,0,0,0,0,0,0,0,0,0,,,
578,1,Delhi Daredevils,Kolkata Knight Riders,3,5,SS Iyer,MA Agarwal,AD Russell,0,0,0,0,0,0,0,0,0,,,
578,1,Delhi Daredevils,Kolkata Knight Riders,3,6,SS Iyer,MA Agarwal,AD Russell,0,0,0,0,0,0,0,0,0,SS Iyer,lbw,
578,1,Delhi Daredevils,Kolkata Knight Riders,4,1,MA Agarwal,KK Nair,JW Hastings,0,0,0,0,0,0,0,0,0,,,
578,1,Delhi Daredevils,Kolkata Knight Riders,4,2,MA Agarwal,KK Nair,JW Hastings,0,0,0,0,0,0,0,0,0,,,
578,1,Delhi Daredevils,Kolkata Knight Riders,4,3,MA Agarwal,KK Nair,JW Hastings,0,0,0,0,0,0,0,0,0,,,
578,1,Delhi Daredevils,Kolkata Knight Riders,4,4,MA Agarwal,KK Nair,JW Hastings,0,0,0,0,0,0,1,0,1,,,
578,1,Delhi Daredevils,Kolkata Knight Riders,4,5,KK Nair,MA Agarwal,JW Hastings,0,0,0,0,0,0,0,0,0,,,
578,1,Delhi Daredevils,Kolkata Knight Riders,4,6,KK Nair,MA Agarwal,JW Hastings,0,0,0,0,0,0,0,0,0,,,
578,1,Delhi Daredevils,Kolkata Knight Riders,5,1,MA Agarwal,KK Nair,AD Russell,0,0,0,0,0,0,1,0,1,,,
578,1,Delhi Daredevils,Kolkata Knight Riders,5,2,KK Nair,MA Agarwal,AD Russell,0,1,0,0,0,0,0,1,1,,,
578,1,Delhi Daredevils,Kolkata Knight Riders,5,3,KK Nair,MA Agarwal,AD Russell,0,0,0,0,0,0,2,0,2,,,
578,1,Delhi Daredevils,Kolkata Knight Riders,5,4,KK Nair,MA Agarwal,AD Russell,0,0,0,0,0,0,0,0,0,,,
578,1,Delhi Daredevils,Kolkata Knight Riders,5,5,KK Nair,MA Agarwal,AD Russell,0,0,0,0,0,0,1,0,1,,,
578,1,Delhi Daredevils,Kolkata Knight Riders,5,6,MA Agarwal,KK Nair,AD Russell,0,0,0,0,0,0,0,0,0,MA Agarwal,caught,GB Hogg
578,1,Delhi Daredevils,Kolkata Knight Riders,5,7,SV Samson,KK Nair,AD Russell,0,0,0,0,0,0,4,0,4,,,
578,1,Delhi Daredevils,Kolkata Knight Riders,6,1,KK Nair,SV Samson,JW Hastings,0,0,0,0,0,0,0,0,0,,,
578,1,Delhi Daredevils,Kolkata Knight Riders,6,2,KK Nair,SV Samson,JW Hastings,0,0,0,0,0,0,0,0,0,,,
578,1,Delhi Daredevils,Kolkata Knight Riders,6,3,KK Nair,SV Samson,JW Hastings,0,0,0,0,0,0,0,0,0,KK Nair,caught,MK Pandey
578,1,Delhi Daredevils,Kolkata Knight Riders,6,4,P Negi,SV Samson,JW Hastings,0,0,0,0,0,0,0,0,0,,,
578,1,Delhi Daredevils,Kolkata Knight Riders,6,5,P Negi,SV Samson,JW Hastings,0,0,0,0,0,0,0,0,0,,,
578,1,Delhi Daredevils,Kolkata Knight Riders,6,6,P Negi,SV Samson,JW Hastings,0,0,0,0,0,0,0,0,0,,,
578,1,Delhi Daredevils,Kolkata Knight Riders,7,1,SV Samson,P Negi,UT Yadav,0,0,0,0,0,0,4,0,4,,,
578,1,Delhi Daredevils,Kolkata Knight Riders,7,2,SV Samson,P Negi,UT Yadav,0,0,0,0,0,0,1,0,1,,,
578,1,Delhi Daredevils,Kolkata Knight Riders,7,3,P Negi,SV Samson,UT Yadav,0,0,0,0,0,0,0,0,0,,,
578,1,Delhi Daredevils,Kolkata Knight Riders,7,4,P Negi,SV Samson,UT Yadav,0,0,0,0,0,0,1,0,1,,,
578,1,Delhi Daredevils,Kolkata Knight Riders,7,5,SV Samson,P Negi,UT Yadav,0,0,0,0,0,0,0,0,0,,,
578,1,Delhi Daredevils,Kolkata Knight Riders,7,6,SV Samson,P Negi,UT Yadav,0,0,0,0,0,0,1,0,1,,,
578,1,Delhi Daredevils,Kolkata Knight Riders,8,1,SV Samson,P Negi,C Munro,0,0,0,0,0,0,1,0,1,,,
578,1,Delhi Daredevils,Kolkata Knight Riders,8,2,P Negi,SV Samson,C Munro,0,0,0,0,0,0,0,0,0,,,
578,1,Delhi Daredevils,Kolkata Knight Riders,8,3,P Negi,SV Samson,C Munro,0,0,0,0,0,0,0,0,0,,,
578,1,Delhi Daredevils,Kolkata Knight Riders,8,4,P Negi,SV Samson,C Munro,0,0,0,0,0,0,6,0,6,,,
578,1,Delhi Daredevils,Kolkata Knight Riders,8,5,P Negi,SV Samson,C Munro,0,0,0,0,0,0,0,0,0,,,
578,1,Delhi Daredevils,Kolkata Knight Riders,8,6,P Negi,SV Samson,C Munro,0,0,0,0,0,0,0,0,0,,,
578,1,Delhi Daredevils,Kolkata Knight Riders,9,1,SV Samson,P Negi,UT Yadav,0,0,0,0,0,0,1,0,1,,,
578,1,Delhi Daredevils,Kolkata Knight Riders,9,2,P Negi,SV Samson,UT Yadav,0,0,0,0,0,0,2,0,2,,,
578,1,Delhi Daredevils,Kolkata Knight Riders,9,3,P Negi,SV Samson,UT Yadav,0,0,0,0,0,0,0,0,0,,,
578,1,Delhi Daredevils,Kolkata Knight Riders,9,4,P Negi,SV Samson,UT Yadav,0,0,0,0,0,0,0,0,0,,,
578,1,Delhi Daredevils,Kolkata Knight Riders,9,5,P Negi,SV Samson,UT Yadav,0,0,0,0,0,0,0,0,0,,,
578,1,Delhi Daredevils,Kolkata Knight Riders,9,6,P Negi,SV Samson,UT Yadav,0,0,0,0,0,0,1,0,1,,,
578,1,Delhi Daredevils,Kolkata Knight Riders,10,1,P Negi,SV Samson,GB Hogg,0,0,0,0,0,0,0,0,0,,,
578,1,Delhi Daredevils,Kolkata Knight Riders,10,2,P Negi,SV Samson,GB Hogg,0,0,0,0,0,0,1,0,1,,,
578,1,Delhi Daredevils,Kolkata Knight Riders,10,3,SV Samson,P Negi,GB Hogg,0,0,0,0,0,0,0,0,0,,,
578,1,Delhi Daredevils,Kolkata Knight Riders,10,4,SV Samson,P Negi,GB Hogg,0,0,0,0,0,0,1,0,1,,,
578,1,Delhi Daredevils,Kolkata Knight Riders,10,5,P Negi,SV Samson,GB Hogg,0,0,0,0,0,0,0,0,0,,,
578,1,Delhi Daredevils,Kolkata Knight Riders,10,6,P Negi,SV Samson,GB Hogg,0,0,0,0,0,0,0,0,0,P Negi,stumped,RV Uthappa
578,1,Delhi Daredevils,Kolkata Knight Riders,11,1,SV Samson,CR Brathwaite,PP Chawla,0,0,0,0,0,0,1,0,1,,,
578,1,Delhi Daredevils,Kolkata Knight Riders,11,2,CR Brathwaite,SV Samson,PP Chawla,0,5,0,0,0,0,0,5,5,,,
578,1,Delhi Daredevils,Kolkata Knight Riders,11,3,CR Brathwaite,SV Samson,PP Chawla,0,0,0,0,0,0,6,0,6,,,
578,1,Delhi Daredevils,Kolkata Knight Riders,11,4,CR Brathwaite,SV Samson,PP Chawla,0,0,0,0,0,0,0,0,0,,,
578,1,Delhi Daredevils,Kolkata Knight Riders,11,5,CR Brathwaite,SV Samson,PP Chawla,0,0,0,0,0,0,0,0,0,,,
578,1,Delhi Daredevils,Kolkata Knight Riders,11,6,CR Brathwaite,SV Samson,PP Chawla,0,0,0,0,0,0,0,0,0,CR Brathwaite,lbw,
578,1,Delhi Daredevils,Kolkata Knight Riders,11,7,CH Morris,SV Samson,PP Chawla,0,0,0,0,0,0,1,0,1,,,
578,1,Delhi Daredevils,Kolkata Knight Riders,12,1,CH Morris,SV Samson,GB Hogg,0,0,0,0,0,0,4,0,4,,,
578,1,Delhi Daredevils,Kolkata Knight Riders,12,2,CH Morris,SV Samson,GB Hogg,0,0,0,0,0,0,0,0,0,,,
578,1,Delhi Daredevils,Kolkata Knight Riders,12,3,CH Morris,SV Samson,GB Hogg,0,0,0,0,0,0,1,0,1,,,
578,1,Delhi Daredevils,Kolkata Knight Riders,12,4,SV Samson,CH Morris,GB Hogg,0,0,0,0,0,0,0,0,0,,,
578,1,Delhi Daredevils,Kolkata Knight Riders,12,5,SV Samson,CH Morris,GB Hogg,0,0,0,0,0,0,1,0,1,,,
578,1,Delhi Daredevils,Kolkata Knight Riders,12,6,CH Morris,SV Samson,GB Hogg,0,5,0,0,0,0,0,5,5,,,
578,1,Delhi Daredevils,Kolkata Knight Riders,12,7,CH Morris,SV Samson,GB Hogg,0,0,0,0,0,0,1,0,1,,,
578,1,Delhi Daredevils,Kolkata Knight Riders,13,1,CH Morris,SV Samson,PP Chawla,0,0,0,0,0,0,0,0,0,,,
578,1,Delhi Daredevils,Kolkata Knight Riders,13,2,CH Morris,SV Samson,PP Chawla,0,0,0,0,0,0,0,0,0,,,
578,1,Delhi Daredevils,Kolkata Knight Riders,13,3,CH Morris,SV Samson,PP Chawla,0,0,0,0,0,0,4,0,4,,,
578,1,Delhi Daredevils,Kolkata Knight Riders,13,4,CH Morris,SV Samson,PP Chawla,0,0,0,0,0,0,0,0,0,CH Morris,bowled,
578,1,Delhi Daredevils,Kolkata Knight Riders,13,5,NM Coulter-Nile,SV Samson,PP Chawla,0,0,0,0,0,0,0,0,0,,,
578,1,Delhi Daredevils,Kolkata Knight Riders,13,6,NM Coulter-Nile,SV Samson,PP Chawla,0,0,0,0,0,0,0,0,0,,,
578,1,Delhi Daredevils,Kolkata Knight Riders,14,1,SV Samson,NM Coulter-Nile,GB Hogg,0,0,0,0,0,0,0,0,0,SV Samson,caught,RV Uthappa
578,1,Delhi Daredevils,Kolkata Knight Riders,14,2,A Mishra,NM Coulter-Nile,GB Hogg,0,0,0,0,0,0,0,0,0,,,
578,1,Delhi Daredevils,Kolkata Knight Riders,14,3,A Mishra,NM Coulter-Nile,GB Hogg,0,0,0,0,0,0,1,0,1,,,
578,1,Delhi Daredevils,Kolkata Knight Riders,14,4,NM Coulter-Nile,A Mishra,GB Hogg,0,0,0,0,0,0,0,0,0,,,
578,1,Delhi Daredevils,Kolkata Knight Riders,14,5,NM Coulter-Nile,A Mishra,GB Hogg,0,0,0,0,0,0,4,0,4,,,
578,1,Delhi Daredevils,Kolkata Knight Riders,14,6,NM Coulter-Nile,A Mishra,GB Hogg,0,0,0,0,0,0,0,0,0,,,
578,1,Delhi Daredevils,Kolkata Knight Riders,15,1,A Mishra,NM Coulter-Nile,PP Chawla,0,0,0,0,0,0,0,0,0,,,
578,1,Delhi Daredevils,Kolkata Knight Riders,15,2,A Mishra,NM Coulter-Nile,PP Chawla,0,0,0,0,0,0,1,0,1,,,
578,1,Delhi Daredevils,Kolkata Knight Riders,15,3,NM Coulter-Nile,A Mishra,PP Chawla,0,0,0,0,0,0,0,0,0,,,
578,1,Delhi Daredevils,Kolkata Knight Riders,15,4,NM Coulter-Nile,A Mishra,PP Chawla,0,0,0,0,0,0,1,0,1,,,
578,1,Delhi Daredevils,Kolkata Knight Riders,15,5,A Mishra,NM Coulter-Nile,PP Chawla,0,0,0,0,0,0,1,0,1,,,
578,1,Delhi Daredevils,Kolkata Knight Riders,15,6,NM Coulter-Nile,A Mishra,PP Chawla,0,0,0,0,0,0,0,0,0,,,
578,1,Delhi Daredevils,Kolkata Knight Riders,16,1,A Mishra,NM Coulter-Nile,GB Hogg,0,0,0,0,0,0,0,0,0,,,
578,1,Delhi Daredevils,Kolkata Knight Riders,16,2,A Mishra,NM Coulter-Nile,GB Hogg,0,0,0,0,0,0,0,0,0,,,
578,1,Delhi Daredevils,Kolkata Knight Riders,16,3,A Mishra,NM Coulter-Nile,GB Hogg,0,0,0,0,0,0,0,0,0,,,
578,1,Delhi Daredevils,Kolkata Knight Riders,16,4,A Mishra,NM Coulter-Nile,GB Hogg,0,0,0,0,0,0,0,0,0,A Mishra,caught,G Gambhir
578,1,Delhi Daredevils,Kolkata Knight Riders,16,5,Z Khan,NM Coulter-Nile,GB Hogg,0,0,0,0,0,0,0,0,0,,,
578,1,Delhi Daredevils,Kolkata Knight Riders,16,6,Z Khan,NM Coulter-Nile,GB Hogg,0,0,0,0,0,0,0,0,0,,,
578,1,Delhi Daredevils,Kolkata Knight Riders,17,1,NM Coulter-Nile,Z Khan,PP Chawla,0,0,0,0,0,0,0,0,0,,,
578,1,Delhi Daredevils,Kolkata Knight Riders,17,2,NM Coulter-Nile,Z Khan,PP Chawla,0,0,0,0,0,0,1,0,1,,,
578,1,Delhi Daredevils,Kolkata Knight Riders,17,3,Z Khan,NM Coulter-Nile,PP Chawla,0,0,0,0,0,0,0,0,0,,,
578,1,Delhi Daredevils,Kolkata Knight Riders,17,4,Z Khan,NM Coulter-Nile,PP Chawla,0,0,0,0,0,0,0,0,0,,,
578,1,Delhi Daredevils,Kolkata Knight Riders,17,5,Z Khan,NM Coulter-Nile,PP Chawla,0,0,0,0,0,0,0,0,0,,,
578,1,Delhi Daredevils,Kolkata Knight Riders,17,6,Z Khan,NM Coulter-Nile,PP Chawla,0,0,0,0,0,0,0,0,0,,,
578,1,Delhi Daredevils,Kolkata Knight Riders,18,1,NM Coulter-Nile,Z Khan,JW Hastings,0,0,0,0,0,0,1,0,1,,,
578,1,Delhi Daredevils,Kolkata Knight Riders,18,2,Z Khan,NM Coulter-Nile,JW Hastings,0,0,0,0,0,0,0,0,0,,,
578,1,Delhi Daredevils,Kolkata Knight Riders,18,3,Z Khan,NM Coulter-Nile,JW Hastings,0,0,0,0,0,0,4,0,4,,,
578,1,Delhi Daredevils,Kolkata Knight Riders,18,4,Z Khan,NM Coulter-Nile,JW Hastings,0,0,0,0,0,0,0,0,0,Z Khan,caught,MK Pandey
578,2,Kolkata Knight Riders,Delhi Daredevils,1,1,RV Uthappa,G Gambhir,NM Coulter-Nile,0,0,0,0,0,0,0,0,0,,,
578,2,Kolkata Knight Riders,Delhi Daredevils,1,2,RV Uthappa,G Gambhir,NM Coulter-Nile,0,0,0,0,0,0,0,0,0,,,
578,2,Kolkata Knight Riders,Delhi Daredevils,1,3,RV Uthappa,G Gambhir,NM Coulter-Nile,0,0,0,0,0,0,0,0,0,,,
578,2,Kolkata Knight Riders,Delhi Daredevils,1,4,RV Uthappa,G Gambhir,NM Coulter-Nile,0,0,0,0,0,0,0,0,0,,,
578,2,Kolkata Knight Riders,Delhi Daredevils,1,5,RV Uthappa,G Gambhir,NM Coulter-Nile,0,0,0,0,0,0,0,0,0,,,
578,2,Kolkata Knight Riders,Delhi Daredevils,1,6,RV Uthappa,G Gambhir,NM Coulter-Nile,0,0,0,0,0,0,4,0,4,,,
578,2,Kolkata Knight Riders,Delhi Daredevils,2,1,G Gambhir,RV Uthappa,Z Khan,0,1,0,0,0,0,0,1,1,,,
578,2,Kolkata Knight Riders,Delhi Daredevils,2,2,G Gambhir,RV Uthappa,Z Khan,0,0,0,0,0,0,4,0,4,,,
578,2,Kolkata Knight Riders,Delhi Daredevils,2,3,G Gambhir,RV Uthappa,Z Khan,0,0,0,0,0,0,2,0,2,,,
578,2,Kolkata Knight Riders,Delhi Daredevils,2,4,G Gambhir,RV Uthappa,Z Khan,0,0,0,0,0,0,0,0,0,,,
578,2,Kolkata Knight Riders,Delhi Daredevils,2,5,G Gambhir,RV Uthappa,Z Khan,0,0,0,0,0,0,4,0,4,,,
578,2,Kolkata Knight Riders,Delhi Daredevils,2,6,G Gambhir,RV Uthappa,Z Khan,0,0,0,0,0,0,1,0,1,,,
578,2,Kolkata Knight Riders,Delhi Daredevils,2,7,RV Uthappa,G Gambhir,Z Khan,0,0,0,0,0,0,4,0,4,,,
578,2,Kolkata Knight Riders,Delhi Daredevils,3,1,G Gambhir,RV Uthappa,NM Coulter-Nile,0,0,0,0,0,0,0,0,0,,,
578,2,Kolkata Knight Riders,Delhi Daredevils,3,2,G Gambhir,RV Uthappa,NM Coulter-Nile,0,0,0,0,0,0,0,0,0,,,
578,2,Kolkata Knight Riders,Delhi Daredevils,3,3,G Gambhir,RV Uthappa,NM Coulter-Nile,0,0,0,0,0,0,1,0,1,,,
578,2,Kolkata Knight Riders,Delhi Daredevils,3,4,RV Uthappa,G Gambhir,NM Coulter-Nile,0,0,0,0,0,0,0,0,0,,,
578,2,Kolkata Knight Riders,Delhi Daredevils,3,5,RV Uthappa,G Gambhir,NM Coulter-Nile,0,0,0,0,0,0,4,0,4,,,
578,2,Kolkata Knight Riders,Delhi Daredevils,3,6,RV Uthappa,G Gambhir,NM Coulter-Nile,0,0,0,0,0,0,4,0,4,,,
578,2,Kolkata Knight Riders,Delhi Daredevils,4,1,G Gambhir,RV Uthappa,CH Morris,0,0,0,0,0,0,1,0,1,,,
578,2,Kolkata Knight Riders,Delhi Daredevils,4,2,RV Uthappa,G Gambhir,CH Morris,0,0,0,0,0,0,0,0,0,,,
578,2,Kolkata Knight Riders,Delhi Daredevils,4,3,RV Uthappa,G Gambhir,CH Morris,0,0,0,0,0,0,0,0,0,,,
578,2,Kolkata Knight Riders,Delhi Daredevils,4,4,RV Uthappa,G Gambhir,CH Morris,0,0,0,0,0,0,4,0,4,,,
578,2,Kolkata Knight Riders,Delhi Daredevils,4,5,RV Uthappa,G Gambhir,CH Morris,0,0,0,0,0,0,0,0,0,,,
578,2,Kolkata Knight Riders,Delhi Daredevils,4,6,RV Uthappa,G Gambhir,CH Morris,0,1,0,0,0,0,0,1,1,,,
578,2,Kolkata Knight Riders,Delhi Daredevils,4,7,RV Uthappa,G Gambhir,CH Morris,0,0,0,0,0,0,1,0,1,,,
578,2,Kolkata Knight Riders,Delhi Daredevils,5,1,RV Uthappa,G Gambhir,Z Khan,0,0,0,0,0,0,0,0,0,,,
578,2,Kolkata Knight Riders,Delhi Daredevils,5,2,RV Uthappa,G Gambhir,Z Khan,0,0,0,0,0,0,1,0,1,,,
578,2,Kolkata Knight Riders,Delhi Daredevils,5,3,G Gambhir,RV Uthappa,Z Khan,0,0,0,0,0,0,0,0,0,,,
578,2,Kolkata Knight Riders,Delhi Daredevils,5,4,G Gambhir,RV Uthappa,Z Khan,0,0,0,0,0,0,0,0,0,,,
578,2,Kolkata Knight Riders,Delhi Daredevils,5,5,G Gambhir,RV Uthappa,Z Khan,0,0,0,0,0,0,1,0,1,,,
578,2,Kolkata Knight Riders,Delhi Daredevils,5,6,RV Uthappa,G Gambhir,Z Khan,0,0,0,0,0,0,4,0,4,,,
578,2,Kolkata Knight Riders,Delhi Daredevils,6,1,G Gambhir,RV Uthappa,CH Morris,0,0,0,0,0,0,0,0,0,,,
578,2,Kolkata Knight Riders,Delhi Daredevils,6,2,G Gambhir,RV Uthappa,CH Morris,0,0,0,0,0,0,1,0,1,,,
578,2,Kolkata Knight Riders,Delhi Daredevils,6,3,RV Uthappa,G Gambhir,CH Morris,0,0,0,0,0,0,0,0,0,,,
578,2,Kolkata Knight Riders,Delhi Daredevils,6,4,RV Uthappa,G Gambhir,CH Morris,0,0,0,0,0,0,4,0,4,,,
578,2,Kolkata Knight Riders,Delhi Daredevils,6,5,RV Uthappa,G Gambhir,CH Morris,0,0,0,0,0,0,0,0,0,,,
578,2,Kolkata Knight Riders,Delhi Daredevils,6,6,RV Uthappa,G Gambhir,CH Morris,0,0,0,0,0,0,0,0,0,,,
578,2,Kolkata Knight Riders,Delhi Daredevils,7,1,G Gambhir,RV Uthappa,CR Brathwaite,0,0,0,0,0,0,0,0,0,,,
578,2,Kolkata Knight Riders,Delhi Daredevils,7,2,G Gambhir,RV Uthappa,CR Brathwaite,0,0,0,0,0,0,1,0,1,,,
578,2,Kolkata Knight Riders,Delhi Daredevils,7,3,RV Uthappa,G Gambhir,CR Brathwaite,0,0,0,0,0,0,1,0,1,,,
578,2,Kolkata Knight Riders,Delhi Daredevils,7,4,G Gambhir,RV Uthappa,CR Brathwaite,0,0,0,0,0,0,0,0,0,,,
578,2,Kolkata Knight Riders,Delhi Daredevils,7,5,G Gambhir,RV Uthappa,CR Brathwaite,0,0,0,0,0,0,0,0,0,,,
578,2,Kolkata Knight Riders,Delhi Daredevils,7,6,G Gambhir,RV Uthappa,CR Brathwaite,0,0,0,0,0,0,0,0,0,,,
578,2,Kolkata Knight Riders,Delhi Daredevils,8,1,RV Uthappa,G Gambhir,A Mishra,0,0,0,0,0,0,0,0,0,,,
578,2,Kolkata Knight Riders,Delhi Daredevils,8,2,RV Uthappa,G Gambhir,A Mishra,0,0,0,0,0,0,1,0,1,,,
578,2,Kolkata Knight Riders,Delhi Daredevils,8,3,G Gambhir,RV Uthappa,A Mishra,0,0,0,0,0,0,1,0,1,,,
578,2,Kolkata Knight Riders,Delhi Daredevils,8,4,RV Uthappa,G Gambhir,A Mishra,0,0,0,0,0,0,0,0,0,,,
578,2,Kolkata Knight Riders,Delhi Daredevils,8,5,RV Uthappa,G Gambhir,A Mishra,0,0,0,0,0,0,1,0,1,,,
578,2,Kolkata Knight Riders,Delhi Daredevils,8,6,G Gambhir,RV Uthappa,A Mishra,0,0,0,0,0,0,1,0,1,,,
578,2,Kolkata Knight Riders,Delhi Daredevils,9,1,G Gambhir,RV Uthappa,CR Brathwaite,0,0,0,0,0,0,0,0,0,,,
578,2,Kolkata Knight Riders,Delhi Daredevils,9,2,G Gambhir,RV Uthappa,CR Brathwaite,0,0,2,0,0,0,0,2,2,,,
578,2,Kolkata Knight Riders,Delhi Daredevils,9,3,G Gambhir,RV Uthappa,CR Brathwaite,0,0,0,0,0,0,1,0,1,,,
578,2,Kolkata Knight Riders,Delhi Daredevils,9,4,RV Uthappa,G Gambhir,CR Brathwaite,0,0,0,0,1,0,0,1,1,,,
578,2,Kolkata Knight Riders,Delhi Daredevils,9,5,RV Uthappa,G Gambhir,CR Brathwaite,0,0,0,0,0,0,0,0,0,,,
578,2,Kolkata Knight Riders,Delhi Daredevils,9,6,RV Uthappa,G Gambhir,CR Brathwaite,0,0,0,0,0,0,1,0,1,,,
578,2,Kolkata Knight Riders,Delhi Daredevils,9,7,G Gambhir,RV Uthappa,CR Brathwaite,0,0,0,0,0,0,4,0,4,,,
578,2,Kolkata Knight Riders,Delhi Daredevils,10,1,RV Uthappa,G Gambhir,A Mishra,0,5,0,0,0,0,0,5,5,,,
578,2,Kolkata Knight Riders,Delhi Daredevils,10,2,RV Uthappa,G Gambhir,A Mishra,0,0,0,0,0,0,0,0,0,,,
578,2,Kolkata Knight Riders,Delhi Daredevils,10,3,RV Uthappa,G Gambhir,A Mishra,0,0,0,0,0,0,1,0,1,,,
578,2,Kolkata Knight Riders,Delhi Daredevils,10,4,G Gambhir,RV Uthappa,A Mishra,0,0,0,0,0,0,1,0,1,,,
578,2,Kolkata Knight Riders,Delhi Daredevils,10,5,RV Uthappa,G Gambhir,A Mishra,0,0,0,0,0,0,0,0,0,RV Uthappa,caught,CH Morris
578,2,Kolkata Knight Riders,Delhi Daredevils,10,6,MK Pandey,G Gambhir,A Mishra,0,0,0,0,0,0,0,0,0,,,
578,2,Kolkata Knight Riders,Delhi Daredevils,10,7,MK Pandey,G Gambhir,A Mishra,0,0,0,0,0,0,0,0,0,,,
578,2,Kolkata Knight Riders,Delhi Daredevils,11,1,G Gambhir,MK Pandey,CH Morris,0,0,0,0,0,0,0,0,0,,,
578,2,Kolkata Knight Riders,Delhi Daredevils,11,2,G Gambhir,MK Pandey,CH Morris,0,0,0,0,0,0,1,0,1,,,
578,2,Kolkata Knight Riders,Delhi Daredevils,11,3,MK Pandey,G Gambhir,CH Morris,0,0,0,0,0,0,4,0,4,,,
578,2,Kolkata Knight Riders,Delhi Daredevils,11,4,MK Pandey,G Gambhir,CH Morris,0,0,0,0,0,0,1,0,1,,,
578,2,Kolkata Knight Riders,Delhi Daredevils,11,5,G Gambhir,MK Pandey,CH Morris,0,0,0,0,0,0,0,0,0,,,
578,2,Kolkata Knight Riders,Delhi Daredevils,11,6,G Gambhir,MK Pandey,CH Morris,0,0,0,0,0,0,1,0,1,,,
578,2,Kolkata Knight Riders,Delhi Daredevils,12,1,G Gambhir,MK Pandey,NM Coulter-Nile,0,0,0,0,0,0,4,0,4,,,
578,2,Kolkata Knight Riders,Delhi Daredevils,12,2,G Gambhir,MK Pandey,NM Coulter-Nile,0,0,0,0,0,0,1,0,1,,,
578,2,Kolkata Knight Riders,Delhi Daredevils,12,3,MK Pandey,G Gambhir,NM Coulter-Nile,0,0,0,0,0,0,1,0,1,,,
578,2,Kolkata Knight Riders,Delhi Daredevils,12,4,G Gambhir,MK Pandey,NM Coulter-Nile,0,0,0,0,0,0,0,0,0,,,
578,2,Kolkata Knight Riders,Delhi Daredevils,12,5,G Gambhir,MK Pandey,NM Coulter-Nile,0,0,0,0,0,0,0,0,0,,,
578,2,Kolkata Knight Riders,Delhi Daredevils,12,6,G Gambhir,MK Pandey,NM Coulter-Nile,0,0,0,0,0,0,0,0,0,,,
578,2,Kolkata Knight Riders,Delhi Daredevils,13,1,MK Pandey,G Gambhir,CH Morris,0,0,0,0,0,0,0,0,0,,,
578,2,Kolkata Knight Riders,Delhi Daredevils,13,2,MK Pandey,G Gambhir,CH Morris,0,0,0,0,0,0,0,0,0,,,
578,2,Kolkata Knight Riders,Delhi Daredevils,13,3,MK Pandey,G Gambhir,CH Morris,0,0,0,0,0,0,0,0,0,,,
578,2,Kolkata Knight Riders,Delhi Daredevils,13,4,MK Pandey,G Gambhir,CH Morris,0,0,0,0,0,0,1,0,1,,,
578,2,Kolkata Knight Riders,Delhi Daredevils,13,5,G Gambhir,MK Pandey,CH Morris,0,0,0,0,0,0,1,0,1,,,
578,2,Kolkata Knight Riders,Delhi Daredevils,13,6,MK Pandey,G Gambhir,CH Morris,0,0,0,0,0,0,0,0,0,,,
578,2,Kolkata Knight Riders,Delhi Daredevils,14,1,G Gambhir,MK Pandey,NM Coulter-Nile,0,0,0,0,0,0,4,0,4,,,
578,2,Kolkata Knight Riders,Delhi Daredevils,14,2,G Gambhir,MK Pandey,NM Coulter-Nile,0,0,0,0,0,0,0,0,0,,,
578,2,Kolkata Knight Riders,Delhi Daredevils,14,3,G Gambhir,MK Pandey,NM Coulter-Nile,0,0,0,0,0,0,0,0,0,,,
578,2,Kolkata Knight Riders,Delhi Daredevils,14,4,G Gambhir,MK Pandey,NM Coulter-Nile,0,0,0,0,0,0,1,0,1,,,
578,2,Kolkata Knight Riders,Delhi Daredevils,14,5,MK Pandey,G Gambhir,NM Coulter-Nile,0,0,0,0,0,0,4,0,4,,,
578,2,Kolkata Knight Riders,Delhi Daredevils,14,6,MK Pandey,G Gambhir,NM Coulter-Nile,0,0,0,0,0,0,4,0,4,,,
578,2,Kolkata Knight Riders,Delhi Daredevils,15,1,G Gambhir,MK Pandey,Z Khan,0,1,0,0,0,0,0,1,1,,,
578,2,Kolkata Knight Riders,Delhi Daredevils,15,2,G Gambhir,MK Pandey,Z Khan,0,0,0,0,0,0,1,0,1,,,
579,1,Kings XI Punjab,Gujarat Lions,1,1,M Vijay,M Vohra,P Kumar,0,0,0,0,0,0,1,0,1,,,
579,1,Kings XI Punjab,Gujarat Lions,1,2,M Vohra,M Vijay,P Kumar,0,0,0,0,0,0,0,0,0,,,
579,1,Kings XI Punjab,Gujarat Lions,1,3,M Vohra,M Vijay,P Kumar,0,0,0,0,0,0,0,0,0,,,
579,1,Kings XI Punjab,Gujarat Lions,1,4,M Vohra,M Vijay,P Kumar,0,0,0,0,0,0,1,0,1,,,
579,1,Kings XI Punjab,Gujarat Lions,1,5,M Vijay,M Vohra,P Kumar,0,0,0,0,0,0,0,0,0,,,
579,1,Kings XI Punjab,Gujarat Lions,1,6,M Vijay,M Vohra,P Kumar,0,0,0,0,0,0,1,0,1,,,
579,1,Kings XI Punjab,Gujarat Lions,2,1,M Vijay,M Vohra,PJ Sangwan,0,0,0,0,0,0,0,0,0,,,
579,1,Kings XI Punjab,Gujarat Lions,2,2,M Vijay,M Vohra,PJ Sangwan,0,0,0,0,0,0,0,0,0,,,
579,1,Kings XI Punjab,Gujarat Lions,2,3,M Vijay,M Vohra,PJ Sangwan,0,0,0,0,0,0,0,0,0,,,
579,1,Kings XI Punjab,Gujarat Lions,2,4,M Vijay,M Vohra,PJ Sangwan,0,0,0,0,0,0,0,0,0,,,
579,1,Kings XI Punjab,Gujarat Lions,2,5,M Vijay,M Vohra,PJ Sangwan,0,0,0,0,0,0,6,0,6,,,
579,1,Kings XI Punjab,Gujarat Lions,2,6,M Vijay,M Vohra,PJ Sangwan,0,0,0,0,0,0,4,0,4,,,
579,1,Kings XI Punjab,Gujarat Lions,3,1,M Vohra,M Vijay,P Kumar,0,0,0,0,0,0,1,0,1,,,
579,1,Kings XI Punjab,Gujarat Lions,3,2,M Vijay,M Vohra,P Kumar,0,0,0,0,0,0,1,0,1,,,
579,1,Kings XI Punjab,Gujarat Lions,3,3,M Vohra,M Vijay,P Kumar,0,0,0,0,0,0,0,0,0,,,
579,1,Kings XI Punjab,Gujarat Lions,3,4,M Vohra,M Vijay,P Kumar,0,0,0,0,0,0,1,0,1,,,
579,1,Kings XI Punjab,Gujarat Lions,3,5,M Vijay,M Vohra,P Kumar,0,0,0,0,0,0,4,0,4,,,
579,1,Kings XI Punjab,Gujarat Lions,3,6,M Vijay,M Vohra,P Kumar,0,0,0,0,0,0,0,0,0,,,
579,1,Kings XI Punjab,Gujarat Lions,4,1,M Vohra,M Vijay,PJ Sangwan,0,0,0,0,0,0,1,0,1,,,
579,1,Kings XI Punjab,Gujarat Lions,4,2,M Vijay,M Vohra,PJ Sangwan,0,0,0,0,0,0,0,0,0,,,
579,1,Kings XI Punjab,Gujarat Lions,4,3,M Vijay,M Vohra,PJ Sangwan,0,0,0,0,0,0,4,0,4,,,
579,1,Kings XI Punjab,Gujarat Lions,4,4,M Vijay,M Vohra,PJ Sangwan,0,0,0,0,0,0,2,0,2,,,
579,1,Kings XI Punjab,Gujarat Lions,4,5,M Vijay,M Vohra,PJ Sangwan,0,0,0,0,0,0,4,0,4,,,
579,1,Kings XI Punjab,Gujarat Lions,4,6,M Vijay,M Vohra,PJ Sangwan,0,0,0,0,0,0,0,0,0,,,
579,1,Kings XI Punjab,Gujarat Lions,5,1,M Vohra,M Vijay,JP Faulkner,0,0,0,0,0,0,4,0,4,,,
579,1,Kings XI Punjab,Gujarat Lions,5,2,M Vohra,M Vijay,JP Faulkner,0,0,0,0,0,0,2,0,2,,,
579,1,Kings XI Punjab,Gujarat Lions,5,3,M Vohra,M Vijay,JP Faulkner,0,0,0,0,0,0,0,0,0,,,
579,1,Kings XI Punjab,Gujarat Lions,5,4,M Vohra,M Vijay,JP Faulkner,0,0,0,0,0,0,0,0,0,,,
579,1,Kings XI Punjab,Gujarat Lions,5,5,M Vohra,M Vijay,JP Faulkner,0,0,0,0,0,0,4,0,4,,,
579,1,Kings XI Punjab,Gujarat Lions,5,6,M Vohra,M Vijay,JP Faulkner,0,0,0,0,0,0,4,0,4,,,
579,1,Kings XI Punjab,Gujarat Lions,6,1,M Vijay,M Vohra,S Ladda,0,0,0,0,0,0,0,0,0,,,
579,1,Kings XI Punjab,Gujarat Lions,6,2,M Vijay,M Vohra,S Ladda,0,0,0,0,0,0,1,0,1,,,
579,1,Kings XI Punjab,Gujarat Lions,6,3,M Vohra,M Vijay,S Ladda,0,0,0,0,0,0,1,0,1,,,
579,1,Kings XI Punjab,Gujarat Lions,6,4,M Vijay,M Vohra,S Ladda,0,0,0,0,0,0,4,0,4,,,
579,1,Kings XI Punjab,Gujarat Lions,6,5,M Vijay,M Vohra,S Ladda,0,0,0,0,0,0,0,0,0,,,
579,1,Kings XI Punjab,Gujarat Lions,6,6,M Vijay,M Vohra,S Ladda,0,0,0,0,0,0,1,0,1,,,
579,1,Kings XI Punjab,Gujarat Lions,7,1,M Vijay,M Vohra,RA Jadeja,0,0,0,1,0,0,0,1,1,,,
579,1,Kings XI Punjab,Gujarat Lions,7,2,M Vohra,M Vijay,RA Jadeja,0,0,0,0,0,0,0,0,0,,,
579,1,Kings XI Punjab,Gujarat Lions,7,3,M Vohra,M Vijay,RA Jadeja,0,0,0,0,0,0,0,0,0,,,
579,1,Kings XI Punjab,Gujarat Lions,7,4,M Vohra,M Vijay,RA Jadeja,0,0,0,1,0,0,0,1,1,,,
579,1,Kings XI Punjab,Gujarat Lions,7,5,M Vijay,M Vohra,RA Jadeja,0,0,0,0,0,0,1,0,1,,,
579,1,Kings XI Punjab,Gujarat Lions,7,6,M Vohra,M Vijay,RA Jadeja,0,0,0,0,0,0,2,0,2,,,
579,1,Kings XI Punjab,Gujarat Lions,8,1,M Vijay,M Vohra,S Ladda,0,0,0,0,0,0,0,0,0,,,
579,1,Kings XI Punjab,Gujarat Lions,8,2,M Vijay,M Vohra,S Ladda,0,0,0,0,0,0,2,0,2,,,
579,1,Kings XI Punjab,Gujarat Lions,8,3,M Vijay,M Vohra,S Ladda,0,0,0,0,0,0,1,0,1,,,
579,1,Kings XI Punjab,Gujarat Lions,8,4,M Vohra,M Vijay,S Ladda,0,0,0,0,0,0,6,0,6,,,
579,1,Kings XI Punjab,Gujarat Lions,8,5,M Vohra,M Vijay,S Ladda,0,0,0,0,0,0,4,0,4,,,
579,1,Kings XI Punjab,Gujarat Lions,8,6,M Vohra,M Vijay,S Ladda,0,0,0,0,0,0,1,0,1,,,
579,1,Kings XI Punjab,Gujarat Lions,9,1,M Vohra,M Vijay,RA Jadeja,0,1,0,0,0,0,0,1,1,,,
579,1,Kings XI Punjab,Gujarat Lions,9,2,M Vohra,M Vijay,RA Jadeja,0,0,0,0,0,0,6,0,6,,,
579,1,Kings XI Punjab,Gujarat Lions,9,3,M Vohra,M Vijay,RA Jadeja,0,0,0,0,0,0,0,0,0,M Vohra,caught,KD Karthik
579,1,Kings XI Punjab,Gujarat Lions,9,4,DA Miller,M Vijay,RA Jadeja,0,0,0,0,0,0,0,0,0,,,
579,1,Kings XI Punjab,Gujarat Lions,9,5,DA Miller,M Vijay,RA Jadeja,0,0,0,0,0,0,4,0,4,,,
579,1,Kings XI Punjab,Gujarat Lions,9,6,DA Miller,M Vijay,RA Jadeja,0,0,0,0,0,0,0,0,0,,,
579,1,Kings XI Punjab,Gujarat Lions,9,7,DA Miller,M Vijay,RA Jadeja,0,0,0,0,0,0,0,0,0,,,
579,1,Kings XI Punjab,Gujarat Lions,10,1,M Vijay,DA Miller,DJ Bravo,0,0,0,0,0,0,1,0,1,,,
579,1,Kings XI Punjab,Gujarat Lions,10,2,DA Miller,M Vijay,DJ Bravo,0,0,0,0,0,0,1,0,1,,,
579,1,Kings XI Punjab,Gujarat Lions,10,3,M Vijay,DA Miller,DJ Bravo,0,0,0,0,0,0,0,0,0,,,
579,1,Kings XI Punjab,Gujarat Lions,10,4,M Vijay,DA Miller,DJ Bravo,0,0,0,0,0,0,2,0,2,,,
579,1,Kings XI Punjab,Gujarat Lions,10,5,M Vijay,DA Miller,DJ Bravo,0,0,0,0,0,0,0,0,0,,,
579,1,Kings XI Punjab,Gujarat Lions,10,6,M Vijay,DA Miller,DJ Bravo,0,0,0,0,0,0,1,0,1,,,
579,1,Kings XI Punjab,Gujarat Lions,11,1,M Vijay,DA Miller,RA Jadeja,0,0,0,0,0,0,1,0,1,,,
579,1,Kings XI Punjab,Gujarat Lions,11,2,DA Miller,M Vijay,RA Jadeja,0,0,0,0,0,0,2,0,2,,,
579,1,Kings XI Punjab,Gujarat Lions,11,3,DA Miller,M Vijay,RA Jadeja,0,0,0,0,0,0,1,0,1,,,
579,1,Kings XI Punjab,Gujarat Lions,11,4,M Vijay,DA Miller,RA Jadeja,0,0,0,0,0,0,0,0,0,M Vijay,bowled,
579,1,Kings XI Punjab,Gujarat Lions,11,5,GJ Maxwell,DA Miller,RA Jadeja,0,0,0,0,0,0,1,0,1,,,
579,1,Kings XI Punjab,Gujarat Lions,11,6,DA Miller,GJ Maxwell,RA Jadeja,0,0,0,0,0,0,6,0,6,,,
579,1,Kings XI Punjab,Gujarat Lions,12,1,GJ Maxwell,DA Miller,DJ Bravo,0,0,0,0,0,0,1,0,1,,,
579,1,Kings XI Punjab,Gujarat Lions,12,2,DA Miller,GJ Maxwell,DJ Bravo,0,1,0,0,0,0,0,1,1,,,
579,1,Kings XI Punjab,Gujarat Lions,12,3,DA Miller,GJ Maxwell,DJ Bravo,0,0,0,0,0,0,1,0,1,,,
579,1,Kings XI Punjab,Gujarat Lions,12,4,GJ Maxwell,DA Miller,DJ Bravo,0,0,0,0,0,0,0,0,0,,,
579,1,Kings XI Punjab,Gujarat Lions,12,5,GJ Maxwell,DA Miller,DJ Bravo,0,0,0,0,0,0,0,0,0,GJ Maxwell,bowled,
579,1,Kings XI Punjab,Gujarat Lions,12,6,WP Saha,DA Miller,DJ Bravo,0,0,0,0,0,0,1,0,1,,,
579,1,Kings XI Punjab,Gujarat Lions,12,7,DA Miller,WP Saha,DJ Bravo,0,0,0,0,0,0,0,0,0,DA Miller,bowled,
579,1,Kings XI Punjab,Gujarat Lions,13,1,WP Saha,MP Stoinis,RA Jadeja,0,0,0,0,0,0,0,0,0,,,
579,1,Kings XI Punjab,Gujarat Lions,13,2,WP Saha,MP Stoinis,RA Jadeja,0,0,0,0,0,0,1,0,1,,,
579,1,Kings XI Punjab,Gujarat Lions,13,3,MP Stoinis,WP Saha,RA Jadeja,0,0,0,0,0,0,1,0,1,,,
579,1,Kings XI Punjab,Gujarat Lions,13,4,WP Saha,MP Stoinis,RA Jadeja,0,0,0,0,0,0,1,0,1,,,
579,1,Kings XI Punjab,Gujarat Lions,13,5,MP Stoinis,WP Saha,RA Jadeja,0,0,0,0,0,0,1,0,1,,,
579,1,Kings XI Punjab,Gujarat Lions,13,6,WP Saha,MP Stoinis,RA Jadeja,0,0,0,0,0,0,1,0,1,,,
579,1,Kings XI Punjab,Gujarat Lions,14,1,WP Saha,MP Stoinis,DJ Bravo,0,0,0,0,0,0,1,0,1,,,
579,1,Kings XI Punjab,Gujarat Lions,14,2,MP Stoinis,WP Saha,DJ Bravo,0,0,0,0,0,0,1,0,1,,,
579,1,Kings XI Punjab,Gujarat Lions,14,3,WP Saha,MP Stoinis,DJ Bravo,0,0,0,0,0,0,1,0,1,,,
579,1,Kings XI Punjab,Gujarat Lions,14,4,MP Stoinis,WP Saha,DJ Bravo,0,0,0,0,0,0,0,0,0,,,
579,1,Kings XI Punjab,Gujarat Lions,14,5,MP Stoinis,WP Saha,DJ Bravo,0,0,0,0,0,0,4,0,4,,,
579,1,Kings XI Punjab,Gujarat Lions,14,6,MP Stoinis,WP Saha,DJ Bravo,0,0,0,0,0,0,0,0,0,,,
579,1,Kings XI Punjab,Gujarat Lions,15,1,WP Saha,MP Stoinis,JP Faulkner,0,0,0,0,0,0,1,0,1,,,
579,1,Kings XI Punjab,Gujarat Lions,15,2,MP Stoinis,WP Saha,JP Faulkner,0,1,0,0,0,0,0,1,1,,,
579,1,Kings XI Punjab,Gujarat Lions,15,3,MP Stoinis,WP Saha,JP Faulkner,0,0,0,0,0,0,2,0,2,,,
579,1,Kings XI Punjab,Gujarat Lions,15,4,MP Stoinis,WP Saha,JP Faulkner,0,0,0,0,0,0,4,0,4,,,
579,1,Kings XI Punjab,Gujarat Lions,15,5,MP Stoinis,WP Saha,JP Faulkner,0,0,0,0,0,0,0,0,0,,,
579,1,Kings XI Punjab,Gujarat Lions,15,6,MP Stoinis,WP Saha,JP Faulkner,0,0,0,0,0,0,1,0,1,,,
579,1,Kings XI Punjab,Gujarat Lions,15,7,WP Saha,MP Stoinis,JP Faulkner,0,1,0,0,0,0,0,1,1,,,
579,1,Kings XI Punjab,Gujarat Lions,15,8,WP Saha,MP Stoinis,JP Faulkner,0,0,0,0,0,0,1,0,1,,,
579,1,Kings XI Punjab,Gujarat Lions,16,1,WP Saha,MP Stoinis,P Kumar,0,0,0,0,0,0,1,0,1,,,
579,1,Kings XI Punjab,Gujarat Lions,16,2,MP Stoinis,WP Saha,P Kumar,0,0,0,0,0,0,1,0,1,,,
579,1,Kings XI Punjab,Gujarat Lions,16,3,WP Saha,MP Stoinis,P Kumar,0,0,0,0,0,0,0,0,0,,,
579,1,Kings XI Punjab,Gujarat Lions,16,4,WP Saha,MP Stoinis,P Kumar,0,0,0,0,0,0,0,0,0,,,
579,1,Kings XI Punjab,Gujarat Lions,16,5,WP Saha,MP Stoinis,P Kumar,0,0,0,0,0,0,1,0,1,,,
579,1,Kings XI Punjab,Gujarat Lions,16,6,MP Stoinis,WP Saha,P Kumar,0,0,0,0,0,0,2,0,2,,,
579,1,Kings XI Punjab,Gujarat Lions,17,1,WP Saha,MP Stoinis,JP Faulkner,0,0,0,0,0,0,0,0,0,,,
579,1,Kings XI Punjab,Gujarat Lions,17,2,WP Saha,MP Stoinis,JP Faulkner,0,0,0,0,0,0,1,0,1,,,
579,1,Kings XI Punjab,Gujarat Lions,17,3,MP Stoinis,WP Saha,JP Faulkner,0,0,1,0,0,0,0,1,1,,,
579,1,Kings XI Punjab,Gujarat Lions,17,4,WP Saha,MP Stoinis,JP Faulkner,0,0,0,0,0,0,1,0,1,,,
579,1,Kings XI Punjab,Gujarat Lions,17,5,MP Stoinis,WP Saha,JP Faulkner,0,0,0,0,0,0,2,0,2,,,
579,1,Kings XI Punjab,Gujarat Lions,17,6,MP Stoinis,WP Saha,JP Faulkner,0,0,0,0,0,0,1,0,1,,,
579,1,Kings XI Punjab,Gujarat Lions,18,1,MP Stoinis,WP Saha,P Kumar,0,0,0,0,0,0,1,0,1,,,
579,1,Kings XI Punjab,Gujarat Lions,18,2,WP Saha,MP Stoinis,P Kumar,0,0,0,0,0,0,1,0,1,,,
579,1,Kings XI Punjab,Gujarat Lions,18,3,MP Stoinis,WP Saha,P Kumar,0,0,0,0,0,0,1,0,1,,,
579,1,Kings XI Punjab,Gujarat Lions,18,4,WP Saha,MP Stoinis,P Kumar,0,0,0,0,0,0,1,0,1,,,
579,1,Kings XI Punjab,Gujarat Lions,18,5,MP Stoinis,WP Saha,P Kumar,0,0,0,0,0,0,2,0,2,,,
579,1,Kings XI Punjab,Gujarat Lions,18,6,MP Stoinis,WP Saha,P Kumar,0,0,0,0,0,0,4,0,4,,,
579,1,Kings XI Punjab,Gujarat Lions,19,1,WP Saha,MP Stoinis,JP Faulkner,0,0,0,0,0,0,2,0,2,,,
579,1,Kings XI Punjab,Gujarat Lions,19,2,WP Saha,MP Stoinis,JP Faulkner,0,0,0,0,0,0,0,0,0,,,
579,1,Kings XI Punjab,Gujarat Lions,19,3,WP Saha,MP Stoinis,JP Faulkner,0,0,0,0,0,0,2,0,2,,,
579,1,Kings XI Punjab,Gujarat Lions,19,4,WP Saha,MP Stoinis,JP Faulkner,0,0,0,0,0,0,0,0,0,,,
579,1,Kings XI Punjab,Gujarat Lions,19,5,WP Saha,MP Stoinis,JP Faulkner,0,0,0,0,0,0,1,0,1,,,
579,1,Kings XI Punjab,Gujarat Lions,19,6,MP Stoinis,WP Saha,JP Faulkner,0,0,0,0,0,0,4,0,4,,,
579,1,Kings XI Punjab,Gujarat Lions,20,1,WP Saha,MP Stoinis,DJ Bravo,0,0,0,0,0,0,1,0,1,,,
579,1,Kings XI Punjab,Gujarat Lions,20,2,MP Stoinis,WP Saha,DJ Bravo,0,0,0,0,0,0,1,0,1,,,
579,1,Kings XI Punjab,Gujarat Lions,20,3,WP Saha,MP Stoinis,DJ Bravo,0,0,0,0,0,0,0,0,0,WP Saha,caught,RA Jadeja
579,1,Kings XI Punjab,Gujarat Lions,20,4,MP Stoinis,AR Patel,DJ Bravo,0,0,0,0,0,0,0,0,0,MP Stoinis,caught,AJ Finch
579,1,Kings XI Punjab,Gujarat Lions,20,5,AR Patel,MG Johnson,DJ Bravo,0,0,0,0,0,0,2,0,2,,,
579,1,Kings XI Punjab,Gujarat Lions,20,6,AR Patel,MG Johnson,DJ Bravo,0,0,0,0,0,0,2,0,2,,,
579,2,Gujarat Lions,Kings XI Punjab,1,1,AJ Finch,BB McCullum,Sandeep Sharma,0,0,0,0,0,0,0,0,0,,,
579,2,Gujarat Lions,Kings XI Punjab,1,2,AJ Finch,BB McCullum,Sandeep Sharma,0,0,0,0,0,0,0,0,0,,,
579,2,Gujarat Lions,Kings XI Punjab,1,3,AJ Finch,BB McCullum,Sandeep Sharma,0,0,0,0,0,0,0,0,0,,,
579,2,Gujarat Lions,Kings XI Punjab,1,4,AJ Finch,BB McCullum,Sandeep Sharma,0,0,0,0,0,0,1,0,1,,,
579,2,Gujarat Lions,Kings XI Punjab,1,5,BB McCullum,AJ Finch,Sandeep Sharma,0,0,0,0,0,0,0,0,0,,,
579,2,Gujarat Lions,Kings XI Punjab,1,6,BB McCullum,AJ Finch,Sandeep Sharma,0,0,0,0,0,0,0,0,0,BB McCullum,stumped,WP Saha
579,2,Gujarat Lions,Kings XI Punjab,2,1,AJ Finch,SK Raina,MG Johnson,0,0,0,0,0,0,0,0,0,,,
579,2,Gujarat Lions,Kings XI Punjab,2,2,AJ Finch,SK Raina,MG Johnson,0,0,0,0,0,0,2,0,2,,,
579,2,Gujarat Lions,Kings XI Punjab,2,3,AJ Finch,SK Raina,MG Johnson,0,0,0,0,0,0,4,0,4,,,
579,2,Gujarat Lions,Kings XI Punjab,2,4,AJ Finch,SK Raina,MG Johnson,0,0,0,0,0,0,0,0,0,,,
579,2,Gujarat Lions,Kings XI Punjab,2,5,AJ Finch,SK Raina,MG Johnson,0,0,0,0,0,0,4,0,4,,,
579,2,Gujarat Lions,Kings XI Punjab,2,6,AJ Finch,SK Raina,MG Johnson,0,0,0,0,0,0,1,0,1,,,
579,2,Gujarat Lions,Kings XI Punjab,3,1,AJ Finch,SK Raina,Sandeep Sharma,0,0,0,0,0,0,0,0,0,,,
579,2,Gujarat Lions,Kings XI Punjab,3,2,AJ Finch,SK Raina,Sandeep Sharma,0,0,0,0,0,0,1,0,1,,,
579,2,Gujarat Lions,Kings XI Punjab,3,3,SK Raina,AJ Finch,Sandeep Sharma,0,0,0,0,0,0,0,0,0,,,
579,2,Gujarat Lions,Kings XI Punjab,3,4,SK Raina,AJ Finch,Sandeep Sharma,0,0,0,0,0,0,6,0,6,,,
579,2,Gujarat Lions,Kings XI Punjab,3,5,SK Raina,AJ Finch,Sandeep Sharma,0,0,0,0,0,0,3,0,3,,,
579,2,Gujarat Lions,Kings XI Punjab,3,6,AJ Finch,SK Raina,Sandeep Sharma,0,0,0,0,0,0,1,0,1,,,
579,2,Gujarat Lions,Kings XI Punjab,4,1,AJ Finch,SK Raina,MM Sharma,0,0,0,0,0,0,4,0,4,,,
579,2,Gujarat Lions,Kings XI Punjab,4,2,AJ Finch,SK Raina,MM Sharma,0,0,0,0,0,0,4,0,4,,,
579,2,Gujarat Lions,Kings XI Punjab,4,3,AJ Finch,SK Raina,MM Sharma,0,0,0,0,0,0,1,0,1,,,
579,2,Gujarat Lions,Kings XI Punjab,4,4,SK Raina,AJ Finch,MM Sharma,0,0,0,0,0,0,0,0,0,,,
579,2,Gujarat Lions,Kings XI Punjab,4,5,SK Raina,AJ Finch,MM Sharma,0,0,0,0,0,0,0,0,0,,,
579,2,Gujarat Lions,Kings XI Punjab,4,6,SK Raina,AJ Finch,MM Sharma,0,0,0,0,0,0,4,0,4,,,
579,2,Gujarat Lions,Kings XI Punjab,5,1,AJ Finch,SK Raina,MG Johnson,0,0,0,0,0,0,0,0,0,,,
579,2,Gujarat Lions,Kings XI Punjab,5,2,AJ Finch,SK Raina,MG Johnson,0,0,0,0,0,0,4,0,4,,,
579,2,Gujarat Lions,Kings XI Punjab,5,3,AJ Finch,SK Raina,MG Johnson,0,0,0,0,0,0,1,0,1,,,
579,2,Gujarat Lions,Kings XI Punjab,5,4,SK Raina,AJ Finch,MG Johnson,0,1,0,0,0,0,0,1,1,,,
579,2,Gujarat Lions,Kings XI Punjab,5,5,SK Raina,AJ Finch,MG Johnson,0,1,0,0,0,0,0,1,1,,,
579,2,Gujarat Lions,Kings XI Punjab,5,6,SK Raina,AJ Finch,MG Johnson,0,0,0,0,0,0,1,0,1,,,
579,2,Gujarat Lions,Kings XI Punjab,5,7,AJ Finch,SK Raina,MG Johnson,0,0,0,0,0,0,0,0,0,,,
579,2,Gujarat Lions,Kings XI Punjab,5,8,AJ Finch,SK Raina,MG Johnson,0,0,0,0,0,0,1,0,1,,,
579,2,Gujarat Lions,Kings XI Punjab,6,1,AJ Finch,SK Raina,MP Stoinis,0,0,0,0,0,0,1,0,1,,,
579,2,Gujarat Lions,Kings XI Punjab,6,2,SK Raina,AJ Finch,MP Stoinis,0,0,0,0,0,0,6,0,6,,,
579,2,Gujarat Lions,Kings XI Punjab,6,3,SK Raina,AJ Finch,MP Stoinis,0,0,0,0,0,0,0,0,0,SK Raina,caught,MG Johnson
579,2,Gujarat Lions,Kings XI Punjab,6,4,AJ Finch,KD Karthik,MP Stoinis,0,0,0,0,0,0,0,0,0,,,
579,2,Gujarat Lions,Kings XI Punjab,6,5,AJ Finch,KD Karthik,MP Stoinis,0,0,0,0,0,0,4,0,4,,,
579,2,Gujarat Lions,Kings XI Punjab,6,6,AJ Finch,KD Karthik,MP Stoinis,0,0,0,0,0,0,1,0,1,,,
579,2,Gujarat Lions,Kings XI Punjab,7,1,AJ Finch,KD Karthik,AR Patel,0,0,0,0,0,0,0,0,0,,,
579,2,Gujarat Lions,Kings XI Punjab,7,2,AJ Finch,KD Karthik,AR Patel,0,0,0,0,0,0,1,0,1,,,
579,2,Gujarat Lions,Kings XI Punjab,7,3,KD Karthik,AJ Finch,AR Patel,0,0,0,0,0,0,4,0,4,,,
579,2,Gujarat Lions,Kings XI Punjab,7,4,KD Karthik,AJ Finch,AR Patel,0,0,0,0,0,0,1,0,1,,,
579,2,Gujarat Lions,Kings XI Punjab,7,5,AJ Finch,KD Karthik,AR Patel,0,0,0,0,0,0,4,0,4,,,
579,2,Gujarat Lions,Kings XI Punjab,7,6,AJ Finch,KD Karthik,AR Patel,0,0,0,0,0,0,1,0,1,,,
579,2,Gujarat Lions,Kings XI Punjab,8,1,AJ Finch,KD Karthik,MP Stoinis,0,0,0,0,0,0,4,0,4,,,
579,2,Gujarat Lions,Kings XI Punjab,8,2,AJ Finch,KD Karthik,MP Stoinis,0,0,0,0,0,0,1,0,1,,,
579,2,Gujarat Lions,Kings XI Punjab,8,3,KD Karthik,AJ Finch,MP Stoinis,0,0,0,0,0,0,1,0,1,,,
579,2,Gujarat Lions,Kings XI Punjab,8,4,AJ Finch,KD Karthik,MP Stoinis,0,0,0,0,0,0,4,0,4,,,
579,2,Gujarat Lions,Kings XI Punjab,8,5,AJ Finch,KD Karthik,MP Stoinis,0,0,0,0,0,0,1,0,1,,,
579,2,Gujarat Lions,Kings XI Punjab,8,6,KD Karthik,AJ Finch,MP Stoinis,0,0,0,0,0,0,4,0,4,,,
579,2,Gujarat Lions,Kings XI Punjab,9,1,AJ Finch,KD Karthik,AR Patel,0,0,0,0,0,0,1,0,1,,,
579,2,Gujarat Lions,Kings XI Punjab,9,2,KD Karthik,AJ Finch,AR Patel,0,0,0,0,0,0,0,0,0,,,
579,2,Gujarat Lions,Kings XI Punjab,9,3,KD Karthik,AJ Finch,AR Patel,0,0,0,0,0,0,1,0,1,,,
579,2,Gujarat Lions,Kings XI Punjab,9,4,AJ Finch,KD Karthik,AR Patel,0,0,0,0,0,0,1,0,1,,,
579,2,Gujarat Lions,Kings XI Punjab,9,5,KD Karthik,AJ Finch,AR Patel,0,0,0,0,0,0,1,0,1,,,
579,2,Gujarat Lions,Kings XI Punjab,9,6,AJ Finch,KD Karthik,AR Patel,0,1,0,0,0,0,0,1,1,,,
579,2,Gujarat Lions,Kings XI Punjab,9,7,AJ Finch,KD Karthik,AR Patel,0,0,0,0,0,0,1,0,1,,,
579,2,Gujarat Lions,Kings XI Punjab,10,1,AJ Finch,KD Karthik,P Sahu,0,0,0,0,0,0,1,0,1,,,
579,2,Gujarat Lions,Kings XI Punjab,10,2,KD Karthik,AJ Finch,P Sahu,0,0,0,0,0,0,1,0,1,,,
579,2,Gujarat Lions,Kings XI Punjab,10,3,AJ Finch,KD Karthik,P Sahu,0,0,0,0,0,0,4,0,4,,,
579,2,Gujarat Lions,Kings XI Punjab,10,4,AJ Finch,KD Karthik,P Sahu,0,0,0,0,0,0,1,0,1,,,
579,2,Gujarat Lions,Kings XI Punjab,10,5,KD Karthik,AJ Finch,P Sahu,0,0,0,0,0,0,1,0,1,,,
579,2,Gujarat Lions,Kings XI Punjab,10,6,AJ Finch,KD Karthik,P Sahu,0,0,0,0,0,0,1,0,1,,,
579,2,Gujarat Lions,Kings XI Punjab,11,1,AJ Finch,KD Karthik,Sandeep Sharma,0,0,0,0,0,0,2,0,2,,,
579,2,Gujarat Lions,Kings XI Punjab,11,2,AJ Finch,KD Karthik,Sandeep Sharma,0,0,0,0,0,0,1,0,1,,,
579,2,Gujarat Lions,Kings XI Punjab,11,3,KD Karthik,AJ Finch,Sandeep Sharma,0,0,0,0,0,0,1,0,1,,,
579,2,Gujarat Lions,Kings XI Punjab,11,4,AJ Finch,KD Karthik,Sandeep Sharma,0,0,0,0,0,0,4,0,4,,,
579,2,Gujarat Lions,Kings XI Punjab,11,5,AJ Finch,KD Karthik,Sandeep Sharma,0,0,0,0,0,0,1,0,1,,,
579,2,Gujarat Lions,Kings XI Punjab,11,6,KD Karthik,AJ Finch,Sandeep Sharma,0,0,0,0,0,0,0,0,0,,,
579,2,Gujarat Lions,Kings XI Punjab,12,1,AJ Finch,KD Karthik,P Sahu,0,0,0,0,0,0,1,0,1,,,
579,2,Gujarat Lions,Kings XI Punjab,12,2,KD Karthik,AJ Finch,P Sahu,0,0,0,0,0,0,4,0,4,,,
579,2,Gujarat Lions,Kings XI Punjab,12,3,KD Karthik,AJ Finch,P Sahu,0,0,0,0,0,0,1,0,1,,,
579,2,Gujarat Lions,Kings XI Punjab,12,4,AJ Finch,KD Karthik,P Sahu,0,0,0,0,0,0,4,0,4,,,
579,2,Gujarat Lions,Kings XI Punjab,12,5,AJ Finch,KD Karthik,P Sahu,0,0,0,0,0,0,0,0,0,AJ Finch,stumped,WP Saha
579,2,Gujarat Lions,Kings XI Punjab,12,6,RA Jadeja,KD Karthik,P Sahu,0,0,0,0,0,0,0,0,0,,,
579,2,Gujarat Lions,Kings XI Punjab,13,1,KD Karthik,RA Jadeja,MM Sharma,0,0,0,0,0,0,1,0,1,,,
579,2,Gujarat Lions,Kings XI Punjab,13,2,RA Jadeja,KD Karthik,MM Sharma,0,0,0,0,0,0,0,0,0,,,
579,2,Gujarat Lions,Kings XI Punjab,13,3,RA Jadeja,KD Karthik,MM Sharma,0,0,0,0,0,0,0,0,0,,,
579,2,Gujarat Lions,Kings XI Punjab,13,4,RA Jadeja,KD Karthik,MM Sharma,0,0,0,0,0,0,2,0,2,,,
579,2,Gujarat Lions,Kings XI Punjab,13,5,RA Jadeja,KD Karthik,MM Sharma,0,0,0,0,0,0,0,0,0,,,
579,2,Gujarat Lions,Kings XI Punjab,13,6,RA Jadeja,KD Karthik,MM Sharma,0,0,0,0,0,0,1,0,1,,,
579,2,Gujarat Lions,Kings XI Punjab,14,1,RA Jadeja,KD Karthik,P Sahu,0,0,0,0,0,0,1,0,1,,,
579,2,Gujarat Lions,Kings XI Punjab,14,2,KD Karthik,RA Jadeja,P Sahu,0,0,0,0,0,0,1,0,1,,,
579,2,Gujarat Lions,Kings XI Punjab,14,3,RA Jadeja,KD Karthik,P Sahu,0,0,0,0,0,0,0,0,0,,,
579,2,Gujarat Lions,Kings XI Punjab,14,4,RA Jadeja,KD Karthik,P Sahu,0,0,0,0,0,0,2,0,2,,,
579,2,Gujarat Lions,Kings XI Punjab,14,5,RA Jadeja,KD Karthik,P Sahu,0,0,0,0,0,0,1,0,1,,,
579,2,Gujarat Lions,Kings XI Punjab,14,6,KD Karthik,RA Jadeja,P Sahu,0,0,0,0,0,0,4,0,4,,,
579,2,Gujarat Lions,Kings XI Punjab,15,1,RA Jadeja,KD Karthik,MG Johnson,0,0,0,2,0,0,0,2,2,,,
579,2,Gujarat Lions,Kings XI Punjab,15,2,RA Jadeja,KD Karthik,MG Johnson,0,0,0,0,0,0,1,0,1,,,
579,2,Gujarat Lions,Kings XI Punjab,15,3,KD Karthik,RA Jadeja,MG Johnson,0,0,0,0,0,0,0,0,0,RA Jadeja,run out,MG Johnson
579,2,Gujarat Lions,Kings XI Punjab,15,4,Ishan Kishan,KD Karthik,MG Johnson,0,0,0,0,0,0,1,0,1,,,
579,2,Gujarat Lions,Kings XI Punjab,15,5,KD Karthik,Ishan Kishan,MG Johnson,0,0,0,0,0,0,0,0,0,,,
579,2,Gujarat Lions,Kings XI Punjab,15,6,KD Karthik,Ishan Kishan,MG Johnson,0,0,0,0,0,0,0,0,0,,,
579,2,Gujarat Lions,Kings XI Punjab,16,1,Ishan Kishan,KD Karthik,P Sahu,0,0,0,1,0,0,0,1,1,,,
579,2,Gujarat Lions,Kings XI Punjab,16,2,KD Karthik,Ishan Kishan,P Sahu,0,0,0,0,0,0,0,0,0,,,
579,2,Gujarat Lions,Kings XI Punjab,16,3,KD Karthik,Ishan Kishan,P Sahu,0,0,0,0,0,0,1,0,1,,,
579,2,Gujarat Lions,Kings XI Punjab,16,4,Ishan Kishan,KD Karthik,P Sahu,0,0,0,0,0,0,0,0,0,,,
579,2,Gujarat Lions,Kings XI Punjab,16,5,Ishan Kishan,KD Karthik,P Sahu,0,0,0,0,0,0,2,0,2,,,
579,2,Gujarat Lions,Kings XI Punjab,16,6,Ishan Kishan,KD Karthik,P Sahu,0,0,0,0,0,0,4,0,4,,,
579,2,Gujarat Lions,Kings XI Punjab,17,1,KD Karthik,Ishan Kishan,MG Johnson,0,0,0,0,0,0,4,0,4,,,
579,2,Gujarat Lions,Kings XI Punjab,17,2,KD Karthik,Ishan Kishan,MG Johnson,0,0,0,0,0,0,1,0,1,,,
579,2,Gujarat Lions,Kings XI Punjab,17,3,Ishan Kishan,KD Karthik,MG Johnson,0,0,0,0,0,0,0,0,0,,,
579,2,Gujarat Lions,Kings XI Punjab,17,4,Ishan Kishan,KD Karthik,MG Johnson,0,0,0,0,0,0,4,0,4,,,
579,2,Gujarat Lions,Kings XI Punjab,17,5,Ishan Kishan,KD Karthik,MG Johnson,0,0,0,0,0,0,0,0,0,Ishan Kishan,caught,MM Sharma
579,2,Gujarat Lions,Kings XI Punjab,17,6,KD Karthik,DJ Bravo,MG Johnson,0,0,0,0,0,0,4,0,4,,,
579,2,Gujarat Lions,Kings XI Punjab,18,1,DJ Bravo,KD Karthik,MM Sharma,0,0,0,0,0,0,1,0,1,,,
579,2,Gujarat Lions,Kings XI Punjab,18,2,KD Karthik,DJ Bravo,MM Sharma,0,0,0,0,0,0,1,0,1,,,
579,2,Gujarat Lions,Kings XI Punjab,18,3,DJ Bravo,KD Karthik,MM Sharma,0,0,0,0,0,0,1,0,1,,,
579,2,Gujarat Lions,Kings XI Punjab,18,4,KD Karthik,DJ Bravo,MM Sharma,0,0,0,0,0,0,4,0,4,,,
580,1,Royal Challengers Bangalore,Sunrisers Hyderabad,1,1,CH Gayle,V Kohli,A Nehra,0,0,0,0,0,0,0,0,0,,,
580,1,Royal Challengers Bangalore,Sunrisers Hyderabad,1,2,CH Gayle,V Kohli,A Nehra,0,0,0,0,0,0,1,0,1,,,
580,1,Royal Challengers Bangalore,Sunrisers Hyderabad,1,3,V Kohli,CH Gayle,A Nehra,0,0,0,0,0,0,0,0,0,,,
580,1,Royal Challengers Bangalore,Sunrisers Hyderabad,1,4,V Kohli,CH Gayle,A Nehra,0,0,0,0,0,0,0,0,0,,,
580,1,Royal Challengers Bangalore,Sunrisers Hyderabad,1,5,V Kohli,CH Gayle,A Nehra,0,0,0,0,0,0,0,0,0,,,
580,1,Royal Challengers Bangalore,Sunrisers Hyderabad,1,6,V Kohli,CH Gayle,A Nehra,0,0,0,0,0,0,4,0,4,,,
580,1,Royal Challengers Bangalore,Sunrisers Hyderabad,2,1,CH Gayle,V Kohli,B Kumar,0,1,0,0,0,0,0,1,1,,,
580,1,Royal Challengers Bangalore,Sunrisers Hyderabad,2,2,CH Gayle,V Kohli,B Kumar,0,0,0,0,0,0,0,0,0,,,
580,1,Royal Challengers Bangalore,Sunrisers Hyderabad,2,3,CH Gayle,V Kohli,B Kumar,0,0,0,0,0,0,0,0,0,CH Gayle,bowled,
580,1,Royal Challengers Bangalore,Sunrisers Hyderabad,2,4,AB de Villiers,V Kohli,B Kumar,0,0,0,0,0,0,0,0,0,,,
580,1,Royal Challengers Bangalore,Sunrisers Hyderabad,2,5,AB de Villiers,V Kohli,B Kumar,0,0,0,0,0,0,1,0,1,,,
580,1,Royal Challengers Bangalore,Sunrisers Hyderabad,2,6,V Kohli,AB de Villiers,B Kumar,0,0,0,0,0,0,1,0,1,,,
580,1,Royal Challengers Bangalore,Sunrisers Hyderabad,2,7,AB de Villiers,V Kohli,B Kumar,0,0,0,0,0,0,0,0,0,,,
580,1,Royal Challengers Bangalore,Sunrisers Hyderabad,3,1,V Kohli,AB de Villiers,Mustafizur Rahman,0,0,0,0,0,0,2,0,2,,,
580,1,Royal Challengers Bangalore,Sunrisers Hyderabad,3,2,V Kohli,AB de Villiers,Mustafizur Rahman,0,0,0,0,0,0,1,0,1,,,
580,1,Royal Challengers Bangalore,Sunrisers Hyderabad,3,3,AB de Villiers,V Kohli,Mustafizur Rahman,0,0,0,0,0,0,1,0,1,,,
580,1,Royal Challengers Bangalore,Sunrisers Hyderabad,3,4,V Kohli,AB de Villiers,Mustafizur Rahman,0,0,0,0,0,0,0,0,0,,,
580,1,Royal Challengers Bangalore,Sunrisers Hyderabad,3,5,V Kohli,AB de Villiers,Mustafizur Rahman,0,0,0,0,0,0,0,0,0,,,
580,1,Royal Challengers Bangalore,Sunrisers Hyderabad,3,6,V Kohli,AB de Villiers,Mustafizur Rahman,0,0,0,0,0,0,0,0,0,,,
580,1,Royal Challengers Bangalore,Sunrisers Hyderabad,4,1,AB de Villiers,V Kohli,A Nehra,0,0,0,0,0,0,0,0,0,,,
580,1,Royal Challengers Bangalore,Sunrisers Hyderabad,4,2,AB de Villiers,V Kohli,A Nehra,0,0,0,0,0,0,4,0,4,,,
580,1,Royal Challengers Bangalore,Sunrisers Hyderabad,4,3,AB de Villiers,V Kohli,A Nehra,0,0,0,0,0,0,6,0,6,,,
580,1,Royal Challengers Bangalore,Sunrisers Hyderabad,4,4,AB de Villiers,V Kohli,A Nehra,0,1,0,0,0,0,0,1,1,,,
580,1,Royal Challengers Bangalore,Sunrisers Hyderabad,4,5,AB de Villiers,V Kohli,A Nehra,0,0,0,0,0,0,0,0,0,,,
580,1,Royal Challengers Bangalore,Sunrisers Hyderabad,4,6,AB de Villiers,V Kohli,A Nehra,0,0,0,0,0,0,4,0,4,,,
580,1,Royal Challengers Bangalore,Sunrisers Hyderabad,4,7,AB de Villiers,V Kohli,A Nehra,0,0,0,0,0,0,0,0,0,,,
580,1,Royal Challengers Bangalore,Sunrisers Hyderabad,5,1,V Kohli,AB de Villiers,B Kumar,0,0,0,0,0,0,4,0,4,,,
580,1,Royal Challengers Bangalore,Sunrisers Hyderabad,5,2,V Kohli,AB de Villiers,B Kumar,0,0,0,0,0,0,1,0,1,,,
580,1,Royal Challengers Bangalore,Sunrisers Hyderabad,5,3,AB de Villiers,V Kohli,B Kumar,0,0,0,0,0,0,0,0,0,,,
580,1,Royal Challengers Bangalore,Sunrisers Hyderabad,5,4,AB de Villiers,V Kohli,B Kumar,0,0,0,0,0,0,6,0,6,,,
580,1,Royal Challengers Bangalore,Sunrisers Hyderabad,5,5,AB de Villiers,V Kohli,B Kumar,0,0,0,0,0,0,4,0,4,,,
580,1,Royal Challengers Bangalore,Sunrisers Hyderabad,5,6,AB de Villiers,V Kohli,B Kumar,0,0,0,0,0,0,1,0,1,,,
580,1,Royal Challengers Bangalore,Sunrisers Hyderabad,6,1,AB de Villiers,V Kohli,Mustafizur Rahman,0,0,0,0,0,0,0,0,0,,,
580,1,Royal Challengers Bangalore,Sunrisers Hyderabad,6,2,AB de Villiers,V Kohli,Mustafizur Rahman,0,0,0,0,0,0,1,0,1,,,
580,1,Royal Challengers Bangalore,Sunrisers Hyderabad,6,3,V Kohli,AB de Villiers,Mustafizur Rahman,0,0,0,0,0,0,4,0,4,,,
580,1,Royal Challengers Bangalore,Sunrisers Hyderabad,6,4,V Kohli,AB de Villiers,Mustafizur Rahman,0,0,0,0,0,0,0,0,0,,,
580,1,Royal Challengers Bangalore,Sunrisers Hyderabad,6,5,V Kohli,AB de Villiers,Mustafizur Rahman,0,0,0,0,0,0,0,0,0,,,
580,1,Royal Challengers Bangalore,Sunrisers Hyderabad,6,6,V Kohli,AB de Villiers,Mustafizur Rahman,0,0,0,0,0,0,1,0,1,,,
580,1,Royal Challengers Bangalore,Sunrisers Hyderabad,7,1,V Kohli,AB de Villiers,MC Henriques,0,0,0,0,0,0,2,0,2,,,
580,1,Royal Challengers Bangalore,Sunrisers Hyderabad,7,2,V Kohli,AB de Villiers,MC Henriques,0,0,0,0,0,0,0,0,0,,,
580,1,Royal Challengers Bangalore,Sunrisers Hyderabad,7,3,V Kohli,AB de Villiers,MC Henriques,0,0,0,0,0,0,0,0,0,,,
580,1,Royal Challengers Bangalore,Sunrisers Hyderabad,7,4,V Kohli,AB de Villiers,MC Henriques,0,0,0,0,0,0,0,0,0,,,
580,1,Royal Challengers Bangalore,Sunrisers Hyderabad,7,5,V Kohli,AB de Villiers,MC Henriques,0,0,0,0,0,0,0,0,0,,,
580,1,Royal Challengers Bangalore,Sunrisers Hyderabad,7,6,V Kohli,AB de Villiers,MC Henriques,0,0,0,0,0,0,1,0,1,,,
580,1,Royal Challengers Bangalore,Sunrisers Hyderabad,8,1,V Kohli,AB de Villiers,KV Sharma,0,0,0,0,0,0,1,0,1,,,
580,1,Royal Challengers Bangalore,Sunrisers Hyderabad,8,2,AB de Villiers,V Kohli,KV Sharma,0,0,0,0,0,0,1,0,1,,,
580,1,Royal Challengers Bangalore,Sunrisers Hyderabad,8,3,V Kohli,AB de Villiers,KV Sharma,0,0,0,0,0,0,4,0,4,,,
580,1,Royal Challengers Bangalore,Sunrisers Hyderabad,8,4,V Kohli,AB de Villiers,KV Sharma,0,0,0,0,0,0,1,0,1,,,
580,1,Royal Challengers Bangalore,Sunrisers Hyderabad,8,5,AB de Villiers,V Kohli,KV Sharma,0,0,0,0,0,0,1,0,1,,,
580,1,Royal Challengers Bangalore,Sunrisers Hyderabad,8,6,V Kohli,AB de Villiers,KV Sharma,0,0,0,0,0,0,1,0,1,,,
580,1,Royal Challengers Bangalore,Sunrisers Hyderabad,9,1,V Kohli,AB de Villiers,MC Henriques,0,0,0,0,0,0,1,0,1,,,
580,1,Royal Challengers Bangalore,Sunrisers Hyderabad,9,2,AB de Villiers,V Kohli,MC Henriques,0,0,0,0,0,0,1,0,1,,,
580,1,Royal Challengers Bangalore,Sunrisers Hyderabad,9,3,V Kohli,AB de Villiers,MC Henriques,0,0,0,0,0,0,6,0,6,,,
580,1,Royal Challengers Bangalore,Sunrisers Hyderabad,9,4,V Kohli,AB de Villiers,MC Henriques,0,0,0,0,0,0,0,0,0,,,
580,1,Royal Challengers Bangalore,Sunrisers Hyderabad,9,5,V Kohli,AB de Villiers,MC Henriques,0,0,0,0,0,0,3,0,3,,,
580,1,Royal Challengers Bangalore,Sunrisers Hyderabad,9,6,AB de Villiers,V Kohli,MC Henriques,0,0,0,0,0,0,1,0,1,,,
580,1,Royal Challengers Bangalore,Sunrisers Hyderabad,10,1,AB de Villiers,V Kohli,KV Sharma,0,0,0,0,0,0,1,0,1,,,
580,1,Royal Challengers Bangalore,Sunrisers Hyderabad,10,2,V Kohli,AB de Villiers,KV Sharma,0,0,0,0,0,0,1,0,1,,,
580,1,Royal Challengers Bangalore,Sunrisers Hyderabad,10,3,AB de Villiers,V Kohli,KV Sharma,0,0,0,0,0,0,6,0,6,,,
580,1,Royal Challengers Bangalore,Sunrisers Hyderabad,10,4,AB de Villiers,V Kohli,KV Sharma,0,0,0,0,0,0,6,0,6,,,
580,1,Royal Challengers Bangalore,Sunrisers Hyderabad,10,5,AB de Villiers,V Kohli,KV Sharma,0,0,0,0,0,0,1,0,1,,,
580,1,Royal Challengers Bangalore,Sunrisers Hyderabad,10,6,V Kohli,AB de Villiers,KV Sharma,0,0,0,0,0,0,0,0,0,,,
580,1,Royal Challengers Bangalore,Sunrisers Hyderabad,11,1,AB de Villiers,V Kohli,A Nehra,0,0,0,0,0,0,1,0,1,,,
580,1,Royal Challengers Bangalore,Sunrisers Hyderabad,11,2,V Kohli,AB de Villiers,A Ashish Reddy,0,0,0,0,0,0,0,0,0,,,
580,1,Royal Challengers Bangalore,Sunrisers Hyderabad,11,3,V Kohli,AB de Villiers,A Ashish Reddy,0,0,0,0,0,0,1,0,1,,,
580,1,Royal Challengers Bangalore,Sunrisers Hyderabad,11,4,AB de Villiers,V Kohli,A Ashish Reddy,0,0,0,0,0,0,4,0,4,,,
580,1,Royal Challengers Bangalore,Sunrisers Hyderabad,11,5,AB de Villiers,V Kohli,A Ashish Reddy,0,0,0,0,0,0,4,0,4,,,
580,1,Royal Challengers Bangalore,Sunrisers Hyderabad,11,6,AB de Villiers,V Kohli,A Ashish Reddy,0,0,0,0,0,0,1,0,1,,,
580,1,Royal Challengers Bangalore,Sunrisers Hyderabad,12,1,AB de Villiers,V Kohli,MC Henriques,0,0,0,0,0,0,1,0,1,,,
580,1,Royal Challengers Bangalore,Sunrisers Hyderabad,12,2,V Kohli,AB de Villiers,MC Henriques,0,0,0,0,0,0,1,0,1,,,
580,1,Royal Challengers Bangalore,Sunrisers Hyderabad,12,3,AB de Villiers,V Kohli,MC Henriques,0,0,0,0,0,0,1,0,1,,,
580,1,Royal Challengers Bangalore,Sunrisers Hyderabad,12,4,V Kohli,AB de Villiers,MC Henriques,0,0,0,0,0,0,1,0,1,,,
580,1,Royal Challengers Bangalore,Sunrisers Hyderabad,12,5,AB de Villiers,V Kohli,MC Henriques,0,0,0,0,0,0,4,0,4,,,
580,1,Royal Challengers Bangalore,Sunrisers Hyderabad,12,6,AB de Villiers,V Kohli,MC Henriques,0,0,0,0,0,0,4,0,4,,,
580,1,Royal Challengers Bangalore,Sunrisers Hyderabad,13,1,V Kohli,AB de Villiers,KV Sharma,0,0,0,0,0,0,4,0,4,,,
580,1,Royal Challengers Bangalore,Sunrisers Hyderabad,13,2,V Kohli,AB de Villiers,KV Sharma,0,0,0,0,0,0,2,0,2,,,
580,1,Royal Challengers Bangalore,Sunrisers Hyderabad,13,3,V Kohli,AB de Villiers,KV Sharma,0,0,0,0,0,0,1,0,1,,,
580,1,Royal Challengers Bangalore,Sunrisers Hyderabad,13,4,AB de Villiers,V Kohli,KV Sharma,0,0,0,1,0,0,0,1,1,,,
580,1,Royal Challengers Bangalore,Sunrisers Hyderabad,13,5,V Kohli,AB de Villiers,KV Sharma,0,0,0,0,0,0,6,0,6,,,
580,1,Royal Challengers Bangalore,Sunrisers Hyderabad,13,6,V Kohli,AB de Villiers,KV Sharma,0,0,0,0,0,0,1,0,1,,,
580,1,Royal Challengers Bangalore,Sunrisers Hyderabad,14,1,V Kohli,AB de Villiers,MC Henriques,0,0,0,0,0,0,1,0,1,,,
580,1,Royal Challengers Bangalore,Sunrisers Hyderabad,14,2,AB de Villiers,V Kohli,MC Henriques,0,0,0,0,0,0,1,0,1,,,
580,1,Royal Challengers Bangalore,Sunrisers Hyderabad,14,3,V Kohli,AB de Villiers,MC Henriques,0,0,0,0,0,0,6,0,6,,,
580,1,Royal Challengers Bangalore,Sunrisers Hyderabad,14,4,V Kohli,AB de Villiers,MC Henriques,0,0,0,0,0,0,4,0,4,,,
580,1,Royal Challengers Bangalore,Sunrisers Hyderabad,14,5,V Kohli,AB de Villiers,MC Henriques,0,0,0,0,0,0,1,0,1,,,
580,1,Royal Challengers Bangalore,Sunrisers Hyderabad,14,6,AB de Villiers,V Kohli,MC Henriques,0,0,0,0,0,0,1,0,1,,,
580,1,Royal Challengers Bangalore,Sunrisers Hyderabad,15,1,AB de Villiers,V Kohli,A Ashish Reddy,0,0,0,0,0,0,1,0,1,,,
580,1,Royal Challengers Bangalore,Sunrisers Hyderabad,15,2,V Kohli,AB de Villiers,A Ashish Reddy,0,0,0,0,0,0,1,0,1,,,
580,1,Royal Challengers Bangalore,Sunrisers Hyderabad,15,3,AB de Villiers,V Kohli,A Ashish Reddy,0,0,0,0,0,0,6,0,6,,,
580,1,Royal Challengers Bangalore,Sunrisers Hyderabad,15,4,AB de Villiers,V Kohli,A Ashish Reddy,0,0,0,1,0,0,0,1,1,,,
580,1,Royal Challengers Bangalore,Sunrisers Hyderabad,15,5,V Kohli,AB de Villiers,A Ashish Reddy,0,0,0,0,0,0,1,0,1,,,
580,1,Royal Challengers Bangalore,Sunrisers Hyderabad,15,6,AB de Villiers,V Kohli,A Ashish Reddy,0,0,0,0,0,0,6,0,6,,,
580,1,Royal Challengers Bangalore,Sunrisers Hyderabad,16,1,V Kohli,AB de Villiers,B Kumar,0,0,0,0,0,0,4,0,4,,,
580,1,Royal Challengers Bangalore,Sunrisers Hyderabad,16,2,V Kohli,AB de Villiers,B Kumar,0,0,0,0,0,0,0,0,0,,,
580,1,Royal Challengers Bangalore,Sunrisers Hyderabad,16,3,V Kohli,AB de Villiers,B Kumar,0,0,0,0,0,0,1,0,1,,,
580,1,Royal Challengers Bangalore,Sunrisers Hyderabad,16,4,AB de Villiers,V Kohli,B Kumar,0,1,0,0,0,0,0,1,1,,,
580,1,Royal Challengers Bangalore,Sunrisers Hyderabad,16,5,AB de Villiers,V Kohli,B Kumar,0,0,0,0,0,0,1,0,1,,,
580,1,Royal Challengers Bangalore,Sunrisers Hyderabad,16,6,V Kohli,AB de Villiers,B Kumar,0,0,0,0,0,0,0,0,0,V Kohli,bowled,
580,1,Royal Challengers Bangalore,Sunrisers Hyderabad,16,7,SR Watson,AB de Villiers,B Kumar,0,0,0,0,0,0,1,0,1,,,
580,1,Royal Challengers Bangalore,Sunrisers Hyderabad,17,1,SR Watson,AB de Villiers,KV Sharma,0,0,0,0,0,0,0,0,0,,,
580,1,Royal Challengers Bangalore,Sunrisers Hyderabad,17,2,SR Watson,AB de Villiers,KV Sharma,0,1,0,0,0,0,0,1,1,,,
580,1,Royal Challengers Bangalore,Sunrisers Hyderabad,17,3,SR Watson,AB de Villiers,KV Sharma,0,0,0,0,0,0,0,0,0,,,
580,1,Royal Challengers Bangalore,Sunrisers Hyderabad,17,4,SR Watson,AB de Villiers,KV Sharma,0,0,0,0,0,0,0,0,0,,,
580,1,Royal Challengers Bangalore,Sunrisers Hyderabad,17,5,SR Watson,AB de Villiers,KV Sharma,0,0,0,0,0,0,6,0,6,,,
580,1,Royal Challengers Bangalore,Sunrisers Hyderabad,17,6,SR Watson,AB de Villiers,KV Sharma,0,0,0,0,0,0,6,0,6,,,
580,1,Royal Challengers Bangalore,Sunrisers Hyderabad,17,7,SR Watson,AB de Villiers,KV Sharma,0,0,0,0,0,0,6,0,6,,,
580,1,Royal Challengers Bangalore,Sunrisers Hyderabad,18,1,AB de Villiers,SR Watson,Mustafizur Rahman,0,0,0,0,0,0,0,0,0,,,
580,1,Royal Challengers Bangalore,Sunrisers Hyderabad,18,2,AB de Villiers,SR Watson,Mustafizur Rahman,0,0,0,0,0,0,0,0,0,AB de Villiers,caught,EJG Morgan
580,1,Royal Challengers Bangalore,Sunrisers Hyderabad,18,3,SR Watson,SN Khan,Mustafizur Rahman,0,0,0,0,0,0,0,0,0,SR Watson,caught,NV Ojha
580,1,Royal Challengers Bangalore,Sunrisers Hyderabad,18,4,KM Jadhav,SN Khan,Mustafizur Rahman,0,0,0,0,0,0,1,0,1,,,
580,1,Royal Challengers Bangalore,Sunrisers Hyderabad,18,5,SN Khan,KM Jadhav,Mustafizur Rahman,0,0,0,0,0,0,1,0,1,,,
580,1,Royal Challengers Bangalore,Sunrisers Hyderabad,18,6,KM Jadhav,SN Khan,Mustafizur Rahman,0,0,0,0,0,0,1,0,1,,,
580,1,Royal Challengers Bangalore,Sunrisers Hyderabad,19,1,KM Jadhav,SN Khan,B Kumar,0,0,0,0,1,0,4,1,5,,,
580,1,Royal Challengers Bangalore,Sunrisers Hyderabad,19,2,KM Jadhav,SN Khan,B Kumar,0,0,0,0,0,0,1,0,1,,,
580,1,Royal Challengers Bangalore,Sunrisers Hyderabad,19,3,SN Khan,KM Jadhav,B Kumar,0,0,0,0,0,0,4,0,4,,,
580,1,Royal Challengers Bangalore,Sunrisers Hyderabad,19,4,SN Khan,KM Jadhav,B Kumar,0,0,0,0,0,0,4,0,4,,,
580,1,Royal Challengers Bangalore,Sunrisers Hyderabad,19,5,SN Khan,KM Jadhav,B Kumar,0,0,0,0,0,0,6,0,6,,,
580,1,Royal Challengers Bangalore,Sunrisers Hyderabad,19,6,SN Khan,KM Jadhav,B Kumar,0,0,0,0,0,0,4,0,4,,,
580,1,Royal Challengers Bangalore,Sunrisers Hyderabad,19,7,SN Khan,KM Jadhav,B Kumar,0,0,0,0,0,0,4,0,4,,,
580,1,Royal Challengers Bangalore,Sunrisers Hyderabad,20,1,KM Jadhav,SN Khan,Mustafizur Rahman,0,0,0,0,0,0,0,0,0,,,
580,1,Royal Challengers Bangalore,Sunrisers Hyderabad,20,2,KM Jadhav,SN Khan,Mustafizur Rahman,0,0,0,0,0,0,1,0,1,,,
580,1,Royal Challengers Bangalore,Sunrisers Hyderabad,20,3,SN Khan,KM Jadhav,Mustafizur Rahman,0,0,0,0,0,0,6,0,6,,,
580,1,Royal Challengers Bangalore,Sunrisers Hyderabad,20,4,SN Khan,KM Jadhav,Mustafizur Rahman,0,0,0,0,0,0,2,0,2,,,
580,1,Royal Challengers Bangalore,Sunrisers Hyderabad,20,5,SN Khan,KM Jadhav,Mustafizur Rahman,0,0,0,0,0,0,0,0,0,,,
580,1,Royal Challengers Bangalore,Sunrisers Hyderabad,20,6,SN Khan,KM Jadhav,Mustafizur Rahman,0,0,0,0,0,0,4,0,4,,,
580,2,Sunrisers Hyderabad,Royal Challengers Bangalore,1,1,DA Warner,S Dhawan,AF Milne,0,5,0,0,0,0,0,5,5,,,
580,2,Sunrisers Hyderabad,Royal Challengers Bangalore,1,2,DA Warner,S Dhawan,AF Milne,0,0,0,0,0,0,1,0,1,,,
580,2,Sunrisers Hyderabad,Royal Challengers Bangalore,1,3,S Dhawan,DA Warner,AF Milne,0,0,0,0,0,0,1,0,1,,,
580,2,Sunrisers Hyderabad,Royal Challengers Bangalore,1,4,DA Warner,S Dhawan,AF Milne,0,0,0,0,0,0,4,0,4,,,
580,2,Sunrisers Hyderabad,Royal Challengers Bangalore,1,5,DA Warner,S Dhawan,AF Milne,0,0,0,0,0,0,1,0,1,,,
580,2,Sunrisers Hyderabad,Royal Challengers Bangalore,1,6,S Dhawan,DA Warner,AF Milne,0,0,0,0,0,0,0,0,0,,,
580,2,Sunrisers Hyderabad,Royal Challengers Bangalore,1,7,S Dhawan,DA Warner,AF Milne,0,0,0,0,0,0,0,0,0,,,
580,2,Sunrisers Hyderabad,Royal Challengers Bangalore,2,1,DA Warner,S Dhawan,SR Watson,0,0,0,0,0,0,2,0,2,,,
580,2,Sunrisers Hyderabad,Royal Challengers Bangalore,2,2,DA Warner,S Dhawan,SR Watson,0,0,0,0,0,0,0,0,0,,,
580,2,Sunrisers Hyderabad,Royal Challengers Bangalore,2,3,DA Warner,S Dhawan,SR Watson,0,0,0,0,0,0,1,0,1,,,
580,2,Sunrisers Hyderabad,Royal Challengers Bangalore,2,4,S Dhawan,DA Warner,SR Watson,0,0,0,0,0,0,4,0,4,,,
580,2,Sunrisers Hyderabad,Royal Challengers Bangalore,2,5,S Dhawan,DA Warner,SR Watson,0,0,0,0,0,0,1,0,1,,,
580,2,Sunrisers Hyderabad,Royal Challengers Bangalore,2,6,DA Warner,S Dhawan,SR Watson,0,0,0,0,0,0,2,0,2,,,
580,2,Sunrisers Hyderabad,Royal Challengers Bangalore,3,1,S Dhawan,DA Warner,AF Milne,0,0,0,0,0,0,0,0,0,,,
580,2,Sunrisers Hyderabad,Royal Challengers Bangalore,3,2,S Dhawan,DA Warner,AF Milne,0,0,0,0,0,0,1,0,1,,,
580,2,Sunrisers Hyderabad,Royal Challengers Bangalore,3,3,DA Warner,S Dhawan,AF Milne,0,0,0,0,0,0,1,0,1,,,
580,2,Sunrisers Hyderabad,Royal Challengers Bangalore,3,4,S Dhawan,DA Warner,AF Milne,0,0,0,0,0,0,1,0,1,,,
580,2,Sunrisers Hyderabad,Royal Challengers Bangalore,3,5,DA Warner,S Dhawan,AF Milne,0,0,0,0,0,0,4,0,4,,,
580,2,Sunrisers Hyderabad,Royal Challengers Bangalore,3,6,DA Warner,S Dhawan,AF Milne,0,0,0,0,0,0,6,0,6,,,
580,2,Sunrisers Hyderabad,Royal Challengers Bangalore,4,1,S Dhawan,DA Warner,Parvez Rasool,0,0,0,0,0,0,0,0,0,S Dhawan,bowled,
580,2,Sunrisers Hyderabad,Royal Challengers Bangalore,4,2,MC Henriques,DA Warner,Parvez Rasool,0,0,0,0,0,0,1,0,1,,,
580,2,Sunrisers Hyderabad,Royal Challengers Bangalore,4,3,DA Warner,MC Henriques,Parvez Rasool,0,0,0,0,0,0,1,0,1,,,
580,2,Sunrisers Hyderabad,Royal Challengers Bangalore,4,4,MC Henriques,DA Warner,Parvez Rasool,0,0,0,0,0,0,0,0,0,,,
580,2,Sunrisers Hyderabad,Royal Challengers Bangalore,4,5,MC Henriques,DA Warner,Parvez Rasool,0,0,0,0,0,0,0,0,0,,,
580,2,Sunrisers Hyderabad,Royal Challengers Bangalore,4,6,MC Henriques,DA Warner,Parvez Rasool,0,0,0,0,0,0,1,0,1,,,
580,2,Sunrisers Hyderabad,Royal Challengers Bangalore,5,1,MC Henriques,DA Warner,HV Patel,0,0,0,0,0,0,0,0,0,,,
580,2,Sunrisers Hyderabad,Royal Challengers Bangalore,5,2,MC Henriques,DA Warner,HV Patel,0,0,0,0,0,0,1,0,1,,,
580,2,Sunrisers Hyderabad,Royal Challengers Bangalore,5,3,DA Warner,MC Henriques,HV Patel,0,0,0,0,0,0,6,0,6,,,
580,2,Sunrisers Hyderabad,Royal Challengers Bangalore,5,4,DA Warner,MC Henriques,HV Patel,0,0,0,0,0,0,0,0,0,,,
580,2,Sunrisers Hyderabad,Royal Challengers Bangalore,5,5,DA Warner,MC Henriques,HV Patel,0,0,0,0,0,0,4,0,4,,,
580,2,Sunrisers Hyderabad,Royal Challengers Bangalore,5,6,DA Warner,MC Henriques,HV Patel,0,0,0,0,0,0,0,0,0,,,
580,2,Sunrisers Hyderabad,Royal Challengers Bangalore,6,1,MC Henriques,DA Warner,Parvez Rasool,0,0,0,0,0,0,0,0,0,,,
580,2,Sunrisers Hyderabad,Royal Challengers Bangalore,6,2,MC Henriques,DA Warner,Parvez Rasool,0,0,0,0,0,0,0,0,0,,,
580,2,Sunrisers Hyderabad,Royal Challengers Bangalore,6,3,MC Henriques,DA Warner,Parvez Rasool,0,0,0,0,0,0,1,0,1,,,
580,2,Sunrisers Hyderabad,Royal Challengers Bangalore,6,4,DA Warner,MC Henriques,Parvez Rasool,0,0,0,0,0,0,6,0,6,,,
580,2,Sunrisers Hyderabad,Royal Challengers Bangalore,6,5,DA Warner,MC Henriques,Parvez Rasool,0,0,0,0,0,0,0,0,0,,,
580,2,Sunrisers Hyderabad,Royal Challengers Bangalore,6,6,DA Warner,MC Henriques,Parvez Rasool,0,0,0,0,0,0,0,0,0,,,
580,2,Sunrisers Hyderabad,Royal Challengers Bangalore,7,1,MC Henriques,DA Warner,HV Patel,0,0,0,0,0,0,0,0,0,,,
580,2,Sunrisers Hyderabad,Royal Challengers Bangalore,7,2,MC Henriques,DA Warner,HV Patel,0,1,0,0,0,0,0,1,1,,,
580,2,Sunrisers Hyderabad,Royal Challengers Bangalore,7,3,MC Henriques,DA Warner,HV Patel,0,0,0,0,0,0,1,0,1,,,
580,2,Sunrisers Hyderabad,Royal Challengers Bangalore,7,4,DA Warner,MC Henriques,HV Patel,0,0,0,0,0,0,1,0,1,,,
580,2,Sunrisers Hyderabad,Royal Challengers Bangalore,7,5,MC Henriques,DA Warner,HV Patel,0,0,0,0,0,0,0,0,0,,,
580,2,Sunrisers Hyderabad,Royal Challengers Bangalore,7,6,MC Henriques,DA Warner,HV Patel,0,0,0,0,0,0,4,0,4,,,
580,2,Sunrisers Hyderabad,Royal Challengers Bangalore,7,7,MC Henriques,DA Warner,HV Patel,0,0,0,0,0,0,1,0,1,,,
580,2,Sunrisers Hyderabad,Royal Challengers Bangalore,8,1,MC Henriques,DA Warner,YS Chahal,0,0,0,0,0,0,1,0,1,,,
580,2,Sunrisers Hyderabad,Royal Challengers Bangalore,8,2,DA Warner,MC Henriques,YS Chahal,0,0,0,0,0,0,4,0,4,,,
580,2,Sunrisers Hyderabad,Royal Challengers Bangalore,8,3,DA Warner,MC Henriques,YS Chahal,0,0,0,0,0,0,6,0,6,,,
580,2,Sunrisers Hyderabad,Royal Challengers Bangalore,8,4,DA Warner,MC Henriques,YS Chahal,0,0,0,0,0,0,2,0,2,,,
580,2,Sunrisers Hyderabad,Royal Challengers Bangalore,8,5,DA Warner,MC Henriques,YS Chahal,0,0,0,0,0,0,0,0,0,,,
580,2,Sunrisers Hyderabad,Royal Challengers Bangalore,8,6,DA Warner,MC Henriques,YS Chahal,0,0,0,0,0,0,6,0,6,,,
580,2,Sunrisers Hyderabad,Royal Challengers Bangalore,9,1,MC Henriques,DA Warner,SR Watson,0,0,0,0,0,0,0,0,0,,,
580,2,Sunrisers Hyderabad,Royal Challengers Bangalore,9,2,MC Henriques,DA Warner,SR Watson,0,0,0,0,0,0,2,0,2,,,
580,2,Sunrisers Hyderabad,Royal Challengers Bangalore,9,3,MC Henriques,DA Warner,SR Watson,0,0,0,0,0,0,1,0,1,,,
580,2,Sunrisers Hyderabad,Royal Challengers Bangalore,9,4,DA Warner,MC Henriques,SR Watson,0,0,0,0,0,0,0,0,0,DA Warner,caught,AF Milne
580,2,Sunrisers Hyderabad,Royal Challengers Bangalore,9,5,NV Ojha,MC Henriques,SR Watson,0,0,0,0,0,0,0,0,0,,,
580,2,Sunrisers Hyderabad,Royal Challengers Bangalore,9,6,NV Ojha,MC Henriques,SR Watson,0,0,0,0,0,0,0,0,0,,,
580,2,Sunrisers Hyderabad,Royal Challengers Bangalore,10,1,MC Henriques,NV Ojha,YS Chahal,0,0,0,0,0,0,1,0,1,,,
580,2,Sunrisers Hyderabad,Royal Challengers Bangalore,10,2,NV Ojha,MC Henriques,YS Chahal,0,0,0,0,0,0,0,0,0,,,
580,2,Sunrisers Hyderabad,Royal Challengers Bangalore,10,3,NV Ojha,MC Henriques,YS Chahal,0,1,0,0,0,0,0,1,1,,,
580,2,Sunrisers Hyderabad,Royal Challengers Bangalore,10,4,NV Ojha,MC Henriques,YS Chahal,0,0,0,0,0,0,0,0,0,NV Ojha,caught,AB de Villiers
580,2,Sunrisers Hyderabad,Royal Challengers Bangalore,10,5,MC Henriques,DJ Hooda,YS Chahal,0,0,0,0,0,0,0,0,0,,,
580,2,Sunrisers Hyderabad,Royal Challengers Bangalore,10,6,MC Henriques,DJ Hooda,YS Chahal,0,0,0,0,0,0,4,0,4,,,
580,2,Sunrisers Hyderabad,Royal Challengers Bangalore,10,7,MC Henriques,DJ Hooda,YS Chahal,0,0,0,0,0,0,0,0,0,,,
580,2,Sunrisers Hyderabad,Royal Challengers Bangalore,11,1,DJ Hooda,MC Henriques,AF Milne,0,0,0,0,0,0,0,0,0,,,
580,2,Sunrisers Hyderabad,Royal Challengers Bangalore,11,2,DJ Hooda,MC Henriques,AF Milne,0,0,0,0,0,0,1,0,1,,,
580,2,Sunrisers Hyderabad,Royal Challengers Bangalore,11,3,MC Henriques,DJ Hooda,AF Milne,0,0,0,0,0,0,0,0,0,MC Henriques,caught,Parvez Rasool
580,2,Sunrisers Hyderabad,Royal Challengers Bangalore,11,4,DJ Hooda,EJG Morgan,AF Milne,0,0,0,0,0,0,4,0,4,,,
580,2,Sunrisers Hyderabad,Royal Challengers Bangalore,11,5,DJ Hooda,EJG Morgan,AF Milne,0,0,0,0,0,0,1,0,1,,,
580,2,Sunrisers Hyderabad,Royal Challengers Bangalore,11,6,EJG Morgan,DJ Hooda,AF Milne,0,0,0,0,0,0,1,0,1,,,
580,2,Sunrisers Hyderabad,Royal Challengers Bangalore,12,1,EJG Morgan,DJ Hooda,YS Chahal,0,0,0,1,0,0,0,1,1,,,
580,2,Sunrisers Hyderabad,Royal Challengers Bangalore,12,2,DJ Hooda,EJG Morgan,YS Chahal,0,0,0,0,0,0,0,0,0,,,
580,2,Sunrisers Hyderabad,Royal Challengers Bangalore,12,3,DJ Hooda,EJG Morgan,YS Chahal,0,1,0,0,0,0,0,1,1,,,
580,2,Sunrisers Hyderabad,Royal Challengers Bangalore,12,4,DJ Hooda,EJG Morgan,YS Chahal,0,0,0,0,0,0,0,0,0,DJ Hooda,caught,AB de Villiers
580,2,Sunrisers Hyderabad,Royal Challengers Bangalore,12,5,A Ashish Reddy,EJG Morgan,YS Chahal,0,0,0,0,0,0,1,0,1,,,
580,2,Sunrisers Hyderabad,Royal Challengers Bangalore,12,6,EJG Morgan,A Ashish Reddy,YS Chahal,0,0,0,0,0,0,4,0,4,,,
580,2,Sunrisers Hyderabad,Royal Challengers Bangalore,12,7,EJG Morgan,A Ashish Reddy,YS Chahal,0,0,0,0,0,0,0,0,0,,,
580,2,Sunrisers Hyderabad,Royal Challengers Bangalore,13,1,A Ashish Reddy,EJG Morgan,Parvez Rasool,0,0,0,0,0,0,0,0,0,,,
580,2,Sunrisers Hyderabad,Royal Challengers Bangalore,13,2,A Ashish Reddy,EJG Morgan,Parvez Rasool,0,0,0,0,0,0,1,0,1,,,
580,2,Sunrisers Hyderabad,Royal Challengers Bangalore,13,3,EJG Morgan,A Ashish Reddy,Parvez Rasool,0,0,0,0,0,0,1,0,1,,,
580,2,Sunrisers Hyderabad,Royal Challengers Bangalore,13,4,A Ashish Reddy,EJG Morgan,Parvez Rasool,0,0,0,0,0,0,4,0,4,,,
580,2,Sunrisers Hyderabad,Royal Challengers Bangalore,13,5,A Ashish Reddy,EJG Morgan,Parvez Rasool,0,0,0,0,0,0,0,0,0,,,
580,2,Sunrisers Hyderabad,Royal Challengers Bangalore,13,6,A Ashish Reddy,EJG Morgan,Parvez Rasool,0,0,0,0,0,0,1,0,1,,,
580,2,Sunrisers Hyderabad,Royal Challengers Bangalore,14,1,A Ashish Reddy,EJG Morgan,YS Chahal,0,0,0,0,0,0,0,0,0,,,
580,2,Sunrisers Hyderabad,Royal Challengers Bangalore,14,2,A Ashish Reddy,EJG Morgan,YS Chahal,0,0,0,0,0,0,0,0,0,,,
580,2,Sunrisers Hyderabad,Royal Challengers Bangalore,14,3,A Ashish Reddy,EJG Morgan,YS Chahal,0,0,0,0,0,0,6,0,6,,,
580,2,Sunrisers Hyderabad,Royal Challengers Bangalore,14,4,A Ashish Reddy,EJG Morgan,YS Chahal,0,0,0,0,0,0,0,0,0,,,
580,2,Sunrisers Hyderabad,Royal Challengers Bangalore,14,5,A Ashish Reddy,EJG Morgan,YS Chahal,0,0,0,0,0,0,6,0,6,,,
580,2,Sunrisers Hyderabad,Royal Challengers Bangalore,14,6,A Ashish Reddy,EJG Morgan,YS Chahal,0,0,0,0,0,0,0,0,0,,,
580,2,Sunrisers Hyderabad,Royal Challengers Bangalore,15,1,EJG Morgan,A Ashish Reddy,Parvez Rasool,0,0,0,0,0,0,1,0,1,,,
580,2,Sunrisers Hyderabad,Royal Challengers Bangalore,15,2,A Ashish Reddy,EJG Morgan,Parvez Rasool,0,0,0,0,0,0,1,0,1,,,
580,2,Sunrisers Hyderabad,Royal Challengers Bangalore,15,3,EJG Morgan,A Ashish Reddy,Parvez Rasool,0,0,0,0,0,0,1,0,1,,,
580,2,Sunrisers Hyderabad,Royal Challengers Bangalore,15,4,A Ashish Reddy,EJG Morgan,Parvez Rasool,0,0,0,0,0,0,4,0,4,,,
580,2,Sunrisers Hyderabad,Royal Challengers Bangalore,15,5,A Ashish Reddy,EJG Morgan,Parvez Rasool,0,0,0,0,0,0,6,0,6,,,
580,2,Sunrisers Hyderabad,Royal Challengers Bangalore,15,6,A Ashish Reddy,EJG Morgan,Parvez Rasool,0,0,0,0,0,0,1,0,1,,,
580,2,Sunrisers Hyderabad,Royal Challengers Bangalore,16,1,A Ashish Reddy,EJG Morgan,SR Watson,0,0,0,0,0,0,1,0,1,,,
580,2,Sunrisers Hyderabad,Royal Challengers Bangalore,16,2,EJG Morgan,A Ashish Reddy,SR Watson,0,0,0,0,0,0,4,0,4,,,
580,2,Sunrisers Hyderabad,Royal Challengers Bangalore,16,3,EJG Morgan,A Ashish Reddy,SR Watson,0,0,0,0,0,0,0,0,0,,,
580,2,Sunrisers Hyderabad,Royal Challengers Bangalore,16,4,EJG Morgan,A Ashish Reddy,SR Watson,0,0,0,0,0,0,2,0,2,,,
580,2,Sunrisers Hyderabad,Royal Challengers Bangalore,16,5,EJG Morgan,A Ashish Reddy,SR Watson,0,0,0,0,0,0,1,0,1,,,
580,2,Sunrisers Hyderabad,Royal Challengers Bangalore,16,6,A Ashish Reddy,EJG Morgan,SR Watson,0,0,0,0,0,0,0,0,0,A Ashish Reddy,bowled,
580,2,Sunrisers Hyderabad,Royal Challengers Bangalore,17,1,EJG Morgan,KV Sharma,HV Patel,0,0,0,0,0,0,1,0,1,,,
580,2,Sunrisers Hyderabad,Royal Challengers Bangalore,17,2,KV Sharma,EJG Morgan,HV Patel,0,0,0,0,0,0,0,0,0,,,
580,2,Sunrisers Hyderabad,Royal Challengers Bangalore,17,3,KV Sharma,EJG Morgan,HV Patel,0,0,0,0,0,0,2,0,2,,,
580,2,Sunrisers Hyderabad,Royal Challengers Bangalore,17,4,KV Sharma,EJG Morgan,HV Patel,0,0,0,0,0,0,2,0,2,,,
580,2,Sunrisers Hyderabad,Royal Challengers Bangalore,17,5,KV Sharma,EJG Morgan,HV Patel,0,0,0,0,0,0,0,0,0,,,
580,2,Sunrisers Hyderabad,Royal Challengers Bangalore,17,6,KV Sharma,EJG Morgan,HV Patel,0,0,0,0,0,0,0,0,0,,,
580,2,Sunrisers Hyderabad,Royal Challengers Bangalore,18,1,EJG Morgan,KV Sharma,AF Milne,0,0,0,0,0,0,1,0,1,,,
580,2,Sunrisers Hyderabad,Royal Challengers Bangalore,18,2,KV Sharma,EJG Morgan,AF Milne,0,0,0,0,0,0,6,0,6,,,
580,2,Sunrisers Hyderabad,Royal Challengers Bangalore,18,3,KV Sharma,EJG Morgan,AF Milne,0,0,0,0,0,0,0,0,0,,,
580,2,Sunrisers Hyderabad,Royal Challengers Bangalore,18,4,KV Sharma,EJG Morgan,AF Milne,0,0,0,0,0,0,0,0,0,,,
580,2,Sunrisers Hyderabad,Royal Challengers Bangalore,18,5,KV Sharma,EJG Morgan,AF Milne,0,0,0,0,0,0,4,0,4,,,
580,2,Sunrisers Hyderabad,Royal Challengers Bangalore,18,6,KV Sharma,EJG Morgan,AF Milne,0,0,1,0,0,0,0,1,1,,,
580,2,Sunrisers Hyderabad,Royal Challengers Bangalore,19,1,KV Sharma,EJG Morgan,HV Patel,0,0,0,0,0,0,4,0,4,,,
580,2,Sunrisers Hyderabad,Royal Challengers Bangalore,19,2,KV Sharma,EJG Morgan,HV Patel,0,0,0,0,0,0,1,0,1,,,
580,2,Sunrisers Hyderabad,Royal Challengers Bangalore,19,3,EJG Morgan,KV Sharma,HV Patel,0,0,0,0,0,0,0,0,0,,,
580,2,Sunrisers Hyderabad,Royal Challengers Bangalore,19,4,EJG Morgan,KV Sharma,HV Patel,0,0,0,0,0,0,0,0,0,,,
580,2,Sunrisers Hyderabad,Royal Challengers Bangalore,19,5,EJG Morgan,KV Sharma,HV Patel,0,0,0,0,0,0,2,0,2,,,
580,2,Sunrisers Hyderabad,Royal Challengers Bangalore,19,6,EJG Morgan,KV Sharma,HV Patel,0,0,0,0,0,0,2,0,2,,,
580,2,Sunrisers Hyderabad,Royal Challengers Bangalore,20,1,KV Sharma,EJG Morgan,SR Watson,0,0,0,0,0,0,4,0,4,,,
580,2,Sunrisers Hyderabad,Royal Challengers Bangalore,20,2,KV Sharma,EJG Morgan,SR Watson,0,1,0,0,0,0,0,1,1,,,
580,2,Sunrisers Hyderabad,Royal Challengers Bangalore,20,3,KV Sharma,EJG Morgan,SR Watson,0,0,0,0,0,0,0,0,0,,,
580,2,Sunrisers Hyderabad,Royal Challengers Bangalore,20,4,KV Sharma,EJG Morgan,SR Watson,0,0,0,0,0,0,2,0,2,,,
580,2,Sunrisers Hyderabad,Royal Challengers Bangalore,20,5,KV Sharma,EJG Morgan,SR Watson,0,0,0,0,0,0,1,0,1,,,
580,2,Sunrisers Hyderabad,Royal Challengers Bangalore,20,6,EJG Morgan,KV Sharma,SR Watson,0,0,0,0,0,0,1,0,1,,,
580,2,Sunrisers Hyderabad,Royal Challengers Bangalore,20,7,KV Sharma,EJG Morgan,SR Watson,0,0,0,0,0,0,0,0,0,,,
581,1,Kolkata Knight Riders,Mumbai Indians,1,1,RV Uthappa,G Gambhir,TG Southee,0,0,0,0,0,0,1,0,1,,,
581,1,Kolkata Knight Riders,Mumbai Indians,1,2,G Gambhir,RV Uthappa,TG Southee,0,0,0,0,0,0,0,0,0,,,
581,1,Kolkata Knight Riders,Mumbai Indians,1,3,G Gambhir,RV Uthappa,TG Southee,0,0,0,0,0,0,0,0,0,,,
581,1,Kolkata Knight Riders,Mumbai Indians,1,4,G Gambhir,RV Uthappa,TG Southee,0,0,0,0,0,0,0,0,0,,,
581,1,Kolkata Knight Riders,Mumbai Indians,1,5,G Gambhir,RV Uthappa,TG Southee,0,0,0,0,0,0,0,0,0,,,
581,1,Kolkata Knight Riders,Mumbai Indians,1,6,G Gambhir,RV Uthappa,TG Southee,0,1,0,0,0,0,0,1,1,,,
581,1,Kolkata Knight Riders,Mumbai Indians,1,7,G Gambhir,RV Uthappa,TG Southee,0,0,0,0,0,0,1,0,1,,,
581,1,Kolkata Knight Riders,Mumbai Indians,2,1,G Gambhir,RV Uthappa,JJ Bumrah,0,0,0,0,0,0,1,0,1,,,
581,1,Kolkata Knight Riders,Mumbai Indians,2,2,RV Uthappa,G Gambhir,JJ Bumrah,0,0,0,0,0,0,0,0,0,,,
581,1,Kolkata Knight Riders,Mumbai Indians,2,3,RV Uthappa,G Gambhir,JJ Bumrah,0,0,0,0,0,0,1,0,1,,,
581,1,Kolkata Knight Riders,Mumbai Indians,2,4,G Gambhir,RV Uthappa,JJ Bumrah,0,0,0,0,0,0,0,0,0,,,
581,1,Kolkata Knight Riders,Mumbai Indians,2,5,G Gambhir,RV Uthappa,JJ Bumrah,0,0,0,0,0,0,1,0,1,,,
581,1,Kolkata Knight Riders,Mumbai Indians,2,6,RV Uthappa,G Gambhir,JJ Bumrah,0,0,0,0,0,0,0,0,0,,,
581,1,Kolkata Knight Riders,Mumbai Indians,3,1,G Gambhir,RV Uthappa,TG Southee,0,0,0,0,0,0,1,0,1,,,
581,1,Kolkata Knight Riders,Mumbai Indians,3,2,RV Uthappa,G Gambhir,TG Southee,0,0,0,0,0,0,4,0,4,,,
581,1,Kolkata Knight Riders,Mumbai Indians,3,3,RV Uthappa,G Gambhir,TG Southee,0,0,0,1,0,0,0,1,1,,,
581,1,Kolkata Knight Riders,Mumbai Indians,3,4,G Gambhir,RV Uthappa,TG Southee,0,1,0,0,0,0,0,1,1,,,
581,1,Kolkata Knight Riders,Mumbai Indians,3,5,G Gambhir,RV Uthappa,TG Southee,0,0,0,0,0,0,1,0,1,,,
581,1,Kolkata Knight Riders,Mumbai Indians,3,6,RV Uthappa,G Gambhir,TG Southee,0,0,0,0,0,0,1,0,1,,,
581,1,Kolkata Knight Riders,Mumbai Indians,3,7,G Gambhir,RV Uthappa,TG Southee,0,0,0,0,0,0,4,0,4,,,
581,1,Kolkata Knight Riders,Mumbai Indians,4,1,RV Uthappa,G Gambhir,MJ McClenaghan,0,0,0,0,0,0,1,0,1,,,
581,1,Kolkata Knight Riders,Mumbai Indians,4,2,G Gambhir,RV Uthappa,MJ McClenaghan,0,0,0,0,0,0,1,0,1,,,
581,1,Kolkata Knight Riders,Mumbai Indians,4,3,RV Uthappa,G Gambhir,MJ McClenaghan,0,0,0,0,0,0,0,0,0,,,
581,1,Kolkata Knight Riders,Mumbai Indians,4,4,RV Uthappa,G Gambhir,MJ McClenaghan,0,0,0,0,0,0,0,0,0,RV Uthappa,caught,KA Pollard
581,1,Kolkata Knight Riders,Mumbai Indians,4,5,G Gambhir,MK Pandey,MJ McClenaghan,0,0,0,0,0,0,0,0,0,,,
581,1,Kolkata Knight Riders,Mumbai Indians,4,6,G Gambhir,MK Pandey,MJ McClenaghan,0,0,0,0,0,0,1,0,1,,,
581,1,Kolkata Knight Riders,Mumbai Indians,5,1,G Gambhir,MK Pandey,TG Southee,0,0,0,0,0,0,2,0,2,,,
581,1,Kolkata Knight Riders,Mumbai Indians,5,2,G Gambhir,MK Pandey,TG Southee,0,0,0,0,0,0,1,0,1,,,
581,1,Kolkata Knight Riders,Mumbai Indians,5,3,MK Pandey,G Gambhir,TG Southee,0,0,0,0,0,0,1,0,1,,,
581,1,Kolkata Knight Riders,Mumbai Indians,5,4,G Gambhir,MK Pandey,TG Southee,0,0,0,0,0,0,0,0,0,,,
581,1,Kolkata Knight Riders,Mumbai Indians,5,5,G Gambhir,MK Pandey,TG Southee,0,0,0,0,0,0,4,0,4,,,
581,1,Kolkata Knight Riders,Mumbai Indians,5,6,G Gambhir,MK Pandey,TG Southee,0,0,0,0,0,0,4,0,4,,,
581,1,Kolkata Knight Riders,Mumbai Indians,6,1,MK Pandey,G Gambhir,MJ McClenaghan,0,0,0,0,0,0,4,0,4,,,
581,1,Kolkata Knight Riders,Mumbai Indians,6,2,MK Pandey,G Gambhir,MJ McClenaghan,0,0,0,0,0,0,0,0,0,,,
581,1,Kolkata Knight Riders,Mumbai Indians,6,3,MK Pandey,G Gambhir,MJ McClenaghan,0,0,0,0,0,0,0,0,0,,,
581,1,Kolkata Knight Riders,Mumbai Indians,6,4,MK Pandey,G Gambhir,MJ McClenaghan,0,0,0,0,0,0,1,0,1,,,
581,1,Kolkata Knight Riders,Mumbai Indians,6,5,G Gambhir,MK Pandey,MJ McClenaghan,0,0,0,0,0,0,1,0,1,,,
581,1,Kolkata Knight Riders,Mumbai Indians,6,6,MK Pandey,G Gambhir,MJ McClenaghan,0,0,0,0,0,0,0,0,0,,,
581,1,Kolkata Knight Riders,Mumbai Indians,7,1,G Gambhir,MK Pandey,HH Pandya,0,0,0,0,0,0,1,0,1,,,
581,1,Kolkata Knight Riders,Mumbai Indians,7,2,MK Pandey,G Gambhir,HH Pandya,0,0,0,0,0,0,1,0,1,,,
581,1,Kolkata Knight Riders,Mumbai Indians,7,3,G Gambhir,MK Pandey,HH Pandya,0,0,0,0,0,0,2,0,2,,,
581,1,Kolkata Knight Riders,Mumbai Indians,7,4,G Gambhir,MK Pandey,HH Pandya,0,0,0,0,0,0,1,0,1,,,
581,1,Kolkata Knight Riders,Mumbai Indians,7,5,MK Pandey,G Gambhir,HH Pandya,0,0,0,0,0,0,6,0,6,,,
581,1,Kolkata Knight Riders,Mumbai Indians,7,6,MK Pandey,G Gambhir,HH Pandya,0,0,0,0,0,0,1,0,1,,,
581,1,Kolkata Knight Riders,Mumbai Indians,8,1,MK Pandey,G Gambhir,Harbhajan Singh,0,0,0,0,0,0,1,0,1,,,
581,1,Kolkata Knight Riders,Mumbai Indians,8,2,G Gambhir,MK Pandey,Harbhajan Singh,0,0,0,0,0,0,1,0,1,,,
581,1,Kolkata Knight Riders,Mumbai Indians,8,3,MK Pandey,G Gambhir,Harbhajan Singh,0,0,0,0,0,0,1,0,1,,,
581,1,Kolkata Knight Riders,Mumbai Indians,8,4,G Gambhir,MK Pandey,Harbhajan Singh,0,0,0,0,0,0,1,0,1,,,
581,1,Kolkata Knight Riders,Mumbai Indians,8,5,MK Pandey,G Gambhir,Harbhajan Singh,0,0,0,0,0,0,1,0,1,,,
581,1,Kolkata Knight Riders,Mumbai Indians,8,6,G Gambhir,MK Pandey,Harbhajan Singh,0,0,0,0,0,0,1,0,1,,,
581,1,Kolkata Knight Riders,Mumbai Indians,9,1,G Gambhir,MK Pandey,J Suchith,0,1,0,0,0,0,0,1,1,,,
581,1,Kolkata Knight Riders,Mumbai Indians,9,2,G Gambhir,MK Pandey,J Suchith,0,0,0,0,0,0,1,0,1,,,
581,1,Kolkata Knight Riders,Mumbai Indians,9,3,MK Pandey,G Gambhir,J Suchith,0,0,0,0,0,0,2,0,2,,,
581,1,Kolkata Knight Riders,Mumbai Indians,9,4,MK Pandey,G Gambhir,J Suchith,0,1,0,0,0,0,0,1,1,,,
581,1,Kolkata Knight Riders,Mumbai Indians,9,5,MK Pandey,G Gambhir,J Suchith,0,0,0,0,0,0,4,0,4,,,
581,1,Kolkata Knight Riders,Mumbai Indians,9,6,MK Pandey,G Gambhir,J Suchith,0,0,0,0,0,0,2,0,2,,,
581,1,Kolkata Knight Riders,Mumbai Indians,9,7,MK Pandey,G Gambhir,J Suchith,0,0,0,0,0,0,1,0,1,,,
581,1,Kolkata Knight Riders,Mumbai Indians,9,8,G Gambhir,MK Pandey,J Suchith,0,0,0,0,0,0,1,0,1,,,
581,1,Kolkata Knight Riders,Mumbai Indians,10,1,G Gambhir,MK Pandey,Harbhajan Singh,0,0,0,0,0,0,0,0,0,,,
581,1,Kolkata Knight Riders,Mumbai Indians,10,2,G Gambhir,MK Pandey,Harbhajan Singh,0,0,0,0,0,0,1,0,1,,,
581,1,Kolkata Knight Riders,Mumbai Indians,10,3,MK Pandey,G Gambhir,Harbhajan Singh,0,0,0,0,0,0,6,0,6,,,
581,1,Kolkata Knight Riders,Mumbai Indians,10,4,MK Pandey,G Gambhir,Harbhajan Singh,0,0,0,1,0,0,0,1,1,,,
581,1,Kolkata Knight Riders,Mumbai Indians,10,5,G Gambhir,MK Pandey,Harbhajan Singh,0,0,0,0,0,0,2,0,2,,,
581,1,Kolkata Knight Riders,Mumbai Indians,10,6,G Gambhir,MK Pandey,Harbhajan Singh,0,0,0,0,0,0,0,0,0,,,
581,1,Kolkata Knight Riders,Mumbai Indians,11,1,MK Pandey,G Gambhir,J Suchith,0,0,0,0,0,0,6,0,6,,,
581,1,Kolkata Knight Riders,Mumbai Indians,11,2,MK Pandey,G Gambhir,J Suchith,0,0,0,0,0,0,2,0,2,,,
581,1,Kolkata Knight Riders,Mumbai Indians,11,3,MK Pandey,G Gambhir,J Suchith,0,0,0,0,0,0,1,0,1,,,
581,1,Kolkata Knight Riders,Mumbai Indians,11,4,G Gambhir,MK Pandey,J Suchith,0,0,0,0,0,0,6,0,6,,,
581,1,Kolkata Knight Riders,Mumbai Indians,11,5,G Gambhir,MK Pandey,J Suchith,0,0,0,0,0,0,2,0,2,,,
581,1,Kolkata Knight Riders,Mumbai Indians,11,6,G Gambhir,MK Pandey,J Suchith,0,0,0,0,0,0,1,0,1,,,
581,1,Kolkata Knight Riders,Mumbai Indians,12,1,G Gambhir,MK Pandey,MJ McClenaghan,0,0,0,0,0,0,2,0,2,,,
581,1,Kolkata Knight Riders,Mumbai Indians,12,2,G Gambhir,MK Pandey,MJ McClenaghan,0,0,0,0,0,0,1,0,1,,,
581,1,Kolkata Knight Riders,Mumbai Indians,12,3,MK Pandey,G Gambhir,MJ McClenaghan,0,0,0,0,0,0,1,0,1,,,
581,1,Kolkata Knight Riders,Mumbai Indians,12,4,G Gambhir,MK Pandey,MJ McClenaghan,0,0,0,0,0,0,2,0,2,,,
581,1,Kolkata Knight Riders,Mumbai Indians,12,5,G Gambhir,MK Pandey,MJ McClenaghan,0,1,0,0,0,0,0,1,1,,,
581,1,Kolkata Knight Riders,Mumbai Indians,12,6,G Gambhir,MK Pandey,MJ McClenaghan,0,0,0,0,0,0,1,0,1,,,
581,1,Kolkata Knight Riders,Mumbai Indians,12,7,MK Pandey,G Gambhir,MJ McClenaghan,0,0,0,0,0,0,1,0,1,,,
581,1,Kolkata Knight Riders,Mumbai Indians,13,1,MK Pandey,G Gambhir,JJ Bumrah,0,0,0,0,0,0,2,0,2,,,
581,1,Kolkata Knight Riders,Mumbai Indians,13,2,MK Pandey,G Gambhir,JJ Bumrah,0,0,0,0,0,0,4,0,4,,,
581,1,Kolkata Knight Riders,Mumbai Indians,13,3,MK Pandey,G Gambhir,JJ Bumrah,0,0,0,0,0,0,1,0,1,,,
581,1,Kolkata Knight Riders,Mumbai Indians,13,4,G Gambhir,MK Pandey,JJ Bumrah,0,0,0,0,0,0,0,0,0,,,
581,1,Kolkata Knight Riders,Mumbai Indians,13,5,G Gambhir,MK Pandey,JJ Bumrah,0,0,0,0,0,0,1,0,1,,,
581,1,Kolkata Knight Riders,Mumbai Indians,13,6,MK Pandey,G Gambhir,JJ Bumrah,0,0,0,0,0,0,2,0,2,,,
581,1,Kolkata Knight Riders,Mumbai Indians,14,1,G Gambhir,MK Pandey,Harbhajan Singh,0,0,0,0,0,0,2,0,2,,,
581,1,Kolkata Knight Riders,Mumbai Indians,14,2,G Gambhir,MK Pandey,Harbhajan Singh,0,0,0,0,0,0,1,0,1,,,
581,1,Kolkata Knight Riders,Mumbai Indians,14,3,MK Pandey,G Gambhir,Harbhajan Singh,0,0,0,0,0,0,0,0,0,,,
581,1,Kolkata Knight Riders,Mumbai Indians,14,4,MK Pandey,G Gambhir,Harbhajan Singh,0,0,0,0,0,0,0,0,0,MK Pandey,caught and bowled,
581,1,Kolkata Knight Riders,Mumbai Indians,14,5,AD Russell,G Gambhir,Harbhajan Singh,0,0,0,0,0,0,1,0,1,,,
581,1,Kolkata Knight Riders,Mumbai Indians,14,6,G Gambhir,AD Russell,Harbhajan Singh,0,0,0,0,0,0,0,0,0,,,
581,1,Kolkata Knight Riders,Mumbai Indians,15,1,AD Russell,G Gambhir,TG Southee,0,0,0,0,0,0,0,0,0,,,
581,1,Kolkata Knight Riders,Mumbai Indians,15,2,AD Russell,G Gambhir,TG Southee,0,0,0,0,0,0,0,0,0,,,
581,1,Kolkata Knight Riders,Mumbai Indians,15,3,AD Russell,G Gambhir,TG Southee,0,0,0,0,0,0,6,0,6,,,
581,1,Kolkata Knight Riders,Mumbai Indians,15,4,AD Russell,G Gambhir,TG Southee,0,1,0,0,0,0,0,1,1,,,
581,1,Kolkata Knight Riders,Mumbai Indians,15,5,AD Russell,G Gambhir,TG Southee,0,0,0,0,0,0,2,0,2,,,
581,1,Kolkata Knight Riders,Mumbai Indians,15,6,AD Russell,G Gambhir,TG Southee,0,0,0,0,0,0,6,0,6,,,
581,1,Kolkata Knight Riders,Mumbai Indians,15,7,AD Russell,G Gambhir,TG Southee,0,0,0,0,0,0,1,0,1,,,
581,1,Kolkata Knight Riders,Mumbai Indians,16,1,AD Russell,G Gambhir,Harbhajan Singh,0,0,0,0,0,0,6,0,6,,,
581,1,Kolkata Knight Riders,Mumbai Indians,16,2,AD Russell,G Gambhir,Harbhajan Singh,0,0,0,0,0,0,0,0,0,,,
581,1,Kolkata Knight Riders,Mumbai Indians,16,3,AD Russell,G Gambhir,Harbhajan Singh,0,0,0,1,0,0,0,1,1,,,
581,1,Kolkata Knight Riders,Mumbai Indians,16,4,G Gambhir,AD Russell,Harbhajan Singh,0,0,0,0,0,0,1,0,1,,,
581,1,Kolkata Knight Riders,Mumbai Indians,16,5,AD Russell,G Gambhir,Harbhajan Singh,0,0,0,0,0,0,4,0,4,,,
581,1,Kolkata Knight Riders,Mumbai Indians,16,6,AD Russell,G Gambhir,Harbhajan Singh,0,0,0,0,0,0,1,0,1,,,
581,1,Kolkata Knight Riders,Mumbai Indians,17,1,AD Russell,G Gambhir,JJ Bumrah,0,0,0,0,0,0,1,0,1,,,
581,1,Kolkata Knight Riders,Mumbai Indians,17,2,G Gambhir,AD Russell,JJ Bumrah,0,0,0,0,0,0,2,0,2,,,
581,1,Kolkata Knight Riders,Mumbai Indians,17,3,G Gambhir,AD Russell,JJ Bumrah,0,0,0,0,0,0,1,0,1,,,
581,1,Kolkata Knight Riders,Mumbai Indians,17,4,AD Russell,G Gambhir,JJ Bumrah,0,0,0,0,0,0,0,0,0,,,
581,1,Kolkata Knight Riders,Mumbai Indians,17,5,AD Russell,G Gambhir,JJ Bumrah,0,0,0,0,0,0,2,0,2,,,
581,1,Kolkata Knight Riders,Mumbai Indians,17,6,AD Russell,G Gambhir,JJ Bumrah,0,0,0,0,0,0,6,0,6,,,
581,1,Kolkata Knight Riders,Mumbai Indians,18,1,G Gambhir,AD Russell,MJ McClenaghan,0,0,0,0,0,0,1,0,1,,,
581,1,Kolkata Knight Riders,Mumbai Indians,18,2,AD Russell,G Gambhir,MJ McClenaghan,0,0,0,0,0,0,0,0,0,AD Russell,bowled,
581,1,Kolkata Knight Riders,Mumbai Indians,18,3,YK Pathan,G Gambhir,MJ McClenaghan,0,0,0,0,0,0,1,0,1,,,
581,1,Kolkata Knight Riders,Mumbai Indians,18,4,G Gambhir,YK Pathan,MJ McClenaghan,0,0,0,0,0,0,0,0,0,,,
581,1,Kolkata Knight Riders,Mumbai Indians,18,5,G Gambhir,YK Pathan,MJ McClenaghan,0,0,0,0,0,0,4,0,4,,,
581,1,Kolkata Knight Riders,Mumbai Indians,18,6,G Gambhir,YK Pathan,MJ McClenaghan,0,0,0,0,0,0,1,0,1,,,
581,1,Kolkata Knight Riders,Mumbai Indians,19,1,G Gambhir,YK Pathan,HH Pandya,0,0,0,0,0,0,0,0,0,G Gambhir,caught,PA Patel
581,1,Kolkata Knight Riders,Mumbai Indians,19,2,YK Pathan,C Munro,HH Pandya,0,0,0,0,0,0,4,0,4,,,
581,1,Kolkata Knight Riders,Mumbai Indians,19,3,YK Pathan,C Munro,HH Pandya,0,0,0,0,0,0,1,0,1,,,
581,1,Kolkata Knight Riders,Mumbai Indians,19,4,C Munro,YK Pathan,HH Pandya,0,0,0,0,0,0,1,0,1,,,
581,1,Kolkata Knight Riders,Mumbai Indians,19,5,YK Pathan,C Munro,HH Pandya,0,0,0,0,0,0,1,0,1,,,
581,1,Kolkata Knight Riders,Mumbai Indians,19,6,C Munro,YK Pathan,HH Pandya,0,1,0,0,0,0,0,1,1,,,
581,1,Kolkata Knight Riders,Mumbai Indians,19,7,C Munro,YK Pathan,HH Pandya,0,0,0,0,0,0,2,0,2,,,
581,1,Kolkata Knight Riders,Mumbai Indians,20,1,YK Pathan,C Munro,JJ Bumrah,0,0,0,0,0,0,1,0,1,,,
581,1,Kolkata Knight Riders,Mumbai Indians,20,2,C Munro,YK Pathan,JJ Bumrah,0,0,0,0,0,0,0,0,0,,,
581,1,Kolkata Knight Riders,Mumbai Indians,20,3,C Munro,YK Pathan,JJ Bumrah,0,0,0,0,0,0,0,0,0,,,
581,1,Kolkata Knight Riders,Mumbai Indians,20,4,C Munro,YK Pathan,JJ Bumrah,0,0,0,0,0,0,1,0,1,,,
581,1,Kolkata Knight Riders,Mumbai Indians,20,5,YK Pathan,C Munro,JJ Bumrah,0,0,0,0,0,0,1,0,1,C Munro,run out,TG Southee
581,1,Kolkata Knight Riders,Mumbai Indians,20,6,SA Yadav,YK Pathan,JJ Bumrah,0,0,0,0,0,0,4,0,4,,,
581,2,Mumbai Indians,Kolkata Knight Riders,1,1,RG Sharma,PA Patel,AD Russell,0,0,0,0,0,0,0,0,0,,,
581,2,Mumbai Indians,Kolkata Knight Riders,1,2,RG Sharma,PA Patel,AD Russell,0,0,0,0,0,0,0,0,0,,,
581,2,Mumbai Indians,Kolkata Knight Riders,1,3,RG Sharma,PA Patel,AD Russell,0,0,0,0,0,0,6,0,6,,,
581,2,Mumbai Indians,Kolkata Knight Riders,1,4,RG Sharma,PA Patel,AD Russell,0,0,0,0,0,0,1,0,1,,,
581,2,Mumbai Indians,Kolkata Knight Riders,1,5,PA Patel,RG Sharma,AD Russell,0,0,0,0,0,0,0,0,0,,,
581,2,Mumbai Indians,Kolkata Knight Riders,1,6,PA Patel,RG Sharma,AD Russell,0,0,0,0,0,0,1,0,1,,,
581,2,Mumbai Indians,Kolkata Knight Riders,2,1,PA Patel,RG Sharma,JW Hastings,0,0,0,0,0,0,0,0,0,,,
581,2,Mumbai Indians,Kolkata Knight Riders,2,2,PA Patel,RG Sharma,JW Hastings,0,1,0,0,0,0,0,1,1,,,
581,2,Mumbai Indians,Kolkata Knight Riders,2,3,PA Patel,RG Sharma,JW Hastings,0,0,0,0,0,0,4,0,4,,,
581,2,Mumbai Indians,Kolkata Knight Riders,2,4,PA Patel,RG Sharma,JW Hastings,0,0,0,0,0,0,0,0,0,,,
581,2,Mumbai Indians,Kolkata Knight Riders,2,5,PA Patel,RG Sharma,JW Hastings,0,0,0,0,0,0,1,0,1,,,
581,2,Mumbai Indians,Kolkata Knight Riders,2,6,RG Sharma,PA Patel,JW Hastings,0,0,0,0,0,0,0,0,0,,,
581,2,Mumbai Indians,Kolkata Knight Riders,2,7,RG Sharma,PA Patel,JW Hastings,0,0,0,0,0,0,4,0,4,,,
581,2,Mumbai Indians,Kolkata Knight Riders,3,1,PA Patel,RG Sharma,AD Russell,0,0,0,0,0,0,4,0,4,,,
581,2,Mumbai Indians,Kolkata Knight Riders,3,2,PA Patel,RG Sharma,AD Russell,0,0,0,0,0,0,4,0,4,,,
581,2,Mumbai Indians,Kolkata Knight Riders,3,3,PA Patel,RG Sharma,AD Russell,0,0,0,0,0,0,0,0,0,,,
581,2,Mumbai Indians,Kolkata Knight Riders,3,4,PA Patel,RG Sharma,AD Russell,0,0,0,0,0,0,0,0,0,,,
581,2,Mumbai Indians,Kolkata Knight Riders,3,5,PA Patel,RG Sharma,AD Russell,0,0,0,0,0,0,1,0,1,,,
581,2,Mumbai Indians,Kolkata Knight Riders,3,6,RG Sharma,PA Patel,AD Russell,0,0,0,0,0,0,0,0,0,,,
581,2,Mumbai Indians,Kolkata Knight Riders,4,1,PA Patel,RG Sharma,GB Hogg,0,0,0,1,0,0,0,1,1,,,
581,2,Mumbai Indians,Kolkata Knight Riders,4,2,RG Sharma,PA Patel,GB Hogg,0,0,0,0,0,0,4,0,4,,,
581,2,Mumbai Indians,Kolkata Knight Riders,4,3,RG Sharma,PA Patel,GB Hogg,0,0,0,0,0,0,0,0,0,,,
581,2,Mumbai Indians,Kolkata Knight Riders,4,4,RG Sharma,PA Patel,GB Hogg,0,0,1,0,0,0,0,1,1,,,
581,2,Mumbai Indians,Kolkata Knight Riders,4,5,PA Patel,RG Sharma,GB Hogg,0,0,0,0,0,0,0,0,0,,,
581,2,Mumbai Indians,Kolkata Knight Riders,4,6,PA Patel,RG Sharma,GB Hogg,0,0,0,0,0,0,4,0,4,,,
581,2,Mumbai Indians,Kolkata Knight Riders,5,1,RG Sharma,PA Patel,JW Hastings,0,1,0,0,0,0,0,1,1,,,
581,2,Mumbai Indians,Kolkata Knight Riders,5,2,RG Sharma,PA Patel,JW Hastings,0,0,0,0,0,0,4,0,4,,,
581,2,Mumbai Indians,Kolkata Knight Riders,5,3,RG Sharma,PA Patel,JW Hastings,0,0,0,0,0,0,1,0,1,,,
581,2,Mumbai Indians,Kolkata Knight Riders,5,4,PA Patel,RG Sharma,JW Hastings,0,0,0,0,0,0,2,0,2,,,
581,2,Mumbai Indians,Kolkata Knight Riders,5,5,PA Patel,RG Sharma,JW Hastings,0,0,0,0,0,0,1,0,1,,,
581,2,Mumbai Indians,Kolkata Knight Riders,5,6,RG Sharma,PA Patel,JW Hastings,0,0,0,0,0,0,4,0,4,,,
581,2,Mumbai Indians,Kolkata Knight Riders,5,7,RG Sharma,PA Patel,JW Hastings,0,0,0,0,0,0,0,0,0,,,
581,2,Mumbai Indians,Kolkata Knight Riders,6,1,PA Patel,RG Sharma,GB Hogg,0,1,0,0,0,0,0,1,1,,,
581,2,Mumbai Indians,Kolkata Knight Riders,6,2,PA Patel,RG Sharma,GB Hogg,0,0,0,0,0,0,1,0,1,,,
581,2,Mumbai Indians,Kolkata Knight Riders,6,3,RG Sharma,PA Patel,GB Hogg,0,0,0,0,0,0,1,0,1,,,
581,2,Mumbai Indians,Kolkata Knight Riders,6,4,PA Patel,RG Sharma,GB Hogg,0,0,0,0,0,0,0,0,0,,,
581,2,Mumbai Indians,Kolkata Knight Riders,6,5,PA Patel,RG Sharma,GB Hogg,0,0,0,0,0,0,0,0,0,,,
581,2,Mumbai Indians,Kolkata Knight Riders,6,6,PA Patel,RG Sharma,GB Hogg,0,0,0,0,0,0,0,0,0,PA Patel,run out,GB Hogg
581,2,Mumbai Indians,Kolkata Knight Riders,6,7,HH Pandya,RG Sharma,GB Hogg,0,0,0,0,0,0,0,0,0,,,
581,2,Mumbai Indians,Kolkata Knight Riders,7,1,RG Sharma,HH Pandya,PP Chawla,0,0,0,0,0,0,1,0,1,,,
581,2,Mumbai Indians,Kolkata Knight Riders,7,2,HH Pandya,RG Sharma,PP Chawla,0,0,0,0,0,0,1,0,1,,,
581,2,Mumbai Indians,Kolkata Knight Riders,7,3,RG Sharma,HH Pandya,PP Chawla,0,0,0,0,0,0,1,0,1,,,
581,2,Mumbai Indians,Kolkata Knight Riders,7,4,HH Pandya,RG Sharma,PP Chawla,0,0,0,0,0,0,1,0,1,,,
581,2,Mumbai Indians,Kolkata Knight Riders,7,5,RG Sharma,HH Pandya,PP Chawla,0,0,0,0,0,0,0,0,0,,,
581,2,Mumbai Indians,Kolkata Knight Riders,7,6,RG Sharma,HH Pandya,PP Chawla,0,0,0,0,0,0,1,0,1,,,
581,2,Mumbai Indians,Kolkata Knight Riders,8,1,RG Sharma,HH Pandya,Kuldeep Yadav,0,0,0,0,0,0,0,0,0,,,
581,2,Mumbai Indians,Kolkata Knight Riders,8,2,RG Sharma,HH Pandya,Kuldeep Yadav,0,0,0,0,0,0,1,0,1,,,
581,2,Mumbai Indians,Kolkata Knight Riders,8,3,HH Pandya,RG Sharma,Kuldeep Yadav,0,0,0,0,0,0,1,0,1,,,
581,2,Mumbai Indians,Kolkata Knight Riders,8,4,RG Sharma,HH Pandya,Kuldeep Yadav,0,0,0,0,0,0,0,0,0,,,
581,2,Mumbai Indians,Kolkata Knight Riders,8,5,RG Sharma,HH Pandya,Kuldeep Yadav,0,0,0,0,0,0,1,0,1,,,
581,2,Mumbai Indians,Kolkata Knight Riders,8,6,HH Pandya,RG Sharma,Kuldeep Yadav,0,0,0,0,0,0,2,0,2,,,
581,2,Mumbai Indians,Kolkata Knight Riders,9,1,RG Sharma,HH Pandya,PP Chawla,0,0,0,0,0,0,6,0,6,,,
581,2,Mumbai Indians,Kolkata Knight Riders,9,2,RG Sharma,HH Pandya,PP Chawla,0,0,0,0,0,0,0,0,0,,,
581,2,Mumbai Indians,Kolkata Knight Riders,9,3,RG Sharma,HH Pandya,PP Chawla,0,0,0,0,0,0,1,0,1,,,
581,2,Mumbai Indians,Kolkata Knight Riders,9,4,HH Pandya,RG Sharma,PP Chawla,0,0,0,0,0,0,1,0,1,,,
581,2,Mumbai Indians,Kolkata Knight Riders,9,5,RG Sharma,HH Pandya,PP Chawla,0,0,0,0,0,0,0,0,0,,,
581,2,Mumbai Indians,Kolkata Knight Riders,9,6,RG Sharma,HH Pandya,PP Chawla,0,0,0,0,0,0,1,0,1,,,
581,2,Mumbai Indians,Kolkata Knight Riders,10,1,RG Sharma,HH Pandya,Kuldeep Yadav,0,0,0,0,0,0,1,0,1,,,
581,2,Mumbai Indians,Kolkata Knight Riders,10,2,HH Pandya,RG Sharma,Kuldeep Yadav,0,0,0,0,0,0,2,0,2,,,
581,2,Mumbai Indians,Kolkata Knight Riders,10,3,HH Pandya,RG Sharma,Kuldeep Yadav,0,0,0,0,0,0,0,0,0,,,
581,2,Mumbai Indians,Kolkata Knight Riders,10,4,HH Pandya,RG Sharma,Kuldeep Yadav,0,5,0,0,0,0,0,5,5,,,
581,2,Mumbai Indians,Kolkata Knight Riders,10,5,HH Pandya,RG Sharma,Kuldeep Yadav,0,0,0,0,0,0,1,0,1,,,
581,2,Mumbai Indians,Kolkata Knight Riders,10,6,RG Sharma,HH Pandya,Kuldeep Yadav,0,0,0,0,0,0,0,0,0,,,
581,2,Mumbai Indians,Kolkata Knight Riders,10,7,RG Sharma,HH Pandya,Kuldeep Yadav,0,0,0,0,0,0,6,0,6,,,
581,2,Mumbai Indians,Kolkata Knight Riders,11,1,HH Pandya,RG Sharma,PP Chawla,0,0,0,0,0,0,0,0,0,HH Pandya,caught,MK Pandey
581,2,Mumbai Indians,Kolkata Knight Riders,11,2,RG Sharma,MJ McClenaghan,PP Chawla,0,0,0,0,0,0,1,0,1,,,
581,2,Mumbai Indians,Kolkata Knight Riders,11,3,MJ McClenaghan,RG Sharma,PP Chawla,0,0,0,0,0,0,0,0,0,,,
581,2,Mumbai Indians,Kolkata Knight Riders,11,4,MJ McClenaghan,RG Sharma,PP Chawla,0,0,0,0,0,0,6,0,6,,,
581,2,Mumbai Indians,Kolkata Knight Riders,11,5,MJ McClenaghan,RG Sharma,PP Chawla,0,0,0,0,0,0,6,0,6,,,
581,2,Mumbai Indians,Kolkata Knight Riders,11,6,MJ McClenaghan,RG Sharma,PP Chawla,0,0,0,0,0,0,1,0,1,,,
581,2,Mumbai Indians,Kolkata Knight Riders,12,1,MJ McClenaghan,RG Sharma,Kuldeep Yadav,0,0,0,0,0,0,6,0,6,,,
581,2,Mumbai Indians,Kolkata Knight Riders,12,2,MJ McClenaghan,RG Sharma,Kuldeep Yadav,0,0,0,0,0,0,1,0,1,,,
581,2,Mumbai Indians,Kolkata Knight Riders,12,3,RG Sharma,MJ McClenaghan,Kuldeep Yadav,0,0,0,0,0,0,1,0,1,,,
581,2,Mumbai Indians,Kolkata Knight Riders,12,4,MJ McClenaghan,RG Sharma,Kuldeep Yadav,0,0,0,0,0,0,0,0,0,,,
581,2,Mumbai Indians,Kolkata Knight Riders,12,5,MJ McClenaghan,RG Sharma,Kuldeep Yadav,0,0,0,0,0,0,0,0,0,MJ McClenaghan,caught,C Munro
581,2,Mumbai Indians,Kolkata Knight Riders,12,6,RG Sharma,JC Buttler,Kuldeep Yadav,0,0,0,0,0,0,0,0,0,,,
581,2,Mumbai Indians,Kolkata Knight Riders,13,1,JC Buttler,RG Sharma,JW Hastings,0,0,0,0,0,0,1,0,1,,,
581,2,Mumbai Indians,Kolkata Knight Riders,13,2,RG Sharma,JC Buttler,JW Hastings,0,0,0,0,0,0,0,0,0,,,
581,2,Mumbai Indians,Kolkata Knight Riders,13,3,RG Sharma,JC Buttler,JW Hastings,0,0,0,0,0,0,1,0,1,,,
581,2,Mumbai Indians,Kolkata Knight Riders,13,4,JC Buttler,RG Sharma,JW Hastings,0,0,0,0,0,0,1,0,1,,,
581,2,Mumbai Indians,Kolkata Knight Riders,13,5,RG Sharma,JC Buttler,JW Hastings,0,0,0,0,0,0,1,0,1,,,
581,2,Mumbai Indians,Kolkata Knight Riders,13,6,JC Buttler,RG Sharma,JW Hastings,0,0,0,0,0,0,0,0,0,,,
581,2,Mumbai Indians,Kolkata Knight Riders,14,1,RG Sharma,JC Buttler,Kuldeep Yadav,0,0,0,0,0,0,1,0,1,,,
581,2,Mumbai Indians,Kolkata Knight Riders,14,2,JC Buttler,RG Sharma,Kuldeep Yadav,0,0,0,0,0,0,4,0,4,,,
581,2,Mumbai Indians,Kolkata Knight Riders,14,3,JC Buttler,RG Sharma,Kuldeep Yadav,0,0,0,0,0,0,1,0,1,,,
581,2,Mumbai Indians,Kolkata Knight Riders,14,4,RG Sharma,JC Buttler,Kuldeep Yadav,0,0,0,0,0,0,2,0,2,,,
581,2,Mumbai Indians,Kolkata Knight Riders,14,5,RG Sharma,JC Buttler,Kuldeep Yadav,0,0,0,0,0,0,1,0,1,,,
581,2,Mumbai Indians,Kolkata Knight Riders,14,6,JC Buttler,RG Sharma,Kuldeep Yadav,0,0,0,0,0,0,0,0,0,,,
581,2,Mumbai Indians,Kolkata Knight Riders,15,1,RG Sharma,JC Buttler,GB Hogg,0,0,0,0,0,0,4,0,4,,,
581,2,Mumbai Indians,Kolkata Knight Riders,15,2,RG Sharma,JC Buttler,GB Hogg,0,0,0,0,0,0,1,0,1,,,
581,2,Mumbai Indians,Kolkata Knight Riders,15,3,JC Buttler,RG Sharma,GB Hogg,0,0,0,0,0,0,1,0,1,,,
581,2,Mumbai Indians,Kolkata Knight Riders,15,4,RG Sharma,JC Buttler,GB Hogg,0,0,0,0,0,0,1,0,1,,,
581,2,Mumbai Indians,Kolkata Knight Riders,15,5,JC Buttler,RG Sharma,GB Hogg,0,0,0,0,0,0,4,0,4,,,
581,2,Mumbai Indians,Kolkata Knight Riders,15,6,JC Buttler,RG Sharma,GB Hogg,0,0,0,0,0,0,6,0,6,,,
581,2,Mumbai Indians,Kolkata Knight Riders,16,1,RG Sharma,JC Buttler,AD Russell,0,0,0,0,0,0,0,0,0,,,
581,2,Mumbai Indians,Kolkata Knight Riders,16,2,RG Sharma,JC Buttler,AD Russell,0,0,0,0,0,0,1,0,1,,,
581,2,Mumbai Indians,Kolkata Knight Riders,16,3,JC Buttler,RG Sharma,AD Russell,0,0,0,0,0,0,4,0,4,,,
581,2,Mumbai Indians,Kolkata Knight Riders,16,4,JC Buttler,RG Sharma,AD Russell,0,0,0,0,0,0,6,0,6,,,
581,2,Mumbai Indians,Kolkata Knight Riders,16,5,JC Buttler,RG Sharma,AD Russell,0,0,0,0,0,0,6,0,6,,,
581,2,Mumbai Indians,Kolkata Knight Riders,16,6,JC Buttler,RG Sharma,AD Russell,0,0,0,0,0,0,1,0,1,,,
581,2,Mumbai Indians,Kolkata Knight Riders,17,1,JC Buttler,RG Sharma,GB Hogg,0,0,0,0,0,0,2,0,2,,,
581,2,Mumbai Indians,Kolkata Knight Riders,17,2,JC Buttler,RG Sharma,GB Hogg,0,0,0,0,0,0,0,0,0,,,
581,2,Mumbai Indians,Kolkata Knight Riders,17,3,JC Buttler,RG Sharma,GB Hogg,0,0,0,0,0,0,1,0,1,,,
581,2,Mumbai Indians,Kolkata Knight Riders,17,4,RG Sharma,JC Buttler,GB Hogg,0,0,0,0,0,0,4,0,4,,,
581,2,Mumbai Indians,Kolkata Knight Riders,17,5,RG Sharma,JC Buttler,GB Hogg,0,0,0,0,0,0,0,0,0,,,
581,2,Mumbai Indians,Kolkata Knight Riders,17,6,RG Sharma,JC Buttler,GB Hogg,0,0,0,0,0,0,2,0,2,,,
581,2,Mumbai Indians,Kolkata Knight Riders,18,1,JC Buttler,RG Sharma,JW Hastings,0,0,0,0,0,0,1,0,1,,,
581,2,Mumbai Indians,Kolkata Knight Riders,18,2,RG Sharma,JC Buttler,JW Hastings,0,0,0,0,0,0,1,0,1,,,
581,2,Mumbai Indians,Kolkata Knight Riders,18,3,JC Buttler,RG Sharma,JW Hastings,0,0,0,0,0,0,0,0,0,,,
581,2,Mumbai Indians,Kolkata Knight Riders,18,4,JC Buttler,RG Sharma,JW Hastings,0,0,0,0,0,0,0,0,0,,,
581,2,Mumbai Indians,Kolkata Knight Riders,18,5,JC Buttler,RG Sharma,JW Hastings,0,0,0,0,0,0,2,0,2,,,
581,2,Mumbai Indians,Kolkata Knight Riders,18,6,JC Buttler,RG Sharma,JW Hastings,0,0,0,0,0,0,0,0,0,,,
581,2,Mumbai Indians,Kolkata Knight Riders,19,1,RG Sharma,JC Buttler,AD Russell,0,0,0,0,0,0,4,0,4,,,
581,2,Mumbai Indians,Kolkata Knight Riders,19,2,RG Sharma,JC Buttler,AD Russell,0,0,0,0,0,0,1,0,1,,,
581,2,Mumbai Indians,Kolkata Knight Riders,19,3,JC Buttler,RG Sharma,AD Russell,0,0,0,0,0,0,0,0,0,JC Buttler,caught,SA Yadav
581,2,Mumbai Indians,Kolkata Knight Riders,19,4,RG Sharma,KA Pollard,AD Russell,0,0,0,0,0,0,4,0,4,,,
581,2,Mumbai Indians,Kolkata Knight Riders,19,5,RG Sharma,KA Pollard,AD Russell,0,0,0,0,0,0,4,0,4,,,
581,2,Mumbai Indians,Kolkata Knight Riders,19,6,RG Sharma,KA Pollard,AD Russell,0,0,0,0,0,0,4,0,4,,,
581,2,Mumbai Indians,Kolkata Knight Riders,20,1,KA Pollard,RG Sharma,PP Chawla,0,0,0,0,0,0,1,0,1,,,
582,1,Rising Pune Supergiants,Gujarat Lions,1,1,AM Rahane,F du Plessis,P Kumar,0,0,0,0,0,0,0,0,0,,,
582,1,Rising Pune Supergiants,Gujarat Lions,1,2,AM Rahane,F du Plessis,P Kumar,0,0,0,0,0,0,4,0,4,,,
582,1,Rising Pune Supergiants,Gujarat Lions,1,3,AM Rahane,F du Plessis,P Kumar,0,0,0,0,0,0,1,0,1,,,
582,1,Rising Pune Supergiants,Gujarat Lions,1,4,F du Plessis,AM Rahane,P Kumar,0,0,0,0,0,0,0,0,0,,,
582,1,Rising Pune Supergiants,Gujarat Lions,1,5,F du Plessis,AM Rahane,P Kumar,0,0,0,0,0,0,0,0,0,,,
582,1,Rising Pune Supergiants,Gujarat Lions,1,6,F du Plessis,AM Rahane,P Kumar,0,0,0,0,0,0,0,0,0,,,
582,1,Rising Pune Supergiants,Gujarat Lions,2,1,AM Rahane,F du Plessis,SB Jakati,0,0,0,0,0,0,0,0,0,,,
582,1,Rising Pune Supergiants,Gujarat Lions,2,2,AM Rahane,F du Plessis,SB Jakati,0,0,0,0,0,0,1,0,1,,,
582,1,Rising Pune Supergiants,Gujarat Lions,2,3,F du Plessis,AM Rahane,SB Jakati,0,0,0,0,0,0,1,0,1,,,
582,1,Rising Pune Supergiants,Gujarat Lions,2,4,AM Rahane,F du Plessis,SB Jakati,0,0,0,0,0,0,4,0,4,,,
582,1,Rising Pune Supergiants,Gujarat Lions,2,5,AM Rahane,F du Plessis,SB Jakati,0,0,0,0,0,0,4,0,4,,,
582,1,Rising Pune Supergiants,Gujarat Lions,2,6,AM Rahane,F du Plessis,SB Jakati,0,0,0,0,0,0,1,0,1,,,
582,1,Rising Pune Supergiants,Gujarat Lions,3,1,AM Rahane,F du Plessis,P Kumar,0,0,0,0,0,0,0,0,0,,,
582,1,Rising Pune Supergiants,Gujarat Lions,3,2,AM Rahane,F du Plessis,P Kumar,0,0,0,0,0,0,0,0,0,,,
582,1,Rising Pune Supergiants,Gujarat Lions,3,3,AM Rahane,F du Plessis,P Kumar,0,0,0,0,0,0,1,0,1,,,
582,1,Rising Pune Supergiants,Gujarat Lions,3,4,F du Plessis,AM Rahane,P Kumar,0,0,0,0,0,0,4,0,4,,,
582,1,Rising Pune Supergiants,Gujarat Lions,3,5,F du Plessis,AM Rahane,P Kumar,0,0,0,0,0,0,1,0,1,,,