[
    ["Sunrisers Hyderabad", [{
        "y": 10,
        "label": "2013"
    }, {
        "y": 6,
        "label": "2014"
    }, {
        "y": 7,
        "label": "2015"
    }, {
        "y": 11,
        "label": "2016"
    }, {
        "y": 8,
        "label": "2017"
    }]],
    
    ["Rising Pune Supergiants", [{
        "y": 5,
        "label": "2016"
    }, {
        "y": 10,
        "label": "2017"
    }]],
    ["Kolkata Knight Riders", [{
        "y": 6,
        "label": "2008"
    }, {
        "y": 3,
        "label": "2009"
    }, {
        "y": 7,
        "label": "2010"
    }, {
        "y": 8,
        "label": "2011"
    }, {
        "y": 12,
        "label": "2012"
    }, {
        "y": 6,
        "label": "2013"
    }, {
        "y": 11,
        "label": "2014"
    }, {
        "y": 7,
        "label": "2015"
    }, {
        "y": 8,
        "label": "2016"
    }, {
        "y": 9,
        "label": "2017"
    }]],
    ["Kings XI Punjab", [{
        "y": 10,
        "label": "2008"
    }, {
        "y": 7,
        "label": "2009"
    }, {
        "y": 4,
        "label": "2010"
    }, {
        "y": 7,
        "label": "2011"
    }, {
        "y": 8,
        "label": "2012"
    }, {
        "y": 8,
        "label": "2013"
    }, {
        "y": 12,
        "label": "2014"
    }, {
        "y": 3,
        "label": "2015"
    }, {
        "y": 4,
        "label": "2016"
    }, {
        "y": 7,
        "label": "2017"
    }]],
    ["Royal Challengers Bangalore", [{
        "y": 4,
        "label": "2008"
    }, {
        "y": 9,
        "label": "2009"
    }, {
        "y": 8,
        "label": "2010"
    }, {
        "y": 10,
        "label": "2011"
    }, {
        "y": 8,
        "label": "2012"
    }, {
        "y": 9,
        "label": "2013"
    }, {
        "y": 5,
        "label": "2014"
    }, {
        "y": 8,
        "label": "2015"
    }, {
        "y": 9,
        "label": "2016"
    }, {
        "y": 3,
        "label": "2017"
    }]],
    ["Mumbai Indians", [{
        "y": 7,
        "label": "2008"
    }, {
        "y": 5,
        "label": "2009"
    }, {
        "y": 11,
        "label": "2010"
    }, {
        "y": 10,
        "label": "2011"
    }, {
        "y": 10,
        "label": "2012"
    }, {
        "y": 13,
        "label": "2013"
    }, {
        "y": 7,
        "label": "2014"
    }, {
        "y": 10,
        "label": "2015"
    }, {
        "y": 7,
        "label": "2016"
    }, {
        "y": 12,
        "label": "2017"
    }]],
    ["Delhi Daredevils", [{
        "y": 7,
        "label": "2008"
    }, {
        "y": 10,
        "label": "2009"
    }, {
        "y": 7,
        "label": "2010"
    }, {
        "y": 4,
        "label": "2011"
    }, {
        "y": 11,
        "label": "2012"
    }, {
        "y": 3,
        "label": "2013"
    }, {
        "y": 2,
        "label": "2014"
    }, {
        "y": 5,
        "label": "2015"
    }, {
        "y": 7,
        "label": "2016"
    }, {
        "y": 6,
        "label": "2017"
    }]],
    ["Gujarat Lions", [{
        "y": 9,
        "label": "2016"
    }, {
        "y": 4,
        "label": "2017"
    }]],
    ["Chennai Super Kings", [{
        "y": 9,
        "label": "2008"
    }, {
        "y": 8,
        "label": "2009"
    }, {
        "y": 9,
        "label": "2010"
    }, {
        "y": 11,
        "label": "2011"
    }, {
        "y": 10,
        "label": "2012"
    }, {
        "y": 12,
        "label": "2013"
    }, {
        "y": 10,
        "label": "2014"
    }, {
        "y": 10,
        "label": "2015"
    }]],
    ["Rajasthan Royals", [{
        "y": 13,
        "label": "2008"
    }, {
        "y": 6,
        "label": "2009"
    }, {
        "y": 6,
        "label": "2010"
    }, {
        "y": 6,
        "label": "2011"
    }, {
        "y": 7,
        "label": "2012"
    }, {
        "y": 11,
        "label": "2013"
    }, {
        "y": 7,
        "label": "2014"
    }, {
        "y": 7,
        "label": "2015"
    }]],
    ["Deccan Chargers", [{
        "y": 2,
        "label": "2008"
    }, {
        "y": 9,
        "label": "2009"
    }, {
        "y": 8,
        "label": "2010"
    }, {
        "y": 6,
        "label": "2011"
    }, {
        "y": 4,
        "label": "2012"
    }]],
    ["Pune Warriors", [{
        "y": 4,
        "label": "2011"
    }, {
        "y": 4,
        "label": "2012"
    }, {
        "y": 4,
        "label": "2013"
    }]],
    ["Kochi Tuskers Kerala", [{
        "y": 6,
        "label": "2011"
    }]]
]