[
          {
                    "label": "2008",
                    "y": 58
          },
          {
                    "label": "2009",
                    "y": 57
          },
          {
                    "label": "2010",
                    "y": 60
          },
          {
                    "label": "2011",
                    "y": 73
          },
          {
                    "label": "2012",
                    "y": 74
          },
          {
                    "label": "2013",
                    "y": 76
          },
          {
                    "label": "2014",
                    "y": 60
          },
          {
                    "label": "2015",
                    "y": 59
          },
          {
                    "label": "2016",
                    "y": 60
          },
          {
                    "label": "2017",
                    "y": 59
          }
]