[
          {
                    "label": "Mumbai",
                    "y": 85
          },
          {
                    "label": "Bangalore",
                    "y": 66
          },
          {
                    "label": "Kolkata",
                    "y": 61
          },
          {
                    "label": "Delhi",
                    "y": 60
          },
          {
                    "label": "Hyderabad",
                    "y": 49
          },
          {
                    "label": "Chennai",
                    "y": 48
          },
          {
                    "label": "Chandigarh",
                    "y": 46
          },
          {
                    "label": "Jaipur",
                    "y": 33
          },
          {
                    "label": "Pune",
                    "y": 32
          },
          {
                    "label": "Durban",
                    "y": 15
          }
]