{1: 1, 2: 2, 3: 3, 4: 4, 5: 5, 6: 6, 7: 7, 8: 8, 9: 9, 10: 10}
{1: 2, 2: 4, 3: 6, 4: 8, 5: 10, 6: 12, 7: 14, 8: 16, 9: 18, 10: 20}
{1: 3, 2: 6, 3: 9, 4: 12, 5: 15, 6: 18, 7: 21, 8: 24, 9: 27, 10: 30}
{1: 4, 2: 8, 3: 12, 4: 16, 5: 20, 6: 24, 7: 28, 8: 32, 9: 36, 10: 40}
{1: 5, 2: 10, 3: 15, 4: 20, 5: 25, 6: 30, 7: 35, 8: 40, 9: 45, 10: 50}
{1: 6, 2: 12, 3: 18, 4: 24, 5: 30, 6: 36, 7: 42, 8: 48, 9: 54, 10: 60}
{1: 7, 2: 14, 3: 21, 4: 28, 5: 35, 6: 42, 7: 49, 8: 56, 9: 63, 10: 70}
{1: 8, 2: 16, 3: 24, 4: 32, 5: 40, 6: 48, 7: 56, 8: 64, 9: 72, 10: 80}
{1: 9, 2: 18, 3: 27, 4: 36, 5: 45, 6: 54, 7: 63, 8: 72, 9: 81, 10: 90}
{1: 10, 2: 20, 3: 30, 4: 40, 5: 50, 6: 60, 7: 70, 8: 80, 9: 90, 10: 100}
{1: 11, 2: 22, 3: 33, 4: 44, 5: 55, 6: 66, 7: 77, 8: 88, 9: 99, 10: 110}
{1: 12, 2: 24, 3: 36, 4: 48, 5: 60, 6: 72, 7: 84, 8: 96, 9: 108, 10: 120}
{1: 13, 2: 26, 3: 39, 4: 52, 5: 65, 6: 78, 7: 91, 8: 104, 9: 117, 10: 130}
{1: 14, 2: 28, 3: 42, 4: 56, 5: 70, 6: 84, 7: 98, 8: 112, 9: 126, 10: 140}
{1: 15, 2: 30, 3: 45, 4: 60, 5: 75, 6: 90, 7: 105, 8: 120, 9: 135, 10: 150}
{1: 16, 2: 32, 3: 48, 4: 64, 5: 80, 6: 96, 7: 112, 8: 128, 9: 144, 10: 160}
{1: 17, 2: 34, 3: 51, 4: 68, 5: 85, 6: 102, 7: 119, 8: 136, 9: 153, 10: 170}
{1: 18, 2: 36, 3: 54, 4: 72, 5: 90, 6: 108, 7: 126, 8: 144, 9: 162, 10: 180}
{1: 19, 2: 38, 3: 57, 4: 76, 5: 95, 6: 114, 7: 133, 8: 152, 9: 171, 10: 190}
{1: 20, 2: 40, 3: 60, 4: 80, 5: 100, 6: 120, 7: 140, 8: 160, 9: 180, 10: 200}
{1: 21, 2: 42, 3: 63, 4: 84, 5: 105, 6: 126, 7: 147, 8: 168, 9: 189, 10: 210}
{1: 22, 2: 44, 3: 66, 4: 88, 5: 110, 6: 132, 7: 154, 8: 176, 9: 198, 10: 220}
{1: 23, 2: 46, 3: 69, 4: 92, 5: 115, 6: 138, 7: 161, 8: 184, 9: 207, 10: 230}
{1: 24, 2: 48, 3: 72, 4: 96, 5: 120, 6: 144, 7: 168, 8: 192, 9: 216, 10: 240}
{1: 25, 2: 50, 3: 75, 4: 100, 5: 125, 6: 150, 7: 175, 8: 200, 9: 225, 10: 250}
{1: 26, 2: 52, 3: 78, 4: 104, 5: 130, 6: 156, 7: 182, 8: 208, 9: 234, 10: 260}
{1: 27, 2: 54, 3: 81, 4: 108, 5: 135, 6: 162, 7: 189, 8: 216, 9: 243, 10: 270}
{1: 28, 2: 56, 3: 84, 4: 112, 5: 140, 6: 168, 7: 196, 8: 224, 9: 252, 10: 280}
{1: 29, 2: 58, 3: 87, 4: 116, 5: 145, 6: 174, 7: 203, 8: 232, 9: 261, 10: 290}
{1: 30, 2: 60, 3: 90, 4: 120, 5: 150, 6: 180, 7: 210, 8: 240, 9: 270, 10: 300}
{1: 31, 2: 62, 3: 93, 4: 124, 5: 155, 6: 186, 7: 217, 8: 248, 9: 279, 10: 310}
{1: 32, 2: 64, 3: 96, 4: 128, 5: 160, 6: 192, 7: 224, 8: 256, 9: 288, 10: 320}
{1: 33, 2: 66, 3: 99, 4: 132, 5: 165, 6: 198, 7: 231, 8: 264, 9: 297, 10: 330}
{1: 34, 2: 68, 3: 102, 4: 136, 5: 170, 6: 204, 7: 238, 8: 272, 9: 306, 10: 340}
{1: 35, 2: 70, 3: 105, 4: 140, 5: 175, 6: 210, 7: 245, 8: 280, 9: 315, 10: 350}
{1: 36, 2: 72, 3: 108, 4: 144, 5: 180, 6: 216, 7: 252, 8: 288, 9: 324, 10: 360}
{1: 37, 2: 74, 3: 111, 4: 148, 5: 185, 6: 222, 7: 259, 8: 296, 9: 333, 10: 370}
{1: 38, 2: 76, 3: 114, 4: 152, 5: 190, 6: 228, 7: 266, 8: 304, 9: 342, 10: 380}
{1: 39, 2: 78, 3: 117, 4: 156, 5: 195, 6: 234, 7: 273, 8: 312, 9: 351, 10: 390}
{1: 40, 2: 80, 3: 120, 4: 160, 5: 200, 6: 240, 7: 280, 8: 320, 9: 360, 10: 400}
{1: 41, 2: 82, 3: 123, 4: 164, 5: 205, 6: 246, 7: 287, 8: 328, 9: 369, 10: 410}
{1: 42, 2: 84, 3: 126, 4: 168, 5: 210, 6: 252, 7: 294, 8: 336, 9: 378, 10: 420}
{1: 43, 2: 86, 3: 129, 4: 172, 5: 215, 6: 258, 7: 301, 8: 344, 9: 387, 10: 430}
{1: 44, 2: 88, 3: 132, 4: 176, 5: 220, 6: 264, 7: 308, 8: 352, 9: 396, 10: 440}
{1: 45, 2: 90, 3: 135, 4: 180, 5: 225, 6: 270, 7: 315, 8: 360, 9: 405, 10: 450}
{1: 46, 2: 92, 3: 138, 4: 184, 5: 230, 6: 276, 7: 322, 8: 368, 9: 414, 10: 460}
{1: 47, 2: 94, 3: 141, 4: 188, 5: 235, 6: 282, 7: 329, 8: 376, 9: 423, 10: 470}
{1: 48, 2: 96, 3: 144, 4: 192, 5: 240, 6: 288, 7: 336, 8: 384, 9: 432, 10: 480}
{1: 49, 2: 98, 3: 147, 4: 196, 5: 245, 6: 294, 7: 343, 8: 392, 9: 441, 10: 490}
{1: 50, 2: 100, 3: 150, 4: 200, 5: 250, 6: 300, 7: 350, 8: 400, 9: 450, 10: 500}
{1: 51, 2: 102, 3: 153, 4: 204, 5: 255, 6: 306, 7: 357, 8: 408, 9: 459, 10: 510}
{1: 52, 2: 104, 3: 156, 4: 208, 5: 260, 6: 312, 7: 364, 8: 416, 9: 468, 10: 520}
{1: 53, 2: 106, 3: 159, 4: 212, 5: 265, 6: 318, 7: 371, 8: 424, 9: 477, 10: 530}
{1: 54, 2: 108, 3: 162, 4: 216, 5: 270, 6: 324, 7: 378, 8: 432, 9: 486, 10: 540}
{1: 55, 2: 110, 3: 165, 4: 220, 5: 275, 6: 330, 7: 385, 8: 440, 9: 495, 10: 550}
{1: 56, 2: 112, 3: 168, 4: 224, 5: 280, 6: 336, 7: 392, 8: 448, 9: 504, 10: 560}
{1: 57, 2: 114, 3: 171, 4: 228, 5: 285, 6: 342, 7: 399, 8: 456, 9: 513, 10: 570}
{1: 58, 2: 116, 3: 174, 4: 232, 5: 290, 6: 348, 7: 406, 8: 464, 9: 522, 10: 580}
{1: 59, 2: 118, 3: 177, 4: 236, 5: 295, 6: 354, 7: 413, 8: 472, 9: 531, 10: 590}
{1: 60, 2: 120, 3: 180, 4: 240, 5: 300, 6: 360, 7: 420, 8: 480, 9: 540, 10: 600}
{1: 61, 2: 122, 3: 183, 4: 244, 5: 305, 6: 366, 7: 427, 8: 488, 9: 549, 10: 610}
{1: 62, 2: 124, 3: 186, 4: 248, 5: 310, 6: 372, 7: 434, 8: 496, 9: 558, 10: 620}
{1: 63, 2: 126, 3: 189, 4: 252, 5: 315, 6: 378, 7: 441, 8: 504, 9: 567, 10: 630}
{1: 64, 2: 128, 3: 192, 4: 256, 5: 320, 6: 384, 7: 448, 8: 512, 9: 576, 10: 640}
{1: 65, 2: 130, 3: 195, 4: 260, 5: 325, 6: 390, 7: 455, 8: 520, 9: 585, 10: 650}
{1: 66, 2: 132, 3: 198, 4: 264, 5: 330, 6: 396, 7: 462, 8: 528, 9: 594, 10: 660}
{1: 67, 2: 134, 3: 201, 4: 268, 5: 335, 6: 402, 7: 469, 8: 536, 9: 603, 10: 670}
{1: 68, 2: 136, 3: 204, 4: 272, 5: 340, 6: 408, 7: 476, 8: 544, 9: 612, 10: 680}
{1: 69, 2: 138, 3: 207, 4: 276, 5: 345, 6: 414, 7: 483, 8: 552, 9: 621, 10: 690}
{1: 70, 2: 140, 3: 210, 4: 280, 5: 350, 6: 420, 7: 490, 8: 560, 9: 630, 10: 700}
{1: 71, 2: 142, 3: 213, 4: 284, 5: 355, 6: 426, 7: 497, 8: 568, 9: 639, 10: 710}
{1: 72, 2: 144, 3: 216, 4: 288, 5: 360, 6: 432, 7: 504, 8: 576, 9: 648, 10: 720}
{1: 73, 2: 146, 3: 219, 4: 292, 5: 365, 6: 438, 7: 511, 8: 584, 9: 657, 10: 730}
{1: 74, 2: 148, 3: 222, 4: 296, 5: 370, 6: 444, 7: 518, 8: 592, 9: 666, 10: 740}
{1: 75, 2: 150, 3: 225, 4: 300, 5: 375, 6: 450, 7: 525, 8: 600, 9: 675, 10: 750}
{1: 76, 2: 152, 3: 228, 4: 304, 5: 380, 6: 456, 7: 532, 8: 608, 9: 684, 10: 760}
{1: 77, 2: 154, 3: 231, 4: 308, 5: 385, 6: 462, 7: 539, 8: 616, 9: 693, 10: 770}
{1: 78, 2: 156, 3: 234, 4: 312, 5: 390, 6: 468, 7: 546, 8: 624, 9: 702, 10: 780}
{1: 79, 2: 158, 3: 237, 4: 316, 5: 395, 6: 474, 7: 553, 8: 632, 9: 711, 10: 790}
{1: 80, 2: 160, 3: 240, 4: 320, 5: 400, 6: 480, 7: 560, 8: 640, 9: 720, 10: 800}
{1: 81, 2: 162, 3: 243, 4: 324, 5: 405, 6: 486, 7: 567, 8: 648, 9: 729, 10: 810}
{1: 82, 2: 164, 3: 246, 4: 328, 5: 410, 6: 492, 7: 574, 8: 656, 9: 738, 10: 820}
{1: 83, 2: 166, 3: 249, 4: 332, 5: 415, 6: 498, 7: 581, 8: 664, 9: 747, 10: 830}
{1: 84, 2: 168, 3: 252, 4: 336, 5: 420, 6: 504, 7: 588, 8: 672, 9: 756, 10: 840}
{1: 85, 2: 170, 3: 255, 4: 340, 5: 425, 6: 510, 7: 595, 8: 680, 9: 765, 10: 850}
{1: 86, 2: 172, 3: 258, 4: 344, 5: 430, 6: 516, 7: 602, 8: 688, 9: 774, 10: 860}
{1: 87, 2: 174, 3: 261, 4: 348, 5: 435, 6: 522, 7: 609, 8: 696, 9: 783, 10: 870}
{1: 88, 2: 176, 3: 264, 4: 352, 5: 440, 6: 528, 7: 616, 8: 704, 9: 792, 10: 880}
{1: 89, 2: 178, 3: 267, 4: 356, 5: 445, 6: 534, 7: 623, 8: 712, 9: 801, 10: 890}
{1: 90, 2: 180, 3: 270, 4: 360, 5: 450, 6: 540, 7: 630, 8: 720, 9: 810, 10: 900}
{1: 91, 2: 182, 3: 273, 4: 364, 5: 455, 6: 546, 7: 637, 8: 728, 9: 819, 10: 910}
{1: 92, 2: 184, 3: 276, 4: 368, 5: 460, 6: 552, 7: 644, 8: 736, 9: 828, 10: 920}
{1: 93, 2: 186, 3: 279, 4: 372, 5: 465, 6: 558, 7: 651, 8: 744, 9: 837, 10: 930}
{1: 94, 2: 188, 3: 282, 4: 376, 5: 470, 6: 564, 7: 658, 8: 752, 9: 846, 10: 940}
{1: 95, 2: 190, 3: 285, 4: 380, 5: 475, 6: 570, 7: 665, 8: 760, 9: 855, 10: 950}
{1: 96, 2: 192, 3: 288, 4: 384, 5: 480, 6: 576, 7: 672, 8: 768, 9: 864, 10: 960}
{1: 97, 2: 194, 3: 291, 4: 388, 5: 485, 6: 582, 7: 679, 8: 776, 9: 873, 10: 970}
{1: 98, 2: 196, 3: 294, 4: 392, 5: 490, 6: 588, 7: 686, 8: 784, 9: 882, 10: 980}
{1: 99, 2: 198, 3: 297, 4: 396, 5: 495, 6: 594, 7: 693, 8: 792, 9: 891, 10: 990}
{1: 100, 2: 200, 3: 300, 4: 400, 5: 500, 6: 600, 7: 700, 8: 800, 9: 900, 10: 1000}
