2019-01-20 19:46:20,064 ERROR: Exception on /index [GET] [in /home/bhola/Desktop/flask_projects/mini_books/venv/lib/python3.6/site-packages/flask/app.py:1761]
Traceback (most recent call last):
  File "/home/bhola/Desktop/flask_projects/mini_books/venv/lib/python3.6/site-packages/flask/app.py", line 2292, in wsgi_app
    response = self.full_dispatch_request()
  File "/home/bhola/Desktop/flask_projects/mini_books/venv/lib/python3.6/site-packages/flask/app.py", line 1815, in full_dispatch_request
    rv = self.handle_user_exception(e)
  File "/home/bhola/Desktop/flask_projects/mini_books/venv/lib/python3.6/site-packages/flask/app.py", line 1718, in handle_user_exception
    reraise(exc_type, exc_value, tb)
  File "/home/bhola/Desktop/flask_projects/mini_books/venv/lib/python3.6/site-packages/flask/_compat.py", line 35, in reraise
    raise value
  File "/home/bhola/Desktop/flask_projects/mini_books/venv/lib/python3.6/site-packages/flask/app.py", line 1813, in full_dispatch_request
    rv = self.dispatch_request()
  File "/home/bhola/Desktop/flask_projects/mini_books/venv/lib/python3.6/site-packages/flask/app.py", line 1799, in dispatch_request
    return self.view_functions[rule.endpoint](**req.view_args)
  File "/home/bhola/Desktop/flask_projects/mini_books/venv/lib/python3.6/site-packages/flask_login/utils.py", line 261, in decorated_view
    return func(*args, **kwargs)
  File "/home/bhola/Desktop/flask_projects/mini_books/app/routes.py", line 30, in index
    return render_template("index.html", title='Home Page')
  File "/home/bhola/Desktop/flask_projects/mini_books/venv/lib/python3.6/site-packages/flask/templating.py", line 135, in render_template
    context, ctx.app)
  File "/home/bhola/Desktop/flask_projects/mini_books/venv/lib/python3.6/site-packages/flask/templating.py", line 117, in _render
    rv = template.render(context)
  File "/home/bhola/Desktop/flask_projects/mini_books/venv/lib/python3.6/site-packages/jinja2/asyncsupport.py", line 76, in render
    return original_render(self, *args, **kwargs)
  File "/home/bhola/Desktop/flask_projects/mini_books/venv/lib/python3.6/site-packages/jinja2/environment.py", line 1008, in render
    return self.environment.handle_exception(exc_info, True)
  File "/home/bhola/Desktop/flask_projects/mini_books/venv/lib/python3.6/site-packages/jinja2/environment.py", line 780, in handle_exception
    reraise(exc_type, exc_value, tb)
  File "/home/bhola/Desktop/flask_projects/mini_books/venv/lib/python3.6/site-packages/jinja2/_compat.py", line 37, in reraise
    raise value.with_traceback(tb)
  File "/home/bhola/Desktop/flask_projects/mini_books/app/templates/base.html", line 79, in template
    {% if category = 'message' %}
  File "/home/bhola/Desktop/flask_projects/mini_books/venv/lib/python3.6/site-packages/jinja2/environment.py", line 1005, in render
    return concat(self.root_render_func(self.new_context(vars)))
  File "/home/bhola/Desktop/flask_projects/mini_books/app/templates/index.html", line 1, in top-level template code
    {% extends "base.html" %}
  File "/home/bhola/Desktop/flask_projects/mini_books/venv/lib/python3.6/site-packages/jinja2/environment.py", line 780, in handle_exception
    reraise(exc_type, exc_value, tb)
  File "/home/bhola/Desktop/flask_projects/mini_books/venv/lib/python3.6/site-packages/jinja2/_compat.py", line 37, in reraise
    raise value.with_traceback(tb)
  File "/home/bhola/Desktop/flask_projects/mini_books/app/templates/base.html", line 79, in template
    {% if category = 'message' %}
  File "/home/bhola/Desktop/flask_projects/mini_books/venv/lib/python3.6/site-packages/jinja2/environment.py", line 497, in _parse
    return Parser(self, source, name, encode_filename(filename)).parse()
  File "/home/bhola/Desktop/flask_projects/mini_books/venv/lib/python3.6/site-packages/jinja2/parser.py", line 901, in parse
    result = nodes.Template(self.subparse(), lineno=1)
  File "/home/bhola/Desktop/flask_projects/mini_books/venv/lib/python3.6/site-packages/jinja2/parser.py", line 883, in subparse
    rv = self.parse_statement()
  File "/home/bhola/Desktop/flask_projects/mini_books/venv/lib/python3.6/site-packages/jinja2/parser.py", line 130, in parse_statement
    return getattr(self, 'parse_' + self.stream.current.value)()
  File "/home/bhola/Desktop/flask_projects/mini_books/venv/lib/python3.6/site-packages/jinja2/parser.py", line 243, in parse_with
    drop_needle=True)
  File "/home/bhola/Desktop/flask_projects/mini_books/venv/lib/python3.6/site-packages/jinja2/parser.py", line 165, in parse_statements
    result = self.subparse(end_tokens)
  File "/home/bhola/Desktop/flask_projects/mini_books/venv/lib/python3.6/site-packages/jinja2/parser.py", line 883, in subparse
    rv = self.parse_statement()
  File "/home/bhola/Desktop/flask_projects/mini_books/venv/lib/python3.6/site-packages/jinja2/parser.py", line 130, in parse_statement
    return getattr(self, 'parse_' + self.stream.current.value)()
  File "/home/bhola/Desktop/flask_projects/mini_books/venv/lib/python3.6/site-packages/jinja2/parser.py", line 213, in parse_if
    'name:endif'))
  File "/home/bhola/Desktop/flask_projects/mini_books/venv/lib/python3.6/site-packages/jinja2/parser.py", line 165, in parse_statements
    result = self.subparse(end_tokens)
  File "/home/bhola/Desktop/flask_projects/mini_books/venv/lib/python3.6/site-packages/jinja2/parser.py", line 883, in subparse
    rv = self.parse_statement()
  File "/home/bhola/Desktop/flask_projects/mini_books/venv/lib/python3.6/site-packages/jinja2/parser.py", line 130, in parse_statement
    return getattr(self, 'parse_' + self.stream.current.value)()
  File "/home/bhola/Desktop/flask_projects/mini_books/venv/lib/python3.6/site-packages/jinja2/parser.py", line 199, in parse_for
    body = self.parse_statements(('name:endfor', 'name:else'))
  File "/home/bhola/Desktop/flask_projects/mini_books/venv/lib/python3.6/site-packages/jinja2/parser.py", line 165, in parse_statements
    result = self.subparse(end_tokens)
  File "/home/bhola/Desktop/flask_projects/mini_books/venv/lib/python3.6/site-packages/jinja2/parser.py", line 883, in subparse
    rv = self.parse_statement()
  File "/home/bhola/Desktop/flask_projects/mini_books/venv/lib/python3.6/site-packages/jinja2/parser.py", line 130, in parse_statement
    return getattr(self, 'parse_' + self.stream.current.value)()
  File "/home/bhola/Desktop/flask_projects/mini_books/venv/lib/python3.6/site-packages/jinja2/parser.py", line 213, in parse_if
    'name:endif'))
  File "/home/bhola/Desktop/flask_projects/mini_books/venv/lib/python3.6/site-packages/jinja2/parser.py", line 164, in parse_statements
    self.stream.expect('block_end')
  File "/home/bhola/Desktop/flask_projects/mini_books/venv/lib/python3.6/site-packages/jinja2/lexer.py", line 384, in expect
    self.name, self.filename)
jinja2.exceptions.TemplateSyntaxError: expected token 'end of statement block', got '='
