2019-01-20 19:47:02,962 ERROR: Exception on /register [GET] [in /home/bhola/Desktop/flask_projects/mini_books/venv/lib/python3.6/site-packages/flask/app.py:1761]
Traceback (most recent call last):
  File "/home/bhola/Desktop/flask_projects/mini_books/venv/lib/python3.6/site-packages/flask/app.py", line 1813, in full_dispatch_request
    rv = self.dispatch_request()
  File "/home/bhola/Desktop/flask_projects/mini_books/venv/lib/python3.6/site-packages/flask/app.py", line 1799, in dispatch_request
    return self.view_functions[rule.endpoint](**req.view_args)
  File "/home/bhola/Desktop/flask_projects/mini_books/app/routes.py", line 19, in decorated_view
    abort(403)
  File "/home/bhola/Desktop/flask_projects/mini_books/venv/lib/python3.6/site-packages/werkzeug/exceptions.py", line 707, in abort
    return _aborter(status, *args, **kwargs)
  File "/home/bhola/Desktop/flask_projects/mini_books/venv/lib/python3.6/site-packages/werkzeug/exceptions.py", line 687, in __call__
    raise self.mapping[code](*args, **kwargs)
werkzeug.exceptions.Forbidden: 403 Forbidden: You don't have the permission to access the requested resource. It is either read-protected or not readable by the server.

During handling of the above exception, another exception occurred:

Traceback (most recent call last):
  File "/home/bhola/Desktop/flask_projects/mini_books/venv/lib/python3.6/site-packages/flask/app.py", line 2292, in wsgi_app
    response = self.full_dispatch_request()
  File "/home/bhola/Desktop/flask_projects/mini_books/venv/lib/python3.6/site-packages/flask/app.py", line 1815, in full_dispatch_request
    rv = self.handle_user_exception(e)
  File "/home/bhola/Desktop/flask_projects/mini_books/venv/lib/python3.6/site-packages/flask/app.py", line 1713, in handle_user_exception
    return self.handle_http_exception(e)
  File "/home/bhola/Desktop/flask_projects/mini_books/venv/lib/python3.6/site-packages/flask/app.py", line 1644, in handle_http_exception
    return handler(e)
  File "/home/bhola/Desktop/flask_projects/mini_books/app/errors.py", line 19, in internal_error
    return render_template('errors/403.html'), 403
  File "/home/bhola/Desktop/flask_projects/mini_books/venv/lib/python3.6/site-packages/flask/templating.py", line 135, in render_template
    context, ctx.app)
  File "/home/bhola/Desktop/flask_projects/mini_books/venv/lib/python3.6/site-packages/flask/templating.py", line 117, in _render
    rv = template.render(context)
  File "/home/bhola/Desktop/flask_projects/mini_books/venv/lib/python3.6/site-packages/jinja2/asyncsupport.py", line 76, in render
    return original_render(self, *args, **kwargs)
  File "/home/bhola/Desktop/flask_projects/mini_books/venv/lib/python3.6/site-packages/jinja2/environment.py", line 1008, in render
    return self.environment.handle_exception(exc_info, True)
  File "/home/bhola/Desktop/flask_projects/mini_books/venv/lib/python3.6/site-packages/jinja2/environment.py", line 780, in handle_exception
    reraise(exc_type, exc_value, tb)
  File "/home/bhola/Desktop/flask_projects/mini_books/venv/lib/python3.6/site-packages/jinja2/_compat.py", line 37, in reraise
    raise value.with_traceback(tb)
  File "/home/bhola/Desktop/flask_projects/mini_books/app/templates/base.html", line 79, in template
    {% if category = 'message' %}
  File "/home/bhola/Desktop/flask_projects/mini_books/venv/lib/python3.6/site-packages/jinja2/environment.py", line 1005, in render
    return concat(self.root_render_func(self.new_context(vars)))
  File "/home/bhola/Desktop/flask_projects/mini_books/app/templates/errors/403.html", line 1, in top-level template code
    {% extends "base.html" %}
  File "/home/bhola/Desktop/flask_projects/mini_books/venv/lib/python3.6/site-packages/jinja2/environment.py", line 780, in handle_exception
    reraise(exc_type, exc_value, tb)
  File "/home/bhola/Desktop/flask_projects/mini_books/venv/lib/python3.6/site-packages/jinja2/_compat.py", line 37, in reraise
    raise value.with_traceback(tb)
  File "/home/bhola/Desktop/flask_projects/mini_books/app/templates/base.html", line 79, in template
    {% if category = 'message' %}
  File "/home/bhola/Desktop/flask_projects/mini_books/venv/lib/python3.6/site-packages/jinja2/environment.py", line 497, in _parse
    return Parser(self, source, name, encode_filename(filename)).parse()
  File "/home/bhola/Desktop/flask_projects/mini_books/venv/lib/python3.6/site-packages/jinja2/parser.py", line 901, in parse
    result = nodes.Template(self.subparse(), lineno=1)
  File "/home/bhola/Desktop/flask_projects/mini_books/venv/lib/python3.6/site-packages/jinja2/parser.py", line 883, in subparse
    rv = self.parse_statement()
  File "/home/bhola/Desktop/flask_projects/mini_books/venv/lib/python3.6/site-packages/jinja2/parser.py", line 130, in parse_statement
    return getattr(self, 'parse_' + self.stream.current.value)()
  File "/home/bhola/Desktop/flask_projects/mini_books/venv/lib/python3.6/site-packages/jinja2/parser.py", line 243, in parse_with
    drop_needle=True)
  File "/home/bhola/Desktop/flask_projects/mini_books/venv/lib/python3.6/site-packages/jinja2/parser.py", line 165, in parse_statements
    result = self.subparse(end_tokens)
  File "/home/bhola/Desktop/flask_projects/mini_books/venv/lib/python3.6/site-packages/jinja2/parser.py", line 883, in subparse
    rv = self.parse_statement()
  File "/home/bhola/Desktop/flask_projects/mini_books/venv/lib/python3.6/site-packages/jinja2/parser.py", line 130, in parse_statement
    return getattr(self, 'parse_' + self.stream.current.value)()
  File "/home/bhola/Desktop/flask_projects/mini_books/venv/lib/python3.6/site-packages/jinja2/parser.py", line 213, in parse_if
    'name:endif'))
  File "/home/bhola/Desktop/flask_projects/mini_books/venv/lib/python3.6/site-packages/jinja2/parser.py", line 165, in parse_statements
    result = self.subparse(end_tokens)
  File "/home/bhola/Desktop/flask_projects/mini_books/venv/lib/python3.6/site-packages/jinja2/parser.py", line 883, in subparse
    rv = self.parse_statement()
  File "/home/bhola/Desktop/flask_projects/mini_books/venv/lib/python3.6/site-packages/jinja2/parser.py", line 130, in parse_statement
    return getattr(self, 'parse_' + self.stream.current.value)()
  File "/home/bhola/Desktop/flask_projects/mini_books/venv/lib/python3.6/site-packages/jinja2/parser.py", line 199, in parse_for
    body = self.parse_statements(('name:endfor', 'name:else'))
  File "/home/bhola/Desktop/flask_projects/mini_books/venv/lib/python3.6/site-packages/jinja2/parser.py", line 165, in parse_statements
    result = self.subparse(end_tokens)
  File "/home/bhola/Desktop/flask_projects/mini_books/venv/lib/python3.6/site-packages/jinja2/parser.py", line 883, in subparse
    rv = self.parse_statement()
  File "/home/bhola/Desktop/flask_projects/mini_books/venv/lib/python3.6/site-packages/jinja2/parser.py", line 130, in parse_statement
    return getattr(self, 'parse_' + self.stream.current.value)()
  File "/home/bhola/Desktop/flask_projects/mini_books/venv/lib/python3.6/site-packages/jinja2/parser.py", line 213, in parse_if
    'name:endif'))
  File "/home/bhola/Desktop/flask_projects/mini_books/venv/lib/python3.6/site-packages/jinja2/parser.py", line 164, in parse_statements
    self.stream.expect('block_end')
  File "/home/bhola/Desktop/flask_projects/mini_books/venv/lib/python3.6/site-packages/jinja2/lexer.py", line 384, in expect
    self.name, self.filename)
jinja2.exceptions.TemplateSyntaxError: expected token 'end of statement block', got '='
2019-01-23 17:24:42,491 INFO: Mini Books startup [in /home/bhola/Desktop/flask_projects/mini_books/app/__init__.py:56]
2019-01-23 17:24:49,976 INFO: Mini Books startup [in /home/bhola/Desktop/flask_projects/mini_books/app/__init__.py:56]
2019-01-23 17:25:25,578 INFO: Mini Books startup [in /home/bhola/Desktop/flask_projects/mini_books/app/__init__.py:56]
2019-01-23 17:27:45,025 INFO: Mini Books startup [in /home/bhola/Desktop/flask_projects/mini_books/app/__init__.py:56]
2019-01-23 18:14:01,591 INFO: Mini Books startup [in /home/bhola/Desktop/flask_projects/mini_books/app/__init__.py:56]
2019-01-23 21:13:44,762 INFO: Mini Books startup [in /home/bhola/Desktop/flask_projects/mini_books/app/__init__.py:56]
2019-01-23 21:31:57,652 INFO: Mini Books startup [in /home/bhola/Desktop/flask_projects/mini_books/app/__init__.py:56]
2019-01-23 21:38:21,677 INFO: Mini Books startup [in /home/bhola/Desktop/flask_projects/mini_books/app/__init__.py:56]
2019-01-23 22:13:23,131 INFO: Mini Books startup [in /home/bhola/Desktop/flask_projects/mini_books/app/__init__.py:56]
2019-01-23 22:22:41,465 INFO: Mini Books startup [in /home/bhola/Desktop/flask_projects/mini_books/app/__init__.py:56]
2019-01-23 23:06:52,145 INFO: Mini Books startup [in /home/bhola/Desktop/flask_projects/mini_books/app/__init__.py:47]
2019-01-23 23:06:59,610 INFO: Mini Books startup [in /home/bhola/Desktop/flask_projects/mini_books/app/__init__.py:47]
2019-01-23 23:59:55,562 INFO: Mini Books startup [in /home/bhola/Desktop/flask_projects/mini_books/app/__init__.py:52]
2019-01-24 00:00:25,080 INFO: Mini Books startup [in /home/bhola/Desktop/flask_projects/mini_books/app/__init__.py:52]
2019-01-24 00:03:14,821 INFO: Mini Books startup [in /home/bhola/Desktop/flask_projects/mini_books/app/__init__.py:52]
2019-01-24 00:03:56,049 INFO: Mini Books startup [in /home/bhola/Desktop/flask_projects/mini_books/app/__init__.py:52]
2019-01-24 00:08:15,067 INFO: Mini Books startup [in /home/bhola/Desktop/flask_projects/mini_books/app/__init__.py:52]
2019-01-24 10:52:46,942 INFO: Mini Books startup [in /home/bhola/Desktop/flask_projects/mini_books/app/__init__.py:50]
2019-01-24 10:53:09,421 INFO: Mini Books startup [in /home/bhola/Desktop/flask_projects/mini_books/app/__init__.py:50]
2019-01-24 11:08:20,828 INFO: Mini Books startup [in /home/bhola/Desktop/flask_projects/mini_books/app/__init__.py:50]
2019-01-24 23:30:08,152 INFO: Mini Books startup [in /home/bhola/Desktop/flask_projects/mini_books/app/__init__.py:52]
2019-01-24 23:34:51,825 INFO: Mini Books startup [in ./app/__init__.py:52]
2019-01-24 23:59:07,318 INFO: Mini Books startup [in /home/bhola/Desktop/flask_projects/mini_books/app/__init__.py:52]
