[
  {
    "version": "39",
    "arch": "x86_64",
    "link": "https://download.fedoraproject.org/pub/fedora/linux/releases/39/Cloud/x86_64/images/Fedora-Cloud-Base-Azure-39-1.5.x86_64.vhd",
    "variant": "Cloud",
    "subvariant": "Cloud_Base",
    "sha256": "654a02149f5233c781b0da1d661752b9f6773fa30b444834bc98f1bba0a54049",
    "size": "1168411648"
  },
  {
    "version": "39",
    "arch": "x86_64",
    "link": "https://download.fedoraproject.org/pub/fedora/linux/releases/39/Cloud/x86_64/images/Fedora-Cloud-Base-39-1.5.x86_64.qcow2",
    "variant": "Cloud",
    "subvariant": "Cloud_Base",
    "sha256": "ab5be5058c5c839528a7d6373934e0ce5ad6c8f80bd71ed3390032027da52f37",
    "size": "544604160"
  },
  {
    "version": "39",
    "arch": "x86_64",
    "link": "https://download.fedoraproject.org/pub/fedora/linux/releases/39/Cloud/x86_64/images/Fedora-Cloud-Base-39-1.5.x86_64.raw.xz",
    "variant": "Cloud",
    "subvariant": "Cloud_Base",
    "sha256": "f2f7c08a1c5c07aa85a80024757ea560a985b231e6e3702b392c6ccb4f191ed3",
    "size": "446022784"
  },
  {
    "version": "39",
    "arch": "x86_64",
    "link": "https://download.fedoraproject.org/pub/fedora/linux/releases/39/Cloud/x86_64/images/Fedora-Cloud-Base-Vagrant-39-1.5.x86_64.vagrant-libvirt.box",
    "variant": "Cloud",
    "subvariant": "Cloud_Base",
    "sha256": "d8883192077049ad32f50c7b3414fc199cb7071aa60d736ba194f43f4be5836a",
    "size": "536397319"
  },
  {
    "version": "39",
    "arch": "x86_64",
    "link": "https://download.fedoraproject.org/pub/fedora/linux/releases/39/Cloud/x86_64/images/Fedora-Cloud-Base-GCP-39-1.5.x86_64.tar.gz",
    "variant": "Cloud",
    "subvariant": "Cloud_Base",
    "sha256": "bbff3d3521fbee73a49e6725e2a56a875d86486e14ed9cf9efa092d355f1a046",
    "size": "595050827"
  },
  {
    "version": "39",
    "arch": "x86_64",
    "link": "https://download.fedoraproject.org/pub/fedora/linux/releases/39/Cloud/x86_64/images/Fedora-Cloud-Base-Vagrant-39-1.5.x86_64.vagrant-virtualbox.box",
    "variant": "Cloud",
    "subvariant": "Cloud_Base",
    "sha256": "cec563ae641aed6e1121af65f09110773b3433b10cdc4fb91006f86d0a134c62",
    "size": "548526080"
  },
  {
    "version": "39",
    "arch": "aarch64",
    "link": "https://download.fedoraproject.org/pub/fedora/linux/releases/39/Cloud/aarch64/images/Fedora-Cloud-Base-Azure-39-1.5.aarch64.vhd",
    "variant": "Cloud",
    "subvariant": "Cloud_Base",
    "sha256": "8b197a4ba38db7fe822a40cb387c2e73bb9a7675a769f12993ba8de676f0d496",
    "size": "1241829888"
  },
  {
    "version": "39",
    "arch": "aarch64",
    "link": "https://download.fedoraproject.org/pub/fedora/linux/releases/39/Cloud/aarch64/images/Fedora-Cloud-Base-39-1.5.aarch64.qcow2",
    "variant": "Cloud",
    "subvariant": "Cloud_Base",
    "sha256": "765996d5b77481ca02d0ac06405641bf134ac920cfc1e60d981c64d7971162dc",
    "size": "560529408"
  },
  {
    "version": "39",
    "arch": "aarch64",
    "link": "https://download.fedoraproject.org/pub/fedora/linux/releases/39/Cloud/aarch64/images/Fedora-Cloud-Base-39-1.5.aarch64.raw.xz",
    "variant": "Cloud",
    "subvariant": "Cloud_Base",
    "sha256": "2a8c7ccbd0aacd1e46df3998ae62a5d389b0ce9201615355a56bb781ef83b8c0",
    "size": "447604272"
  },
  {
    "version": "39",
    "arch": "x86_64",
    "link": "https://download.fedoraproject.org/pub/fedora/linux/releases/39/Container/x86_64/images/Fedora-Container-Base-39-1.5.x86_64.tar.xz",
    "variant": "Container",
    "subvariant": "Container_Base",
    "sha256": "ee8db95c57aebc759b4ce01437f3bcc6c25899139603e70f000a525c0da426a4",
    "size": "42835408"
  },
  {
    "version": "39",
    "arch": "x86_64",
    "link": "https://download.fedoraproject.org/pub/fedora/linux/releases/39/Container/x86_64/images/Fedora-Container-Minimal-Base-39-1.5.x86_64.tar.xz",
    "variant": "Container",
    "subvariant": "Container_Minimal_Base",
    "sha256": "b8cb5b18b823077885d30cecd83a187b970d885fa19968cc6aba484434a646cb",
    "size": "26058780"
  },
  {
    "version": "39",
    "arch": "x86_64",
    "link": "https://download.fedoraproject.org/pub/fedora/linux/releases/39/Container/x86_64/images/Fedora-Container-Toolbox-39-1.5.x86_64.tar.xz",
    "variant": "Container",
    "subvariant": "Container_Toolbox",
    "sha256": "529c0c56c19ded95d31bcbcabe3d0e3c5b85d4ecf27c3bc830e3f8c6217de777",
    "size": "195221508"
  },
  {
    "version": "39",
    "arch": "aarch64",
    "link": "https://download.fedoraproject.org/pub/fedora/linux/releases/39/Container/aarch64/images/Fedora-Container-Base-39-1.5.aarch64.tar.xz",
    "variant": "Container",
    "subvariant": "Container_Base",
    "sha256": "5398f70af507f05735a465585fa22ccb4f1adc9ac7b05d224b563046b231c384",
    "size": "40430620"
  },
  {
    "version": "39",
    "arch": "aarch64",
    "link": "https://download.fedoraproject.org/pub/fedora/linux/releases/39/Container/aarch64/images/Fedora-Container-Minimal-Base-39-1.5.aarch64.tar.xz",
    "variant": "Container",
    "subvariant": "Container_Minimal_Base",
    "sha256": "ec245b500a3e09aca3a7a91083d35382bf76810b9b83ba1a6d5a035dc911820c",
    "size": "24248564"
  },
  {
    "version": "39",
    "arch": "aarch64",
    "link": "https://download.fedoraproject.org/pub/fedora/linux/releases/39/Container/aarch64/images/Fedora-Container-Toolbox-39-1.5.aarch64.tar.xz",
    "variant": "Container",
    "subvariant": "Container_Toolbox",
    "sha256": "efffc12235658c87158718cf4ae9f6ad2d748cfa9d894fcd5a1878269758003f",
    "size": "170854576"
  },
  {
    "version": "39",
    "arch": "x86_64",
    "link": "https://download.fedoraproject.org/pub/fedora/linux/releases/39/Everything/x86_64/iso/Fedora-Everything-netinst-x86_64-39-1.5.iso",
    "variant": "Everything",
    "subvariant": "Everything",
    "sha256": "66f17788811d978badc598b106b7f791f4ebaf530ef25918e2e40277810a6b66",
    "size": "719116288"
  },
  {
    "version": "39",
    "arch": "aarch64",
    "link": "https://download.fedoraproject.org/pub/fedora/linux/releases/39/Everything/aarch64/iso/Fedora-Everything-netinst-aarch64-39-1.5.iso",
    "variant": "Everything",
    "subvariant": "Everything",
    "sha256": "2fc109e565d6f9bfa69bbd8d9ba3113cd1e1879531916a1a4ad06ede1c79ab5c",
    "size": "740116480"
  },
  {
    "version": "39",
    "arch": "x86_64",
    "link": "https://download.fedoraproject.org/pub/fedora/linux/releases/39/Kinoite/x86_64/iso/Fedora-Kinoite-ostree-x86_64-39-1.5.iso",
    "variant": "Kinoite",
    "subvariant": "Kinoite",
    "sha256": "6780230b87587d73ba13017ba1abed466f53d266edf7f570cf9d8a8503f27d0a",
    "size": "2800498688"
  },
  {
    "version": "39",
    "arch": "aarch64",
    "link": "https://download.fedoraproject.org/pub/fedora/linux/releases/39/Kinoite/aarch64/iso/Fedora-Kinoite-ostree-aarch64-39-1.5.iso",
    "variant": "Kinoite",
    "subvariant": "Kinoite",
    "sha256": "528ca0bb12c52da6508b15f134b20599516c2aa5f3e19b4d808d0ecb915f2cec",
    "size": "2794356736"
  },
  {
    "version": "39",
    "arch": "x86_64",
    "link": "https://download.fedoraproject.org/pub/fedora/linux/releases/39/Server/x86_64/images/Fedora-Server-KVM-39-1.5.x86_64.qcow2",
    "variant": "Server",
    "subvariant": "Server_KVM",
    "sha256": "e6e3e1586bb9bca6a54ca12fd8f4c2cc5fbf6dfe0bbfd9274bee7de44ac5b91d",
    "size": "601292800"
  },
  {
    "version": "39",
    "arch": "x86_64",
    "link": "https://download.fedoraproject.org/pub/fedora/linux/releases/39/Server/x86_64/iso/Fedora-Server-dvd-x86_64-39-1.5.iso",
    "variant": "Server",
    "subvariant": "Server",
    "sha256": "2755cdff6ac6365c75be60334bf1935ade838fc18de53d4c640a13d3e904f6e9",
    "size": "2539585536"
  },
  {
    "version": "39",
    "arch": "x86_64",
    "link": "https://download.fedoraproject.org/pub/fedora/linux/releases/39/Server/x86_64/iso/Fedora-Server-netinst-x86_64-39-1.5.iso",
    "variant": "Server",
    "subvariant": "Server",
    "sha256": "61576ae7170e35210f03aae3102048f0a9e0df7868ac726908669b4ef9cc22e9",
    "size": "719169536"
  },
  {
    "version": "39",
    "arch": "aarch64",
    "link": "https://download.fedoraproject.org/pub/fedora/linux/releases/39/Server/aarch64/images/Fedora-Server-39-1.5.aarch64.raw.xz",
    "variant": "Server",
    "subvariant": "Server",
    "sha256": "b202d562eaddd22c7770af2751ec319f693cb8b2c51db60f00e0e686979bbe47",
    "size": "920173844"
  },
  {
    "version": "39",
    "arch": "aarch64",
    "link": "https://download.fedoraproject.org/pub/fedora/linux/releases/39/Server/aarch64/images/Fedora-Server-KVM-39-1.5.aarch64.qcow2",
    "variant": "Server",
    "subvariant": "Server_KVM",
    "sha256": "8ddd5e73c262cbf400a09aea78ce5ee31b41f1ba63bab7ce821c4b6e62ac750b",
    "size": "614268928"
  },
  {
    "version": "39",
    "arch": "aarch64",
    "link": "https://download.fedoraproject.org/pub/fedora/linux/releases/39/Server/aarch64/iso/Fedora-Server-dvd-aarch64-39-1.5.iso",
    "variant": "Server",
    "subvariant": "Server",
    "sha256": "d19dc2a39758155fa53e6fd555d0d173ccc8175b55dea48002d499f39cb30ce0",
    "size": "2417688576"
  },
  {
    "version": "39",
    "arch": "aarch64",
    "link": "https://download.fedoraproject.org/pub/fedora/linux/releases/39/Server/aarch64/iso/Fedora-Server-netinst-aarch64-39-1.5.iso",
    "variant": "Server",
    "subvariant": "Server",
    "sha256": "4321934397c7a296b93bd30ca1ca045af34d491f204bdaedad6cc153670a36aa",
    "size": "740173824"
  },
  {
    "version": "39",
    "arch": "x86_64",
    "link": "https://download.fedoraproject.org/pub/fedora/linux/releases/39/Silverblue/x86_64/iso/Fedora-Silverblue-ostree-x86_64-39-1.5.iso",
    "variant": "Silverblue",
    "subvariant": "Silverblue",
    "sha256": "1aa425890171f206eee270c2fca9ba003790e65994d5e3a9dab1dd90f5e4cdf7",
    "size": "3315015680"
  },
  {
    "version": "39",
    "arch": "x86_64",
    "link": "https://download.fedoraproject.org/pub/fedora/linux/releases/39/Spins/x86_64/iso/Fedora-MATE_Compiz-Live-x86_64-39-1.5.iso",
    "variant": "Spins",
    "subvariant": "Mate",
    "sha256": "b1e1aa855d6522918c268730b0b30dcfe00831f4481b7b68e634394104ae10ff",
    "size": "2274158592"
  },
  {
    "version": "39",
    "arch": "x86_64",
    "link": "https://download.fedoraproject.org/pub/fedora/linux/releases/39/Spins/x86_64/iso/Fedora-Budgie-Live-x86_64-39-1.5.iso",
    "variant": "Spins",
    "subvariant": "Budgie",
    "sha256": "cd1256afe69b89c4d91ca721a1303948dc68727d7003cb4f6dd36f8632b042b0",
    "size": "2000158720"
  },
  {
    "version": "39",
    "arch": "x86_64",
    "link": "https://download.fedoraproject.org/pub/fedora/linux/releases/39/Spins/x86_64/iso/Fedora-Cinnamon-Live-x86_64-39-1.5.iso",
    "variant": "Spins",
    "subvariant": "Cinnamon",
    "sha256": "a3e4cc90fe5ecacab16e01780cb824169cfe868d4e43b92a91270d17ea2556bc",
    "size": "2374133760"
  },
  {
    "version": "39",
    "arch": "x86_64",
    "link": "https://download.fedoraproject.org/pub/fedora/linux/releases/39/Spins/x86_64/iso/Fedora-KDE-Live-x86_64-39-1.5.iso",
    "variant": "Spins",
    "subvariant": "KDE",
    "sha256": "c338d6e05a2ddcee9f7d198916538a7a170c4b958691ac09b304f1169b7579d5",
    "size": "2481055744"
  },
  {
    "version": "39",
    "arch": "x86_64",
    "link": "https://download.fedoraproject.org/pub/fedora/linux/releases/39/Spins/x86_64/iso/Fedora-LXDE-Live-x86_64-39-1.5.iso",
    "variant": "Spins",
    "subvariant": "LXDE",
    "sha256": "fcdae7f8974d0e52e54aae5dddf8871614f43467e2b04e9e9a6683685a278c5a",
    "size": "1533687808"
  },
  {
    "version": "39",
    "arch": "x86_64",
    "link": "https://download.fedoraproject.org/pub/fedora/linux/releases/39/Spins/x86_64/iso/Fedora-LXQt-Live-x86_64-39-1.5.iso",
    "variant": "Spins",
    "subvariant": "LXQt",
    "sha256": "d9ef295145374f7e470801850a8f8d262dd589c6234c6e8587edae740f75d6ea",
    "size": "1562949632"
  },
  {
    "version": "39",
    "arch": "x86_64",
    "link": "https://download.fedoraproject.org/pub/fedora/linux/releases/39/Spins/x86_64/iso/Fedora-SoaS-Live-x86_64-39-1.5.iso",
    "variant": "Spins",
    "subvariant": "SoaS",
    "sha256": "1075421a11612ce7be7fd959faaaa032ba7b3d25c338b85437d82bbe6ccbb250",
    "size": "1293985792"
  },
  {
    "version": "39",
    "arch": "x86_64",
    "link": "https://download.fedoraproject.org/pub/fedora/linux/releases/39/Spins/x86_64/iso/Fedora-Sway-Live-x86_64-39-1.5.iso",
    "variant": "Spins",
    "subvariant": "Sway",
    "sha256": "a40e8d0a62f8ef3e71903640368ca1618d6687bca646529cbff0007f2c4b0ee4",
    "size": "1489426432"
  },
  {
    "version": "39",
    "arch": "x86_64",
    "link": "https://download.fedoraproject.org/pub/fedora/linux/releases/39/Spins/x86_64/iso/Fedora-Xfce-Live-x86_64-39-1.5.iso",
    "variant": "Spins",
    "subvariant": "Xfce",
    "sha256": "ba2c66dba39ef9686b994e3e58e88bf41e3afc3dc9abf6c51ac42bd486cb8b4e",
    "size": "1712130048"
  },
  {
    "version": "39",
    "arch": "x86_64",
    "link": "https://download.fedoraproject.org/pub/fedora/linux/releases/39/Spins/x86_64/iso/Fedora-i3-Live-x86_64-39-1.5.iso",
    "variant": "Spins",
    "subvariant": "i3",
    "sha256": "dd51b5a5459e090f9e0f20d0fbe17892ad5e3f0bb48edae512db6a81a52728de",
    "size": "1507883008"
  },
  {
    "version": "39",
    "arch": "x86_64",
    "link": "https://download.fedoraproject.org/pub/fedora/linux/releases/39/Workstation/x86_64/iso/Fedora-Workstation-Live-x86_64-39-1.5.iso",
    "variant": "Workstation",
    "subvariant": "Workstation",
    "sha256": "af52046e43c6f06afd3456d2a9a36dd9782fcb204f05a21b1c31f593db36a8e8",
    "size": "2129752064"
  },
  {
    "version": "39",
    "arch": "aarch64",
    "link": "https://download.fedoraproject.org/pub/fedora/linux/releases/39/Workstation/aarch64/images/Fedora-Workstation-39-1.5.aarch64.raw.xz",
    "variant": "Workstation",
    "subvariant": "Workstation",
    "sha256": "053021e99471c4f69fe5e7e68d4e1c224dbd319f646049135eb7206a44668ca6",
    "size": "4216233468"
  },
  {
    "version": "39",
    "arch": "aarch64",
    "link": "https://download.fedoraproject.org/pub/alt/releases/39/respins/Spins/aarch64/Fedora-KDE-Live-aarch64-39-1.5-respin.iso",
    "variant": "Fedora",
    "subvariant": "KDE"
  },
  {
    "version": "39",
    "arch": "aarch64",
    "link": "https://download.fedoraproject.org/pub/alt/releases/39/respins/Spins/aarch64/Fedora-LXQt-Live-aarch64-39-1.5-respin.iso",
    "variant": "Fedora",
    "subvariant": "LXQt"
  },
  {
    "version": "39",
    "arch": "aarch64",
    "link": "https://download.fedoraproject.org/pub/alt/releases/39/respins/Spins/aarch64/Fedora-Workstation-Live-aarch64-39-1.5-respin.iso",
    "variant": "Fedora",
    "subvariant": "Workstation"
  },
  {
    "version": "39",
    "arch": "aarch64",
    "link": "https://download.fedoraproject.org/pub/alt/releases/39/respins/Silverblue/aarch64/Fedora-Silverblue-ostree-aarch64-39-1.5-respin.iso",
    "variant": "Fedora",
    "subvariant": "Silverblue"
  },
  {
    "version": "39",
    "arch": "x86_64",
    "link": "https://download.fedoraproject.org/pub/alt/releases/39/respins/Labs/x86_64/Fedora-Security-Live-x86_64-39-1.5-respin.iso",
    "variant": "Fedora",
    "subvariant": "Security"
  },
  {
    "version": "39",
    "arch": "x86_64",
    "link": "https://download.fedoraproject.org/pub/alt/releases/39/respins/Onyx/x86_64/Fedora-Onyx-ostree-x86_64-39-1.5-respin.iso",
    "variant": "Fedora",
    "subvariant": "Onyx"
  },
  {
    "version": "39",
    "arch": "x86_64",
    "link": "https://download.fedoraproject.org/pub/alt/releases/39/respins/Sericea/x86_64/Fedora-Sericea-ostree-x86_64-39-1.5-respin2.iso",
    "variant": "Fedora",
    "subvariant": "Sericea"
  },
  {
    "version": "39",
    "arch": "ppc64",
    "link": "https://download.fedoraproject.org/pub/alt/releases/39/respins/Kinoite/ppc64le/Fedora-Kinoite-ostree-ppc64le-39-1.5-respin.iso",
    "variant": "Fedora",
    "subvariant": "Kinoite"
  },
  {
    "version": "39",
    "arch": "x86_64",
    "link": "https://download.fedoraproject.org/pub/alt/releases/39/Labs/x86_64/images/Fedora-Python-Classroom-Vagrant-39-1.5.x86_64.vagrant-libvirt.box",
    "variant": "Labs",
    "subvariant": "Python_Classroom",
    "sha256": "58e0a3f08e7770197a6bdf4497f3f196e311ad70d36be8b583117f80308a327e",
    "size": "1338415686"
  },
  {
    "version": "39",
    "arch": "x86_64",
    "link": "https://download.fedoraproject.org/pub/alt/releases/39/Labs/x86_64/images/Fedora-Python-Classroom-Vagrant-39-1.5.x86_64.vagrant-virtualbox.box",
    "variant": "Labs",
    "subvariant": "Python_Classroom",
    "sha256": "aef25560c62be0ac8d5be1f5b440a294495ab251f344ad9cccc948fe79dc2870",
    "size": "1357854720"
  },
  {
    "version": "39",
    "arch": "x86_64",
    "link": "https://download.fedoraproject.org/pub/alt/releases/39/Labs/x86_64/images/Fedora-Scientific-Vagrant-39-1.5.x86_64.vagrant-libvirt.box",
    "variant": "Labs",
    "subvariant": "Scientific",
    "sha256": "86ac09f090420afa04aa1c805472f8ddf16761d7fbf0b336347f165bf603f375",
    "size": "4447800910"
  },
  {
    "version": "39",
    "arch": "x86_64",
    "link": "https://download.fedoraproject.org/pub/alt/releases/39/Labs/x86_64/images/Fedora-Scientific-Vagrant-39-1.5.x86_64.vagrant-virtualbox.box",
    "variant": "Labs",
    "subvariant": "Scientific",
    "sha256": "8d85acf61ca9ebe0f6696ebf5e44e9ac025984823b127af147ab18ee1066eed9",
    "size": "4499927040"
  },
  {
    "version": "39",
    "arch": "x86_64",
    "link": "https://download.fedoraproject.org/pub/alt/releases/39/Labs/x86_64/iso/Fedora-Design_suite-Live-x86_64-39-1.5.iso",
    "variant": "Labs",
    "subvariant": "Design_suite",
    "sha256": "900d7fb94db51692bdbbd52b4953ed89e5f704350cabb878089e0e9c6fc21f52",
    "size": "3940501504"
  },
  {
    "version": "39",
    "arch": "x86_64",
    "link": "https://download.fedoraproject.org/pub/alt/releases/39/Labs/x86_64/iso/Fedora-Comp_Neuro-Live-x86_64-39-1.5.iso",
    "variant": "Labs",
    "subvariant": "Comp_Neuro",
    "sha256": "b04363e5e5c9d2f001cd44c0e4c61a504ae8a27027c637107494c0cb63cba1b9",
    "size": "2830913536"
  },
  {
    "version": "39",
    "arch": "x86_64",
    "link": "https://download.fedoraproject.org/pub/alt/releases/39/Labs/x86_64/iso/Fedora-Python-Classroom-Live-x86_64-39-1.5.iso",
    "variant": "Labs",
    "subvariant": "Python_Classroom",
    "sha256": "20b660ac93516c2b82a8f7105151df12c363fd18b358a7cd6a5baaa8d05b8796",
    "size": "2115170304"
  },
  {
    "version": "39",
    "arch": "x86_64",
    "link": "https://download.fedoraproject.org/pub/alt/releases/39/Labs/x86_64/iso/Fedora-Games-Live-x86_64-39-1.5.iso",
    "variant": "Labs",
    "subvariant": "Games",
    "sha256": "c3fa0be5fcc3ca51c6caf9421ce47daaa94334b42300771f951a844b4ce2f657",
    "size": "6583197696"
  },
  {
    "version": "39",
    "arch": "x86_64",
    "link": "https://download.fedoraproject.org/pub/alt/releases/39/Labs/x86_64/iso/Fedora-Jam_KDE-Live-x86_64-39-1.5.iso",
    "variant": "Labs",
    "subvariant": "Jam_KDE",
    "sha256": "2270d04871aded4e692253aec699bc92a962657742f4e4032e20a63db10e06ff",
    "size": "3155283968"
  },
  {
    "version": "39",
    "arch": "x86_64",
    "link": "https://download.fedoraproject.org/pub/alt/releases/39/Labs/x86_64/iso/Fedora-Scientific_KDE-Live-x86_64-39-1.5.iso",
    "variant": "Labs",
    "subvariant": "Scientific_KDE",
    "sha256": "b69b4ec17e3243428375205986df09a6cedcbecf134dcb73e99a51c971a90223",
    "size": "5019277312"
  },
  {
    "version": "39",
    "arch": "x86_64",
    "link": "https://download.fedoraproject.org/pub/alt/releases/39/Labs/x86_64/iso/Fedora-Robotics-Live-x86_64-39-1.5.iso",
    "variant": "Labs",
    "subvariant": "Robotics",
    "sha256": "126ef48d891c9f862b5494864bcfe7eae57a84d138e5a4bb8d9192b92b2f0376",
    "size": "3270440960"
  },
  {
    "version": "39",
    "arch": "aarch64",
    "link": "https://download.fedoraproject.org/pub/alt/iot/39/IoT/aarch64/images/Fedora-IoT-39.20231103.1-20231103.1.aarch64.raw.xz",
    "variant": "IoT",
    "subvariant": "IoT",
    "sha256": "bb10ed4469f6ac1448162503b68f84e96f8e8410e5c8c9a4a56b5406bf13dff2",
    "size": "712162312"
  },
  {
    "version": "39",
    "arch": "aarch64",
    "link": "https://download.fedoraproject.org/pub/alt/iot/39/IoT/aarch64/iso/Fedora-IoT-ostree-39.20231103.1-20231103.1.aarch64.iso",
    "variant": "IoT",
    "subvariant": "IoT",
    "sha256": "f782fe6271b6dda1b03c2db338565959e99b41adf8acca64bfd8e7197717fd32",
    "size": "2372724736"
  },
  {
    "version": "39",
    "arch": "aarch64",
    "link": "https://download.fedoraproject.org/pub/alt/iot/39/IoT/aarch64/iso/Fedora-IoT-ostree-aarch64-39-20231103.1.iso",
    "variant": "IoT",
    "subvariant": "IoT",
    "sha256": "3e9512d3045ca7424cd13710981a785088f2d113c55bbee63a62cf0d873560b1",
    "size": "1356548096"
  },
  {
    "version": "39",
    "arch": "x86_64",
    "link": "https://download.fedoraproject.org/pub/alt/iot/39/IoT/x86_64/images/Fedora-IoT-39.20231103.1-20231103.1.x86_64.raw.xz",
    "variant": "IoT",
    "subvariant": "IoT",
    "sha256": "10a5ea51e068ac742df86c57808ae577c61c14318b01515d0edf6b503aa02347",
    "size": "682940448"
  },
  {
    "version": "39",
    "arch": "x86_64",
    "link": "https://download.fedoraproject.org/pub/alt/iot/39/IoT/x86_64/iso/Fedora-IoT-ostree-39.20231103.1-20231103.1.x86_64.iso",
    "variant": "IoT",
    "subvariant": "IoT",
    "sha256": "688aedd333fbd277e4455fed51d252a4d2b3d0b50d539a9045a3082ae4f05d52",
    "size": "2377711616"
  },
  {
    "version": "39",
    "arch": "x86_64",
    "link": "https://download.fedoraproject.org/pub/alt/iot/39/IoT/x86_64/iso/Fedora-IoT-ostree-x86_64-39-20231103.1.iso",
    "variant": "IoT",
    "subvariant": "IoT",
    "sha256": "0cc60fec1790a7a455256004035de4c4c55988bedcf7ef33c3a8ec20f75920cc",
    "size": "1302091776"
  },
  {
    "version": "38",
    "arch": "x86_64",
    "link": "https://download.fedoraproject.org/pub/fedora/linux/releases/38/Cloud/x86_64/images/Fedora-Cloud-Base-GCP-38-1.6.x86_64.tar.gz",
    "variant": "Cloud",
    "subvariant": "Cloud_Base",
    "sha256": "6bf0818b1a178d530cac314f033102f4a1e995280564da8d1071dc52e8c6eefa",
    "size": "502959652"
  },
  {
    "version": "38",
    "arch": "x86_64",
    "link": "https://download.fedoraproject.org/pub/fedora/linux/releases/38/Cloud/x86_64/images/Fedora-Cloud-Base-38-1.6.x86_64.qcow2",
    "variant": "Cloud",
    "subvariant": "Cloud_Base",
    "sha256": "d334670401ff3d5b4129fcc662cf64f5a6e568228af59076cc449a4945318482",
    "size": "497287168"
  },
  {
    "version": "38",
    "arch": "x86_64",
    "link": "https://download.fedoraproject.org/pub/fedora/linux/releases/38/Cloud/x86_64/images/Fedora-Cloud-Base-38-1.6.x86_64.raw.xz",
    "variant": "Cloud",
    "subvariant": "Cloud_Base",
    "sha256": "5fe502369737c77e8ed074803ea0e6b34365ed274701f47327fd1f5eb45474ce",
    "size": "393441776"
  },
  {
    "version": "38",
    "arch": "x86_64",
    "link": "https://download.fedoraproject.org/pub/fedora/linux/releases/38/Cloud/x86_64/images/Fedora-Cloud-Base-Vagrant-38-1.6.x86_64.vagrant-libvirt.box",
    "variant": "Cloud",
    "subvariant": "Cloud_Base",
    "sha256": "67aeda42f7f302907cc4229affe5444fd74398cc63698ede64488f2c7c5be2d7",
    "size": "484047550"
  },
  {
    "version": "38",
    "arch": "x86_64",
    "link": "https://download.fedoraproject.org/pub/fedora/linux/releases/38/Cloud/x86_64/images/Fedora-Cloud-Base-Vagrant-38-1.6.x86_64.vagrant-virtualbox.box",
    "variant": "Cloud",
    "subvariant": "Cloud_Base",
    "sha256": "6f597d98ce112167843536c1847e76c96531a1d15598758d0e8107830c76eecd",
    "size": "495882240"
  },
  {
    "version": "38",
    "arch": "aarch64",
    "link": "https://download.fedoraproject.org/pub/fedora/linux/releases/38/Cloud/aarch64/images/Fedora-Cloud-Base-38-1.6.aarch64.qcow2",
    "variant": "Cloud",
    "subvariant": "Cloud_Base",
    "sha256": "ad71d22104a16e4f9efa93e61e8c7bce28de693f59c802586abbe85e9db55a65",
    "size": "499056640"
  },
  {
    "version": "38",
    "arch": "aarch64",
    "link": "https://download.fedoraproject.org/pub/fedora/linux/releases/38/Cloud/aarch64/images/Fedora-Cloud-Base-38-1.6.aarch64.raw.xz",
    "variant": "Cloud",
    "subvariant": "Cloud_Base",
    "sha256": "58ea3280f8fcf8adea81ec2d7d26afcc75989ad4021d4e1de22a88e9714477a8",
    "size": "394203716"
  },
  {
    "version": "38",
    "arch": "x86_64",
    "link": "https://download.fedoraproject.org/pub/fedora/linux/releases/38/Container/x86_64/images/Fedora-Container-Base-38-1.6.x86_64.tar.xz",
    "variant": "Container",
    "subvariant": "Container_Base",
    "sha256": "366fe4a6a6d98241704f22d0b2e6591ee9ad502d83019f9c580a7b2fe9f5068b",
    "size": "44741412"
  },
  {
    "version": "38",
    "arch": "x86_64",
    "link": "https://download.fedoraproject.org/pub/fedora/linux/releases/38/Container/x86_64/images/Fedora-Container-Minimal-Base-38-1.6.x86_64.tar.xz",
    "variant": "Container",
    "subvariant": "Container_Minimal_Base",
    "sha256": "5077fc68461aa9ccd4f419e76dc46b7efdb90a71d5b1c69da382c1a24fb11886",
    "size": "28454572"
  },
  {
    "version": "38",
    "arch": "aarch64",
    "link": "https://download.fedoraproject.org/pub/fedora/linux/releases/38/Container/aarch64/images/Fedora-Container-Base-38-1.6.aarch64.tar.xz",
    "variant": "Container",
    "subvariant": "Container_Base",
    "sha256": "55600f9db2dad6682466ef7f6df507f44667ee5a1a74789d22928556f32f41f6",
    "size": "42351620"
  },
  {
    "version": "38",
    "arch": "aarch64",
    "link": "https://download.fedoraproject.org/pub/fedora/linux/releases/38/Container/aarch64/images/Fedora-Container-Minimal-Base-38-1.6.aarch64.tar.xz",
    "variant": "Container",
    "subvariant": "Container_Minimal_Base",
    "sha256": "c3cb3263e8e7bca952adcca5dbff7f8e0f585c448c608b31fe1fb0c330ff421f",
    "size": "26114300"
  },
  {
    "version": "38",
    "arch": "x86_64",
    "link": "https://download.fedoraproject.org/pub/fedora/linux/releases/38/Everything/x86_64/iso/Fedora-Everything-netinst-x86_64-38-1.6.iso",
    "variant": "Everything",
    "subvariant": "Everything",
    "sha256": "4d042dedc8886856db10bc882074b84dcce52f829ea7b3f31d8031db8d84df20",
    "size": "718284800"
  },
  {
    "version": "38",
    "arch": "aarch64",
    "link": "https://download.fedoraproject.org/pub/fedora/linux/releases/38/Everything/aarch64/iso/Fedora-Everything-netinst-aarch64-38-1.6.iso",
    "variant": "Everything",
    "subvariant": "Everything",
    "sha256": "9fc3d1a6390c1c9c0128345506658019e011c66dd9cffac65817eb72ba71e716",
    "size": "687859712"
  },
  {
    "version": "38",
    "arch": "x86_64",
    "link": "https://download.fedoraproject.org/pub/fedora/linux/releases/38/Kinoite/x86_64/iso/Fedora-Kinoite-ostree-x86_64-38-1.6.iso",
    "variant": "Kinoite",
    "subvariant": "Kinoite",
    "sha256": "5415e61ae43253a61e267aaf21cc62de54ee80f2f0b59351f88feef47dab5eeb",
    "size": "2786338816"
  },
  {
    "version": "38",
    "arch": "aarch64",
    "link": "https://download.fedoraproject.org/pub/fedora/linux/releases/38/Kinoite/aarch64/iso/Fedora-Kinoite-ostree-aarch64-38-1.6.iso",
    "variant": "Kinoite",
    "subvariant": "Kinoite",
    "sha256": "e1507737781810278a7750fc1841b42b60c5035e0d274e858dc4ccccb36cd159",
    "size": "2684594176"
  },
  {
    "version": "38",
    "arch": "x86_64",
    "link": "https://download.fedoraproject.org/pub/fedora/linux/releases/38/Server/x86_64/images/Fedora-Server-KVM-38-1.6.x86_64.qcow2",
    "variant": "Server",
    "subvariant": "Server_KVM",
    "sha256": "fe07c4885c6a224e5527c6eccd0ada07c858a0eec2135e1c9ccd02c26eec408d",
    "size": "629276672"
  },
  {
    "version": "38",
    "arch": "x86_64",
    "link": "https://download.fedoraproject.org/pub/fedora/linux/releases/38/Server/x86_64/iso/Fedora-Server-dvd-x86_64-38-1.6.iso",
    "variant": "Server",
    "subvariant": "Server",
    "sha256": "66b52d7cb39386644cd740930b0bef0a5a2f2be569328fef6b1f9b3679fdc54d",
    "size": "2438201344"
  },
  {
    "version": "38",
    "arch": "x86_64",
    "link": "https://download.fedoraproject.org/pub/fedora/linux/releases/38/Server/x86_64/iso/Fedora-Server-netinst-x86_64-38-1.6.iso",
    "variant": "Server",
    "subvariant": "Server",
    "sha256": "192af621553aa32154697029e34cbe30152a9e23d72d55f31918b166979bbcf5",
    "size": "718336000"
  },
  {
    "version": "38",
    "arch": "aarch64",
    "link": "https://download.fedoraproject.org/pub/fedora/linux/releases/38/Server/aarch64/images/Fedora-Server-38-1.6.aarch64.raw.xz",
    "variant": "Server",
    "subvariant": "Server",
    "sha256": "11e8880908c1a147d8c8d41fd48cfd445dc555b6a8fddaa511710951b882fb1b",
    "size": "1576650748"
  },
  {
    "version": "38",
    "arch": "aarch64",
    "link": "https://download.fedoraproject.org/pub/fedora/linux/releases/38/Server/aarch64/images/Fedora-Server-KVM-38-1.6.aarch64.qcow2",
    "variant": "Server",
    "subvariant": "Server_KVM",
    "sha256": "30a1ce459f4ae4f51ca31d5fbb7827e855b9b446df2de1fe01ebabc39fde3eb2",
    "size": "592576512"
  },
  {
    "version": "38",
    "arch": "aarch64",
    "link": "https://download.fedoraproject.org/pub/fedora/linux/releases/38/Server/aarch64/iso/Fedora-Server-dvd-aarch64-38-1.6.iso",
    "variant": "Server",
    "subvariant": "Server",
    "sha256": "0b40485d74fc60c0a78f071396aba78fafb2f8f3b1ab4cbc3388bda82f764f9b",
    "size": "2281897984"
  },
  {
    "version": "38",
    "arch": "aarch64",
    "link": "https://download.fedoraproject.org/pub/fedora/linux/releases/38/Server/aarch64/iso/Fedora-Server-netinst-aarch64-38-1.6.iso",
    "variant": "Server",
    "subvariant": "Server",
    "sha256": "0cbc11231f3e27b3e29c88936d0eca289546f8c7eba53f39b81ea575ceba454a",
    "size": "687929344"
  },
  {
    "version": "38",
    "arch": "x86_64",
    "link": "https://download.fedoraproject.org/pub/fedora/linux/releases/38/Silverblue/x86_64/iso/Fedora-Silverblue-ostree-x86_64-38-1.6.iso",
    "variant": "Silverblue",
    "subvariant": "Silverblue",
    "sha256": "0569d072cddb64fa08773d9f7649f2f1f55a4c04228d47042d405a6a10ffe1c6",
    "size": "3175862272"
  },
  {
    "version": "38",
    "arch": "x86_64",
    "link": "https://download.fedoraproject.org/pub/fedora/linux/releases/38/Spins/x86_64/iso/Fedora-MATE_Compiz-Live-x86_64-38-1.6.iso",
    "variant": "Spins",
    "subvariant": "Mate",
    "sha256": "29a9b062c2a4b4444f2b2cfd20048cfc2d0d40b36e5ae4535573ce35a554ea12",
    "size": "2224752640"
  },
  {
    "version": "38",
    "arch": "x86_64",
    "link": "https://download.fedoraproject.org/pub/fedora/linux/releases/38/Spins/x86_64/iso/Fedora-Budgie-Live-x86_64-38-1.6.iso",
    "variant": "Spins",
    "subvariant": "Budgie",
    "sha256": "6fa95cfd33cd57bec96f8c80d258f1d6a7a6adf8cc20d34245fb4cd2448e33ba",
    "size": "1967298560"
  },
  {
    "version": "38",
    "arch": "x86_64",
    "link": "https://download.fedoraproject.org/pub/fedora/linux/releases/38/Spins/x86_64/iso/Fedora-Cinnamon-Live-x86_64-38-1.6.iso",
    "variant": "Spins",
    "subvariant": "Cinnamon",
    "sha256": "d683f5b5be304b187d96be30738618ce1fa5c0e18a6662ce219b17bbb41b9865",
    "size": "2304890880"
  },
  {
    "version": "38",
    "arch": "x86_64",
    "link": "https://download.fedoraproject.org/pub/fedora/linux/releases/38/Spins/x86_64/iso/Fedora-KDE-Live-x86_64-38-1.6.iso",
    "variant": "Spins",
    "subvariant": "KDE",
    "sha256": "984e65fd81fe62dcc1ef2ebc0cfda1ca1659221e5e2fb87cf715badd0a047f00",
    "size": "2408269824"
  },
  {
    "version": "38",
    "arch": "x86_64",
    "link": "https://download.fedoraproject.org/pub/fedora/linux/releases/38/Spins/x86_64/iso/Fedora-LXDE-Live-x86_64-38-1.6.iso",
    "variant": "Spins",
    "subvariant": "LXDE",
    "sha256": "ebcd4c807bb2bfac87fe9015c921797ad6cff583f3cf46808afd8d45269aa619",
    "size": "1455536128"
  },
  {
    "version": "38",
    "arch": "x86_64",
    "link": "https://download.fedoraproject.org/pub/fedora/linux/releases/38/Spins/x86_64/iso/Fedora-LXQt-Live-x86_64-38-1.6.iso",
    "variant": "Spins",
    "subvariant": "LXQt",
    "sha256": "f8abfc399a4a346b31fb8cb0b8a6cfe20a5b6de2ab08ee455815817a5a7b6773",
    "size": "1486770176"
  },
  {
    "version": "38",
    "arch": "x86_64",
    "link": "https://download.fedoraproject.org/pub/fedora/linux/releases/38/Spins/x86_64/iso/Fedora-SoaS-Live-x86_64-38-1.6.iso",
    "variant": "Spins",
    "subvariant": "SoaS",
    "sha256": "56db9cfda255ff2ebf27b69b09c99f43285f88143d09fc480a8452023511cbf9",
    "size": "1236578304"
  },
  {
    "version": "38",
    "arch": "x86_64",
    "link": "https://download.fedoraproject.org/pub/fedora/linux/releases/38/Spins/x86_64/iso/Fedora-Sway-Live-x86_64-38-1.6.iso",
    "variant": "Spins",
    "subvariant": "Sway",
    "sha256": "110fdb40f42554e90f444f0d86f5b515708aa92d3e7c2931aee1d7df7ea1c491",
    "size": "1555744768"
  },
  {
    "version": "38",
    "arch": "x86_64",
    "link": "https://download.fedoraproject.org/pub/fedora/linux/releases/38/Spins/x86_64/iso/Fedora-Xfce-Live-x86_64-38-1.6.iso",
    "variant": "Spins",
    "subvariant": "Xfce",
    "sha256": "80363bfeae9573f2b2de320981404d5b4bdf49ad095a4d28f3c620afb73ff7fc",
    "size": "1683156992"
  },
  {
    "version": "38",
    "arch": "x86_64",
    "link": "https://download.fedoraproject.org/pub/fedora/linux/releases/38/Spins/x86_64/iso/Fedora-i3-Live-x86_64-38-1.6.iso",
    "variant": "Spins",
    "subvariant": "i3",
    "sha256": "f2ca8aed269b8a52e1640faca2252072db548b255b253416198437cdaf2bbca1",
    "size": "1438853120"
  },
  {
    "version": "38",
    "arch": "x86_64",
    "link": "https://download.fedoraproject.org/pub/fedora/linux/releases/38/Workstation/x86_64/iso/Fedora-Workstation-Live-x86_64-38-1.6.iso",
    "variant": "Workstation",
    "subvariant": "Workstation",
    "sha256": "7a444a2e19012023bf0b015ae30135bafc5fd20f4f333310d42b118745093992",
    "size": "2099451904"
  },
  {
    "version": "38",
    "arch": "aarch64",
    "link": "https://download.fedoraproject.org/pub/fedora/linux/releases/38/Workstation/aarch64/images/Fedora-Workstation-38-1.6.aarch64.raw.xz",
    "variant": "Workstation",
    "subvariant": "Workstation",
    "sha256": "575f0974933caf9cc5161d1db73f22dde33e538cfe6bd2a68f65dbb322f03578",
    "size": "4080790616"
  },
  {
    "version": "38",
    "arch": "aarch64",
    "link": "https://download.fedoraproject.org/pub/fedora/linux/releases/38/Workstation/aarch64/iso/Fedora-Workstation-Live-aarch64-38-1.6.iso",
    "variant": "Workstation",
    "subvariant": "Workstation",
    "sha256": "36e48904d5dd93d0bbbd9bc6087cb4025f25e2859fe45c93dda0f0e3e082387e",
    "size": "2017744896"
  },
  {
    "version": "38",
    "arch": "x86_64",
    "link": "https://download.fedoraproject.org/pub/fedora/linux/releases/38/Sericea/x86_64/iso/Fedora-Sericea-ostree-x86_64-38-1.6.iso",
    "variant": "Sericea",
    "subvariant": "Sericea",
    "sha256": "eb1c9a1eb369e506e555fd82033e108299e88e1f47340519dae9b6562f4fa934",
    "size": "2197972992"
  },
  {
    "version": "38",
    "arch": "x86_64",
    "link": "https://download.fedoraproject.org/pub/alt/releases/38/Labs/x86_64/images/Fedora-Python-Classroom-Vagrant-38-1.6.x86_64.vagrant-libvirt.box",
    "variant": "Labs",
    "subvariant": "Python_Classroom",
    "sha256": "9217d38c5788e68b6fee97966cf617715207b016ef3b540f0ce1c0feec361224",
    "size": "1394688314"
  },
  {
    "version": "38",
    "arch": "x86_64",
    "link": "https://download.fedoraproject.org/pub/alt/releases/38/Labs/x86_64/images/Fedora-Python-Classroom-Vagrant-38-1.6.x86_64.vagrant-virtualbox.box",
    "variant": "Labs",
    "subvariant": "Python_Classroom",
    "sha256": "518686ff2374e7ba37b894cc5a3a7ef79f104aecb8424f7ca69e2fdeff8daf78",
    "size": "1414041600"
  },
  {
    "version": "38",
    "arch": "x86_64",
    "link": "https://download.fedoraproject.org/pub/alt/releases/38/Labs/x86_64/images/Fedora-Scientific-Vagrant-38-1.6.x86_64.vagrant-libvirt.box",
    "variant": "Labs",
    "subvariant": "Scientific",
    "sha256": "c65eff049ea992fd7ca231c0334a4852eb417dfb3270ec92d9036859a98131ac",
    "size": "4186970434"
  },
  {
    "version": "38",
    "arch": "x86_64",
    "link": "https://download.fedoraproject.org/pub/alt/releases/38/Labs/x86_64/images/Fedora-Scientific-Vagrant-38-1.6.x86_64.vagrant-virtualbox.box",
    "variant": "Labs",
    "subvariant": "Scientific",
    "sha256": "2d614cf23d817d0bb1636e822927e3a4b94ea242b5dd93b627fc41fa2259590b",
    "size": "4235796480"
  },
  {
    "version": "38",
    "arch": "x86_64",
    "link": "https://download.fedoraproject.org/pub/alt/releases/38/Labs/x86_64/iso/Fedora-Astronomy_KDE-Live-x86_64-38-1.6.iso",
    "variant": "Labs",
    "subvariant": "Astronomy_KDE",
    "sha256": "630cc501bfc28162a0f37dae7f96f668085f906ad7db44b118fe6cad83205dc3",
    "size": "5081790464"
  },
  {
    "version": "38",
    "arch": "x86_64",
    "link": "https://download.fedoraproject.org/pub/alt/releases/38/Labs/x86_64/iso/Fedora-Comp_Neuro-Live-x86_64-38-1.6.iso",
    "variant": "Labs",
    "subvariant": "Comp_Neuro",
    "sha256": "05fcc0d8cb8cda468257b838ec2a59f246e846d0867fea68737e32a05c7c2b81",
    "size": "2869561344"
  },
  {
    "version": "38",
    "arch": "x86_64",
    "link": "https://download.fedoraproject.org/pub/alt/releases/38/Labs/x86_64/iso/Fedora-Design_suite-Live-x86_64-38-1.6.iso",
    "variant": "Labs",
    "subvariant": "Design_suite",
    "sha256": "5cff090c452f6b479a912528d4b03fe7dae199e25c921b8f064b313da0495654",
    "size": "3750504448"
  },
  {
    "version": "38",
    "arch": "x86_64",
    "link": "https://download.fedoraproject.org/pub/alt/releases/38/Labs/x86_64/iso/Fedora-Games-Live-x86_64-38-1.6.iso",
    "variant": "Labs",
    "subvariant": "Games",
    "sha256": "ad8efc4a458986809de6dc07bd291f12c8aeb802ad01616c0ca87b4abd35aae5",
    "size": "6503419904"
  },
  {
    "version": "38",
    "arch": "x86_64",
    "link": "https://download.fedoraproject.org/pub/alt/releases/38/Labs/x86_64/iso/Fedora-Jam_KDE-Live-x86_64-38-1.6.iso",
    "variant": "Labs",
    "subvariant": "Jam_KDE",
    "sha256": "fad3a48a9df666880a26c1f567874b164a3535df3655dcf21aebe4106a3d12c3",
    "size": "3145064448"
  },
  {
    "version": "38",
    "arch": "x86_64",
    "link": "https://download.fedoraproject.org/pub/alt/releases/38/Labs/x86_64/iso/Fedora-Python-Classroom-Live-x86_64-38-1.6.iso",
    "variant": "Labs",
    "subvariant": "Python_Classroom",
    "sha256": "597732906538ee25405613d7ae0af1a50d78db5fc794a2f7dd06a7af15fa4e1c",
    "size": "2134595584"
  },
  {
    "version": "38",
    "arch": "x86_64",
    "link": "https://download.fedoraproject.org/pub/alt/releases/38/Labs/x86_64/iso/Fedora-Robotics-Live-x86_64-38-1.6.iso",
    "variant": "Labs",
    "subvariant": "Robotics",
    "sha256": "eda4b00cf5a9c433831017cf12d5ffe16aa311a6b957b214aaa1767f53af8066",
    "size": "3157374976"
  },
  {
    "version": "38",
    "arch": "x86_64",
    "link": "https://download.fedoraproject.org/pub/alt/releases/38/Labs/x86_64/iso/Fedora-Scientific_KDE-Live-x86_64-38-1.6.iso",
    "variant": "Labs",
    "subvariant": "Scientific_KDE",
    "sha256": "ee5a6b686a12e7b16727143f8b6747642bdcaaa9708d1e539f1ce8afdc2bded1",
    "size": "4805101568"
  },
  {
    "version": "38",
    "arch": "x86_64",
    "link": "https://download.fedoraproject.org/pub/alt/releases/38/Labs/x86_64/iso/Fedora-Security-Live-x86_64-38-1.6.iso",
    "variant": "Labs",
    "subvariant": "Security",
    "sha256": "6c02e0454ff9fa78d0bd16f1f443432092436a4082723b6805f5419e75634b8d",
    "size": "2254899200"
  },
  {
    "version": "38",
    "arch": "aarch64",
    "link": "https://download.fedoraproject.org/pub/alt/iot/38/IoT/aarch64/images/Fedora-IoT-38.20230419.2-20230419.2.aarch64.raw.xz",
    "variant": "IoT",
    "subvariant": "IoT",
    "sha256": "264f07366542415ffc30f69689de6d0525fc8ab04dc6be56d8174b1ff8b98353",
    "size": "751943868"
  },
  {
    "version": "38",
    "arch": "aarch64",
    "link": "https://download.fedoraproject.org/pub/alt/iot/38/IoT/aarch64/iso/Fedora-IoT-ostree-38.20230419.2-20230419.2.aarch64.iso",
    "variant": "IoT",
    "subvariant": "IoT",
    "sha256": "9fd1a242df44f2dbadf764da2a1fa9840c2c8405d49be963046caa7c968f72c0",
    "size": "2402134016"
  },
  {
    "version": "38",
    "arch": "aarch64",
    "link": "https://download.fedoraproject.org/pub/alt/iot/38/IoT/aarch64/iso/Fedora-IoT-ostree-aarch64-38-20230419.2.iso",
    "variant": "IoT",
    "subvariant": "IoT",
    "sha256": "f8809a9365bb4bfe477b352b3815c56b0153ab7a7e62fac8b6f68dce7a2a9359",
    "size": "1337843712"
  },
  {
    "version": "38",
    "arch": "x86_64",
    "link": "https://download.fedoraproject.org/pub/alt/iot/38/IoT/x86_64/images/Fedora-IoT-38.20230419.2-20230419.2.x86_64.raw.xz",
    "variant": "IoT",
    "subvariant": "IoT",
    "sha256": "f580ad64f2d16fc284d0f3f0a669bc0ee2db2877d2ffd0d5b11fac248f3d4602",
    "size": "705014016"
  },
  {
    "version": "38",
    "arch": "x86_64",
    "link": "https://download.fedoraproject.org/pub/alt/iot/38/IoT/x86_64/iso/Fedora-IoT-ostree-38.20230419.2-20230419.2.x86_64.iso",
    "variant": "IoT",
    "subvariant": "IoT",
    "sha256": "5d854ad9747c38ee222bd2ac1710a724cb50b654dbc9b64ca5d6998b1b368729",
    "size": "2382364672"
  },
  {
    "version": "38",
    "arch": "x86_64",
    "link": "https://download.fedoraproject.org/pub/alt/iot/38/IoT/x86_64/iso/Fedora-IoT-ostree-x86_64-38-20230419.2.iso",
    "variant": "IoT",
    "subvariant": "IoT",
    "sha256": "6f22609cb540e684f0758ad334b1f4e3b31bae54e21a2d2b8d4fc08b35f99c36",
    "size": "1327953920"
  }
]
