{
  "A Community Server OS": "A Community Server OS",
  "A Registered Digital Public Good": "A Registered Digital Public Good",
  "An innovative platform for hardware, clouds, and containers, built with love by you.": "An innovative platform for hardware, clouds, and containers, built with love by you.",
  "Call to action": "Call to action",
  "Chat": "Chat",
  "Documentation": "Documentation",
  "Download Now": "Download Now",
  "Editions": "Editions",
  "Extensive documentation is available at the Fedora documentation page.": "Extensive documentation is available at the Fedora documentation page.",
  "Fedora ALT Downloads": "Fedora ALT Downloads",
  "Fedora Chat": "Fedora Chat",
  "Fedora Cloud edition is a powerful and minimal base operating system image with tailored images available for both public and many private cloud uses.": "Fedora Cloud edition is a powerful and minimal base operating system image with tailored images available for both public and many private cloud uses.",
  "Fedora CoreOS is an automatically updating, minimal, container-focused operating system.": "Fedora CoreOS is an automatically updating, minimal, container-focused operating system.",
  "Fedora Discussion": "Fedora Discussion",
  "Fedora Docs": "Fedora Docs",
  "Fedora Index Image": "Fedora Index Image",
  "Fedora IoT provides a trusted open source platform as a strong foundation for IoT ecosystems.": "Fedora IoT provides a trusted open source platform as a strong foundation for IoT ecosystems.",
  "Fedora Labs": "Fedora Labs",
  "Fedora Labs is a selection of curated bundles of purpose-driven software and content as curated and maintained by members of the Fedora Community. These may be installed as standalone full versions of Fedora or as add-ons to existing Fedora installations.": "Fedora Labs is a selection of curated bundles of purpose-driven software and content as curated and maintained by members of the Fedora Community. These may be installed as standalone full versions of Fedora or as add-ons to existing Fedora installations.",
  "Fedora Linux": "Fedora Linux",
  "Fedora Magazine": "Fedora Magazine",
  "Fedora Server is a powerful, flexible operating system that includes the best and latest datacenter technologies.": "Fedora Server is a powerful, flexible operating system that includes the best and latest datacenter technologies.",
  "Fedora Spins": "Fedora Spins",
  "Fedora Workstation is a polished, easy to use operating system for laptop and desktop computers, with a complete set of tools for developers and makers of all kinds.": "Fedora Workstation is a polished, easy to use operating system for laptop and desktop computers, with a complete set of tools for developers and makers of all kinds.",
  "Fedora is always free for anyone to **use, modify, and distribute**. It is built and used by people across the globe who work together as a community.": "Fedora is always free for anyone to **use, modify, and distribute**. It is built and used by people across the globe who work together as a community.",
  "Get support from our community on the Fedora Discussion Forum.": "Get support from our community on the Fedora Discussion Forum.",
  "If you prefer an alternative desktop environment such as KDE Plasma Desktop or Xfce, you can download a Fedora Spin for your preferred desktop environment and use that to install Fedora, pre-configured for the desktop environment of your choice.": "If you prefer an alternative desktop environment such as KDE Plasma Desktop or Xfce, you can download a Fedora Spin for your preferred desktop environment and use that to install Fedora, pre-configured for the desktop environment of your choice.",
  "It is a compilation of software packages, each under its own license. Images that can be downloaded here are available under the combination of licenses of the constituent software packages and the license of the Fedora Linux distribution itself. [View License](https://fedoraproject.org/wiki/Legal:Licenses/LicenseAgreement#License)": "It is a compilation of software packages, each under its own license. Images that can be downloaded here are available under the combination of licenses of the constituent software packages and the license of the Fedora Linux distribution itself. [View License](https://fedoraproject.org/wiki/Legal:Licenses/LicenseAgreement#License)",
  "Learn more": "Learn more",
  "Learn More": "Learn More",
  "License": "License",
  "License Details": "License Details",
  "Make the most of using Fedora.": "Make the most of using Fedora.",
  "Mission Statement": "Mission Statement",
  "Next upcoming event": "Next upcoming event",
  "Release Notes": "Release Notes",
  "Support": "Support",
  "Support Resources": "Support Resources",
  "The Fedora Alternative Downloads are either special-purpose - for testing, for specific architectures - or are more standard versions of Fedora in alternative formats such as network installer format or formatted for BitTorrent download.": "The Fedora Alternative Downloads are either special-purpose - for testing, for specific architectures - or are more standard versions of Fedora in alternative formats such as network installer format or formatted for BitTorrent download.",
  "The Fedora desktop experiences you know with an additional layer of security and reliability.": "The Fedora desktop experiences you know with an additional layer of security and reliability.",
  "The container optimized OS": "The container optimized OS",
  "The leading Linux desktop": "The leading Linux desktop",
  "The lightweight VM environment": "The lightweight VM environment",
  "The solid edge foundation": "The solid edge foundation",
  "Users and developers are available in the #fedora channel on Fedora Chat.": "Users and developers are available in the #fedora channel on Fedora Chat.",
  "View more articles on [Fedora Magazine](https://fedoramagazine.org/)": "View more articles on [Fedora Magazine](https://fedoramagazine.org/)",
  "Want more Fedora options?": "Want more Fedora options?",
  "its_your_Server.": "Server.",
  "its_your_Workstation.": "Workstation.",
  "its_your_Community.": "Community.",
  "its_your_Operating System." : "Operating System.",
  "It's your Operating System.": "It's your Operating System.",
  "\ud83c\udf89 [Fedora Linux 38 released!](https://fedoramagazine.org/announcing-fedora-38)": "\ud83c\udf89 [Fedora Linux 38 released!](https://fedoramagazine.org/announcing-fedora-38)"
}
