url,label_str,label
/content/jdbjdb/jaffedbase/KA.SU3.38.tiff,SU,5
/content/jdbjdb/jaffedbase/YM.DI3.66.tiff,DI,1
/content/jdbjdb/jaffedbase/MK.SA2.120.tiff,SA,4
/content/jdbjdb/jaffedbase/KM.NE2.2.tiff,NE,6
/content/jdbjdb/jaffedbase/NM.AN3.106.tiff,AN,0
/content/jdbjdb/jaffedbase/KA.SA2.34.tiff,SA,4
/content/jdbjdb/jaffedbase/KM.SA1.9.tiff,SA,4
/content/jdbjdb/jaffedbase/NA.NE1.199.tiff,NE,6
/content/jdbjdb/jaffedbase/YM.SU1.58.tiff,SU,5
/content/jdbjdb/jaffedbase/NA.AN1.211.tiff,AN,0
/content/jdbjdb/jaffedbase/MK.AN1.125.tiff,AN,0
/content/jdbjdb/jaffedbase/KA.HA2.30.tiff,HA,3
/content/jdbjdb/jaffedbase/KL.HA2.159.tiff,HA,3
/content/jdbjdb/jaffedbase/MK.SU1.122.tiff,SU,5
/content/jdbjdb/jaffedbase/KA.DI1.42.tiff,DI,1
/content/jdbjdb/jaffedbase/KL.DI2.171.tiff,DI,1
/content/jdbjdb/jaffedbase/NM.FE2.111.tiff,FE,2
/content/jdbjdb/jaffedbase/TM.DI3.195.tiff,DI,1
/content/jdbjdb/jaffedbase/KR.NE1.71.tiff,NE,6
/content/jdbjdb/jaffedbase/NA.FE1.217.tiff,FE,2
/content/jdbjdb/jaffedbase/MK.AN3.127.tiff,AN,0
/content/jdbjdb/jaffedbase/UY.HA3.139.tiff,HA,3
/content/jdbjdb/jaffedbase/KL.SU3.166.tiff,SU,5
/content/jdbjdb/jaffedbase/MK.HA2.117.tiff,HA,3
/content/jdbjdb/jaffedbase/YM.HA2.53.tiff,HA,3
/content/jdbjdb/jaffedbase/NA.SA3.207.tiff,SA,4
/content/jdbjdb/jaffedbase/KR.AN2.84.tiff,AN,0
/content/jdbjdb/jaffedbase/UY.DI3.151.tiff,DI,1
/content/jdbjdb/jaffedbase/KL.DI3.172.tiff,DI,1
/content/jdbjdb/jaffedbase/KM.DI3.22.tiff,DI,1
/content/jdbjdb/jaffedbase/MK.NE2.114.tiff,NE,6
/content/jdbjdb/jaffedbase/MK.HA1.116.tiff,HA,3
/content/jdbjdb/jaffedbase/TM.HA3.182.tiff,HA,3
/content/jdbjdb/jaffedbase/NA.NE3.201.tiff,NE,6
/content/jdbjdb/jaffedbase/TM.SA2.185.tiff,SA,4
/content/jdbjdb/jaffedbase/KR.SA3.79.tiff,SA,4
/content/jdbjdb/jaffedbase/YM.AN3.63.tiff,AN,0
/content/jdbjdb/jaffedbase/KL.FE3.176.tiff,FE,2
/content/jdbjdb/jaffedbase/KM.AN2.18.tiff,AN,0
/content/jdbjdb/jaffedbase/KR.SU3.82.tiff,SU,5
/content/jdbjdb/jaffedbase/KL.SA2.162.tiff,SA,4
/content/jdbjdb/jaffedbase/KA.AN3.41.tiff,AN,0
/content/jdbjdb/jaffedbase/KA.AN2.40.tiff,AN,0
/content/jdbjdb/jaffedbase/NA.FE3.219.tiff,FE,2
/content/jdbjdb/jaffedbase/YM.SA2.56.tiff,SA,4
/content/jdbjdb/jaffedbase/NA.SU1.208.tiff,SU,5
/content/jdbjdb/jaffedbase/KM.HA3.6.tiff,HA,3
/content/jdbjdb/jaffedbase/KM.HA1.4.tiff,HA,3
/content/jdbjdb/jaffedbase/YM.FE4.70.tiff,FE,2
/content/jdbjdb/jaffedbase/YM.NE3.51.tiff,NE,6
/content/jdbjdb/jaffedbase/TM.NE3.179.tiff,NE,6
/content/jdbjdb/jaffedbase/TM.HA2.181.tiff,HA,3
/content/jdbjdb/jaffedbase/KL.NE2.156.tiff,NE,6
/content/jdbjdb/jaffedbase/KA.SU1.36.tiff,SU,5
/content/jdbjdb/jaffedbase/TM.NE2.178.tiff,NE,6
/content/jdbjdb/jaffedbase/KA.HA3.31.tiff,HA,3
/content/jdbjdb/jaffedbase/KA.FE2.46.tiff,FE,2
/content/jdbjdb/jaffedbase/KR.FE2.90.tiff,FE,2
/content/jdbjdb/jaffedbase/UY.SU2.144.tiff,SU,5
/content/jdbjdb/jaffedbase/UY.DI2.150.tiff,DI,1
/content/jdbjdb/jaffedbase/NM.DI1.107.tiff,DI,1
/content/jdbjdb/jaffedbase/TM.FE3.198.tiff,FE,2
/content/jdbjdb/jaffedbase/MK.FE3.133.tiff,FE,2
/content/jdbjdb/jaffedbase/KM.SA5.13.tiff,SA,4
/content/jdbjdb/jaffedbase/KR.FE1.89.tiff,FE,2
/content/jdbjdb/jaffedbase/NM.DI3.109.tiff,DI,1
/content/jdbjdb/jaffedbase/UY.HA2.138.tiff,HA,3
/content/jdbjdb/jaffedbase/KR.FE3.91.tiff,FE,2
/content/jdbjdb/jaffedbase/UY.SU1.143.tiff,SU,5
/content/jdbjdb/jaffedbase/UY.AN1.146.tiff,AN,0
/content/jdbjdb/jaffedbase/KR.NE2.72.tiff,NE,6
/content/jdbjdb/jaffedbase/YM.FE2.68.tiff,FE,2
/content/jdbjdb/jaffedbase/NA.SU2.209.tiff,SU,5
/content/jdbjdb/jaffedbase/NA.HA1.202.tiff,HA,3
/content/jdbjdb/jaffedbase/KL.HA3.160.tiff,HA,3
/content/jdbjdb/jaffedbase/UY.SA2.141.tiff,SA,4
/content/jdbjdb/jaffedbase/NM.SA2.99.tiff,SA,4
/content/jdbjdb/jaffedbase/NM.SA3.100.tiff,SA,4
/content/jdbjdb/jaffedbase/KL.SA1.161.tiff,SA,4
/content/jdbjdb/jaffedbase/TM.AN3.192.tiff,AN,0
/content/jdbjdb/jaffedbase/MK.SA3.121.tiff,SA,4
/content/jdbjdb/jaffedbase/KR.DI2.87.tiff,DI,1
/content/jdbjdb/jaffedbase/MK.AN2.126.tiff,AN,0
/content/jdbjdb/jaffedbase/TM.NE1.177.tiff,NE,6
/content/jdbjdb/jaffedbase/NA.AN3.213.tiff,AN,0
/content/jdbjdb/jaffedbase/UY.FE2.153.tiff,FE,2
/content/jdbjdb/jaffedbase/NA.AN2.212.tiff,AN,0
/content/jdbjdb/jaffedbase/YM.HA1.52.tiff,HA,3
/content/jdbjdb/jaffedbase/NM.HA2.96.tiff,HA,3
/content/jdbjdb/jaffedbase/KM.FE1.23.tiff,FE,2
/content/jdbjdb/jaffedbase/KA.HA4.32.tiff,HA,3
/content/jdbjdb/jaffedbase/KL.NE1.155.tiff,NE,6
/content/jdbjdb/jaffedbase/KM.AN1.17.tiff,AN,0
/content/jdbjdb/jaffedbase/KM.SA3.11.tiff,SA,4
/content/jdbjdb/jaffedbase/KM.FE2.24.tiff,FE,2
/content/jdbjdb/jaffedbase/NA.DI2.215.tiff,DI,1
/content/jdbjdb/jaffedbase/TM.FE1.196.tiff,FE,2
/content/jdbjdb/jaffedbase/MK.DI2.129.tiff,DI,1
/content/jdbjdb/jaffedbase/TM.SU3.189.tiff,SU,5
/content/jdbjdb/jaffedbase/NM.SU3.103.tiff,SU,5
/content/jdbjdb/jaffedbase/UY.DI1.149.tiff,DI,1
/content/jdbjdb/jaffedbase/KA.FE3.47.tiff,FE,2
/content/jdbjdb/jaffedbase/YM.HA3.54.tiff,HA,3
/content/jdbjdb/jaffedbase/KR.AN3.85.tiff,AN,0
/content/jdbjdb/jaffedbase/NM.AN2.105.tiff,AN,0
/content/jdbjdb/jaffedbase/MK.SA1.119.tiff,SA,4
/content/jdbjdb/jaffedbase/UY.NE3.136.tiff,NE,6
/content/jdbjdb/jaffedbase/UY.FE3.154.tiff,FE,2
/content/jdbjdb/jaffedbase/NM.FE3.112.tiff,FE,2
/content/jdbjdb/jaffedbase/NM.AN1.104.tiff,AN,0
/content/jdbjdb/jaffedbase/YM.NE1.49.tiff,NE,6
/content/jdbjdb/jaffedbase/KM.DI1.20.tiff,DI,1
/content/jdbjdb/jaffedbase/MK.DI1.128.tiff,DI,1
/content/jdbjdb/jaffedbase/MK.NE1.113.tiff,NE,6
/content/jdbjdb/jaffedbase/KA.FE1.45.tiff,FE,2
/content/jdbjdb/jaffedbase/TM.AN1.190.tiff,AN,0
/content/jdbjdb/jaffedbase/KA.AN1.39.tiff,AN,0
/content/jdbjdb/jaffedbase/YM.SA3.57.tiff,SA,4
/content/jdbjdb/jaffedbase/KR.SU1.80.tiff,SU,5
/content/jdbjdb/jaffedbase/NA.DI3.216.tiff,DI,1
/content/jdbjdb/jaffedbase/TM.SU1.187.tiff,SU,5
/content/jdbjdb/jaffedbase/UY.NE2.135.tiff,NE,6
/content/jdbjdb/jaffedbase/KL.NE3.157.tiff,NE,6
/content/jdbjdb/jaffedbase/TM.DI2.194.tiff,DI,1
/content/jdbjdb/jaffedbase/NM.NE2.93.tiff,NE,6
/content/jdbjdb/jaffedbase/NM.HA3.97.tiff,HA,3
/content/jdbjdb/jaffedbase/TM.SU2.188.tiff,SU,5
/content/jdbjdb/jaffedbase/KR.SA1.77.tiff,SA,4
/content/jdbjdb/jaffedbase/TM.FE2.197.tiff,FE,2
/content/jdbjdb/jaffedbase/TM.SA1.184.tiff,SA,4
/content/jdbjdb/jaffedbase/NM.HA1.95.tiff,HA,3
/content/jdbjdb/jaffedbase/MK.FE2.132.tiff,FE,2
/content/jdbjdb/jaffedbase/KA.DI3.44.tiff,DI,1
/content/jdbjdb/jaffedbase/KL.DI1.170.tiff,DI,1
/content/jdbjdb/jaffedbase/KA.SA1.33.tiff,SA,4
/content/jdbjdb/jaffedbase/KL.FE2.175.tiff,FE,2
/content/jdbjdb/jaffedbase/NA.DI1.214.tiff,DI,1
/content/jdbjdb/jaffedbase/KR.SU2.81.tiff,SU,5
/content/jdbjdb/jaffedbase/KA.SA3.35.tiff,SA,4
/content/jdbjdb/jaffedbase/UY.NE1.134.tiff,NE,6
/content/jdbjdb/jaffedbase/KL.AN2.168.tiff,AN,0
/content/jdbjdb/jaffedbase/KM.SU1.14.tiff,SU,5
/content/jdbjdb/jaffedbase/NA.FE2.218.tiff,FE,2
/content/jdbjdb/jaffedbase/KL.AN3.169.tiff,AN,0
/content/jdbjdb/jaffedbase/MK.DI3.130.tiff,DI,1
/content/jdbjdb/jaffedbase/NM.NE1.92.tiff,NE,6
/content/jdbjdb/jaffedbase/NA.SU3.210.tiff,SU,5
/content/jdbjdb/jaffedbase/KM.SA2.10.tiff,SA,4
/content/jdbjdb/jaffedbase/NM.SA1.98.tiff,SA,4
/content/jdbjdb/jaffedbase/NA.SA2.206.tiff,SA,4
/content/jdbjdb/jaffedbase/KA.FE4.48.tiff,FE,2
/content/jdbjdb/jaffedbase/UY.SU3.145.tiff,SU,5
/content/jdbjdb/jaffedbase/MK.FE1.131.tiff,FE,2
/content/jdbjdb/jaffedbase/UY.FE1.152.tiff,FE,2
/content/jdbjdb/jaffedbase/KA.NE2.27.tiff,NE,6
/content/jdbjdb/jaffedbase/NA.HA3.204.tiff,HA,3
/content/jdbjdb/jaffedbase/TM.SA3.186.tiff,SA,4
/content/jdbjdb/jaffedbase/KL.SU1.164.tiff,SU,5
/content/jdbjdb/jaffedbase/NM.NE3.94.tiff,NE,6
/content/jdbjdb/jaffedbase/KA.SU2.37.tiff,SU,5
/content/jdbjdb/jaffedbase/NM.SU2.102.tiff,SU,5
/content/jdbjdb/jaffedbase/KL.SU2.165.tiff,SU,5
/content/jdbjdb/jaffedbase/NA.HA2.203.tiff,HA,3
/content/jdbjdb/jaffedbase/MK.SU2.123.tiff,SU,5
/content/jdbjdb/jaffedbase/UY.AN3.148.tiff,AN,0
/content/jdbjdb/jaffedbase/TM.HA1.180.tiff,HA,3
/content/jdbjdb/jaffedbase/KM.FE3.25.tiff,FE,2
/content/jdbjdb/jaffedbase/KR.DI1.86.tiff,DI,1
/content/jdbjdb/jaffedbase/YM.SU2.59.tiff,SU,5
/content/jdbjdb/jaffedbase/UY.HA1.137.tiff,HA,3
/content/jdbjdb/jaffedbase/KM.SU3.16.tiff,SU,5
/content/jdbjdb/jaffedbase/KL.FE1.174.tiff,FE,2
/content/jdbjdb/jaffedbase/KM.SU2.15.tiff,SU,5
/content/jdbjdb/jaffedbase/MK.SU3.124.tiff,SU,5
/content/jdbjdb/jaffedbase/YM.AN1.61.tiff,AN,0
/content/jdbjdb/jaffedbase/KL.HA1.158.tiff,HA,3
/content/jdbjdb/jaffedbase/KA.HA1.29.tiff,HA,3
/content/jdbjdb/jaffedbase/NM.SU1.101.tiff,SU,5
/content/jdbjdb/jaffedbase/TM.DI1.193.tiff,DI,1
/content/jdbjdb/jaffedbase/YM.SA1.55.tiff,SA,4
/content/jdbjdb/jaffedbase/KM.HA2.5.tiff,HA,3
/content/jdbjdb/jaffedbase/NM.FE1.110.tiff,FE,2
/content/jdbjdb/jaffedbase/YM.FE1.67.tiff,FE,2
/content/jdbjdb/jaffedbase/KR.NE3.73.tiff,NE,6
/content/jdbjdb/jaffedbase/KM.NE3.3.tiff,NE,6
/content/jdbjdb/jaffedbase/KR.SA2.78.tiff,SA,4
/content/jdbjdb/jaffedbase/UY.SA1.140.tiff,SA,4
/content/jdbjdb/jaffedbase/NA.SA1.205.tiff,SA,4
/content/jdbjdb/jaffedbase/KR.AN1.83.tiff,AN,0
/content/jdbjdb/jaffedbase/YM.FE3.69.tiff,FE,2
/content/jdbjdb/jaffedbase/KM.NE1.1.tiff,NE,6
/content/jdbjdb/jaffedbase/KM.HA4.7.tiff,HA,3
/content/jdbjdb/jaffedbase/YM.DI2.65.tiff,DI,1
/content/jdbjdb/jaffedbase/UY.AN2.147.tiff,AN,0
/content/jdbjdb/jaffedbase/NA.NE2.200.tiff,NE,6
/content/jdbjdb/jaffedbase/KL.SA3.163.tiff,SA,4
/content/jdbjdb/jaffedbase/KM.AN3.19.tiff,AN,0
/content/jdbjdb/jaffedbase/KA.NE1.26.tiff,NE,6
/content/jdbjdb/jaffedbase/KA.DI2.43.tiff,DI,1
/content/jdbjdb/jaffedbase/KA.NE3.28.tiff,NE,6
/content/jdbjdb/jaffedbase/UY.SA3.142.tiff,SA,4
/content/jdbjdb/jaffedbase/KR.HA2.75.tiff,HA,3
/content/jdbjdb/jaffedbase/KL.DI4.173.tiff,DI,1
/content/jdbjdb/jaffedbase/KL.AN1.167.tiff,AN,0
/content/jdbjdb/jaffedbase/MK.HA3.118.tiff,HA,3
/content/jdbjdb/jaffedbase/TM.AN2.191.tiff,AN,0
/content/jdbjdb/jaffedbase/KR.HA1.74.tiff,HA,3
/content/jdbjdb/jaffedbase/YM.DI1.64.tiff,DI,1
/content/jdbjdb/jaffedbase/KR.DI3.88.tiff,DI,1
/content/jdbjdb/jaffedbase/MK.NE3.115.tiff,NE,6
/content/jdbjdb/jaffedbase/YM.AN2.62.tiff,AN,0
/content/jdbjdb/jaffedbase/YM.NE2.50.tiff,NE,6
/content/jdbjdb/jaffedbase/YM.SU3.60.tiff,SU,5
