ID,DATE,COMPANY,POS,DOMAIN,EXP,STACK
2912478992,2022-02-08 ,Tuti,Mobile Application Developer,Mobile,Developer,Native
2912478992,2022-02-08 ,Tuti,Mobile Application Developer,Mobile,Developer,React
2914556178,2022-02-13 ,NGsoft,Mobile Application Developer,Mobile,Developer,Android 
2914556178,2022-02-13 ,NGsoft,Mobile Application Developer,Mobile,Developer,Java
2914556178,2022-02-13 ,NGsoft,Mobile Application Developer,Mobile,Developer,Kotlin
2914556178,2022-02-13 ,NGsoft,Mobile Application Developer,Mobile,Developer,Native
2914556178,2022-02-13 ,NGsoft,Mobile Application Developer,Mobile,Developer,React
2914556178,2022-02-13 ,NGsoft,Mobile Application Developer,Mobile,Developer,Redux
2914464029,2022-02-10 ,Experis Israel,Mobile Application Developer,Mobile,Developer,Android 
2914464029,2022-02-10 ,Experis Israel,Mobile Application Developer,Mobile,Developer,Design
2914464029,2022-02-10 ,Experis Israel,Mobile Application Developer,Mobile,Developer,Google
2914464029,2022-02-10 ,Experis Israel,Mobile Application Developer,Mobile,Developer,Native
2914464029,2022-02-10 ,Experis Israel,Mobile Application Developer,Mobile,Developer,React
2884541101,2022-02-10 ,General Motors,Junior Android Developer,Mobile,Developer,Android 
2884541101,2022-02-10 ,General Motors,Junior Android Developer,Mobile,Developer,Architecture
2884541101,2022-02-10 ,General Motors,Junior Android Developer,Mobile,Developer,Architecture
2884541101,2022-02-10 ,General Motors,Junior Android Developer,Mobile,Developer,Design
2884541101,2022-02-10 ,General Motors,Junior Android Developer,Mobile,Developer,Java
2884541101,2022-02-10 ,General Motors,Junior Android Developer,Mobile,Developer,Kotlin
2884541101,2022-02-10 ,General Motors,Junior Android Developer,Mobile,Developer,Management
2884541101,2022-02-10 ,General Motors,Junior Android Developer,Mobile,Developer,Native
2884541101,2022-02-10 ,General Motors,Junior Android Developer,Mobile,Developer,React
2896037353,2022-01-30 ,Bzigo,Mobile Application Developer (Swift + Kotlin/Java),Mobile,Developer,Android 
2896037353,2022-01-30 ,Bzigo,Mobile Application Developer (Swift + Kotlin/Java),Mobile,Developer,Java
2896037353,2022-01-30 ,Bzigo,Mobile Application Developer (Swift + Kotlin/Java),Mobile,Developer,Kotlin
2896037353,2022-01-30 ,Bzigo,Mobile Application Developer (Swift + Kotlin/Java),Mobile,Developer,Native
2863556550,2022-02-04 ,Themis-Tech (Stealth),Mobile Engineer,Mobile,Engineer,Google
2918092965,2022-02-13 ,Aquant,Mobile Engineer,Mobile,Developer,Android 
2918092965,2022-02-13 ,Aquant,Mobile Engineer,Mobile,Developer,Design
2918092965,2022-02-13 ,Aquant,Mobile Engineer,Mobile,Developer,Gradle
2918092965,2022-02-13 ,Aquant,Mobile Engineer,Mobile,Developer,Native
2918092965,2022-02-13 ,Aquant,Mobile Engineer,Mobile,Developer,React
2918092965,2022-02-13 ,Aquant,Mobile Engineer,Mobile,Developer,SOLID
2898869850,2022-01-30 ,Neema - Better Than a Bank,Mobile Application Developer,Mobile,Developer,Android 
2898869850,2022-01-30 ,Neema - Better Than a Bank,Mobile Application Developer,Mobile,Developer,Java
2898869850,2022-01-30 ,Neema - Better Than a Bank,Mobile Application Developer,Mobile,Developer,React
2756608418,2021-10-17 ,BlazePod,Junior Android Developer,Mobile,Developer,BLE
2756608418,2021-10-17 ,BlazePod,Junior Android Developer,Mobile,Developer,Java
2756608418,2021-10-17 ,BlazePod,Junior Android Developer,Mobile,Developer,Kotlin
2756608418,2021-10-17 ,BlazePod,Junior Android Developer,Mobile,Developer,Native
2909161527,2022-01-13 ,Augury,Mobile Developer,Mobile,Developer,Architecture
2909161527,2022-01-13 ,Augury,Mobile Developer,Mobile,Developer,Architecture
2909161527,2022-01-13 ,Augury,Mobile Developer,Mobile,Developer,Design
2909161527,2022-01-13 ,Augury,Mobile Developer,Mobile,Developer,Gradle
2909161527,2022-01-13 ,Augury,Mobile Developer,Mobile,Developer,IOT
2909161527,2022-01-13 ,Augury,Mobile Developer,Mobile,Developer,Java
2909161527,2022-01-13 ,Augury,Mobile Developer,Mobile,Developer,Kotlin
2911028069,2022-02-10 ,GK8,Mobile Developer,Mobile,Developer,Google
2911028069,2022-02-10 ,GK8,Mobile Developer,Mobile,Developer,Java
2911028069,2022-02-10 ,GK8,Mobile Developer,Mobile,Developer,Kotlin
2911028069,2022-02-10 ,GK8,Mobile Developer,Mobile,Developer,Native
2911028069,2022-02-10 ,GK8,Mobile Developer,Mobile,Developer,React
2911028069,2022-02-10 ,GK8,Mobile Developer,Mobile,Developer,State
2896424002,2022-01-31 ,Matrix Medika,Mobile Application Developer,Mobile,Developer,Google
2896424002,2022-01-31 ,Matrix Medika,Mobile Application Developer,Mobile,Developer,Java
2896424002,2022-01-31 ,Matrix Medika,Mobile Application Developer,Mobile,Developer,Kotlin
2896424002,2022-01-31 ,Matrix Medika,Mobile Application Developer,Mobile,Developer,Native
2896424002,2022-01-31 ,Matrix Medika,Mobile Application Developer,Mobile,Developer,React
2906869975,2022-02-06 ,ironSource,Mobile Developer,Mobile,Developer,Android 
2906869975,2022-02-06 ,ironSource,Mobile Developer,Mobile,Developer,Design
2906869975,2022-02-06 ,ironSource,Mobile Developer,Mobile,Developer,Gradle
2906869975,2022-02-06 ,ironSource,Mobile Developer,Mobile,Developer,Java
2906869975,2022-02-06 ,ironSource,Mobile Developer,Mobile,Developer,Kotlin
2896037353,2022-01-30 ,Bzigo,Mobile Application Developer (Swift + Kotlin/Java),Mobile,Developer,Android 
2896037353,2022-01-30 ,Bzigo,Mobile Application Developer (Swift + Kotlin/Java),Mobile,Developer,Java
2896037353,2022-01-30 ,Bzigo,Mobile Application Developer (Swift + Kotlin/Java),Mobile,Developer,Kotlin
2896037353,2022-01-30 ,Bzigo,Mobile Application Developer (Swift + Kotlin/Java),Mobile,Developer,Native
2911990209,2022-01-15 ,Pearson,Sr. Mobile Developer,Mobile,Developer,Android 
2911990209,2022-01-15 ,Pearson,Sr. Mobile Developer,Mobile,Developer,Design
2911990209,2022-01-15 ,Pearson,Sr. Mobile Developer,Mobile,Developer,Google
2911990209,2022-01-15 ,Pearson,Sr. Mobile Developer,Mobile,Developer,Native
2911990209,2022-01-15 ,Pearson,Sr. Mobile Developer,Mobile,Sr,Android 
2911990209,2022-01-15 ,Pearson,Sr. Mobile Developer,Mobile,Sr,Design
2911990209,2022-01-15 ,Pearson,Sr. Mobile Developer,Mobile,Sr,Google
2911990209,2022-01-15 ,Pearson,Sr. Mobile Developer,Mobile,Sr,Native
2877761934,2022-02-13 ,Gotfriends,Mobile Developer,Mobile,Engineer,Android 
2877761934,2022-02-13 ,Gotfriends,Mobile Developer,Mobile,Engineer,Design
2877761934,2022-02-13 ,Gotfriends,Mobile Developer,Mobile,Engineer,Java
2877761934,2022-02-13 ,Gotfriends,Mobile Developer,Mobile,Engineer,Kotlin
2877761934,2022-02-13 ,Gotfriends,Mobile Developer,Mobile,Senior,Android 
2877761934,2022-02-13 ,Gotfriends,Mobile Developer,Mobile,Senior,Design
2877761934,2022-02-13 ,Gotfriends,Mobile Developer,Mobile,Senior,Java
2877761934,2022-02-13 ,Gotfriends,Mobile Developer,Mobile,Senior,Kotlin
2910670079,2022-02-10 ,SciPlay,Unity Mobile Developer,Mobile,Developer,Design
2910670079,2022-02-10 ,SciPlay,Unity Mobile Developer,Mobile,Developer,Native
2910670079,2022-02-10 ,SciPlay,Unity Mobile Developer,Mobile,Developer,OOP
2910670079,2022-02-10 ,SciPlay,Unity Mobile Developer,Mobile,Engineer,Design
2910670079,2022-02-10 ,SciPlay,Unity Mobile Developer,Mobile,Engineer,Native
2910670079,2022-02-10 ,SciPlay,Unity Mobile Developer,Mobile,Engineer,OOP
2884541101,2022-02-10 ,General Motors,Junior Android Developer,Mobile,Developer,Android 
2884541101,2022-02-10 ,General Motors,Junior Android Developer,Mobile,Developer,Architecture
2884541101,2022-02-10 ,General Motors,Junior Android Developer,Mobile,Developer,Architecture
2884541101,2022-02-10 ,General Motors,Junior Android Developer,Mobile,Developer,Design
2884541101,2022-02-10 ,General Motors,Junior Android Developer,Mobile,Developer,Java
2884541101,2022-02-10 ,General Motors,Junior Android Developer,Mobile,Developer,Kotlin
2884541101,2022-02-10 ,General Motors,Junior Android Developer,Mobile,Developer,Management
2884541101,2022-02-10 ,General Motors,Junior Android Developer,Mobile,Developer,Native
2884541101,2022-02-10 ,General Motors,Junior Android Developer,Mobile,Developer,React
2780868756,2021-11-02 ,Avo,Mobile Developer,Mobile,Developer,Custom
2780868756,2021-11-02 ,Avo,Mobile Developer,Mobile,Developer,Dart
2780868756,2021-11-02 ,Avo,Mobile Developer,Mobile,Developer,Design
2780868756,2021-11-02 ,Avo,Mobile Developer,Mobile,Developer,Flutter
2780868756,2021-11-02 ,Avo,Mobile Developer,Mobile,Developer,UI 
2861050738,2021-12-10 ,Fireblocks,Mobile Engineer,Mobile,Developer,Android 
2861050738,2021-12-10 ,Fireblocks,Mobile Engineer,Mobile,Developer,Architecture
2861050738,2021-12-10 ,Fireblocks,Mobile Engineer,Mobile,Developer,Architecture
2861050738,2021-12-10 ,Fireblocks,Mobile Engineer,Mobile,Developer,Design
2861050738,2021-12-10 ,Fireblocks,Mobile Engineer,Mobile,Developer,Google
2861050738,2021-12-10 ,Fireblocks,Mobile Engineer,Mobile,Developer,Kotlin
2817430923,2021-11-03 ,Optimove,Mobile Developer,Mobile,Architect,Android 
2817430923,2021-11-03 ,Optimove,Mobile Developer,Mobile,Architect,Dependency
2817430923,2021-11-03 ,Optimove,Mobile Developer,Mobile,Architect,Design
2817430923,2021-11-03 ,Optimove,Mobile Developer,Mobile,Architect,Java
2817430923,2021-11-03 ,Optimove,Mobile Developer,Mobile,Architect,Model
2817430923,2021-11-03 ,Optimove,Mobile Developer,Mobile,Architect,Multithreading
2817430923,2021-11-03 ,Optimove,Mobile Developer,Mobile,Architect,Native
2817430923,2021-11-03 ,Optimove,Mobile Developer,Mobile,Developer,Android 
2817430923,2021-11-03 ,Optimove,Mobile Developer,Mobile,Developer,Dependency
2817430923,2021-11-03 ,Optimove,Mobile Developer,Mobile,Developer,Design
2817430923,2021-11-03 ,Optimove,Mobile Developer,Mobile,Developer,Java
2817430923,2021-11-03 ,Optimove,Mobile Developer,Mobile,Developer,Model
2817430923,2021-11-03 ,Optimove,Mobile Developer,Mobile,Developer,Multithreading
2817430923,2021-11-03 ,Optimove,Mobile Developer,Mobile,Developer,Native
2884981050,2022-01-20 ,Aquant,Mobile Tech Lead,Mobile,Tech Lead,Android 
2884981050,2022-01-20 ,Aquant,Mobile Tech Lead,Mobile,Tech Lead,Java
2884981050,2022-01-20 ,Aquant,Mobile Tech Lead,Mobile,Tech Lead,Kotlin
2884981050,2022-01-20 ,Aquant,Mobile Tech Lead,Mobile,Tech Lead,Model
2884981050,2022-01-20 ,Aquant,Mobile Tech Lead,Mobile,Tech Lead,Native
2884981050,2022-01-20 ,Aquant,Mobile Tech Lead,Mobile,Tech Lead,React
2884981050,2022-01-20 ,Aquant,Mobile Tech Lead,Mobile,Tech Lead,SOLID
2909161527,2022-01-13 ,Augury,Mobile Developer,Mobile,Developer,Architecture
2909161527,2022-01-13 ,Augury,Mobile Developer,Mobile,Developer,Architecture
2909161527,2022-01-13 ,Augury,Mobile Developer,Mobile,Developer,Design
2909161527,2022-01-13 ,Augury,Mobile Developer,Mobile,Developer,Gradle
2909161527,2022-01-13 ,Augury,Mobile Developer,Mobile,Developer,IOT
2909161527,2022-01-13 ,Augury,Mobile Developer,Mobile,Developer,Java
2909161527,2022-01-13 ,Augury,Mobile Developer,Mobile,Developer,Kotlin
2890424100,2022-01-24 ,Aquant,Mobile Tech Lead,Mobile,Tech Lead,Android 
2890424100,2022-01-24 ,Aquant,Mobile Tech Lead,Mobile,Tech Lead,Design
2890424100,2022-01-24 ,Aquant,Mobile Tech Lead,Mobile,Tech Lead,Java
2890424100,2022-01-24 ,Aquant,Mobile Tech Lead,Mobile,Tech Lead,Kotlin
2890424100,2022-01-24 ,Aquant,Mobile Tech Lead,Mobile,Tech Lead,Model
2890424100,2022-01-24 ,Aquant,Mobile Tech Lead,Mobile,Tech Lead,Native
2890424100,2022-01-24 ,Aquant,Mobile Tech Lead,Mobile,Tech Lead,React
2890424100,2022-01-24 ,Aquant,Mobile Tech Lead,Mobile,Tech Lead,SOLID
2916908747,2022-01-18 ,Aquant,Mobile Developer,Mobile,Developer,Android 
2916908747,2022-01-18 ,Aquant,Mobile Developer,Mobile,Developer,Design
2916908747,2022-01-18 ,Aquant,Mobile Developer,Mobile,Developer,Gradle
2916908747,2022-01-18 ,Aquant,Mobile Developer,Mobile,Developer,Native
2916908747,2022-01-18 ,Aquant,Mobile Developer,Mobile,Developer,React
2916908747,2022-01-18 ,Aquant,Mobile Developer,Mobile,Developer,SOLID
2910574599,2022-01-14 ,OpenWeb,Mobile Engineer,Mobile,Engineer,Android 
2910574599,2022-01-14 ,OpenWeb,Mobile Engineer,Mobile,Engineer,Custom
2910574599,2022-01-14 ,OpenWeb,Mobile Engineer,Mobile,Engineer,Design
2910574599,2022-01-14 ,OpenWeb,Mobile Engineer,Mobile,Engineer,Kotlin
2910574599,2022-01-14 ,OpenWeb,Mobile Engineer,Mobile,Engineer,Native
2910574599,2022-01-14 ,OpenWeb,Mobile Engineer,Mobile,Engineer,UI 
2743917678,2021-10-10 ,Ryde - Outsmart Mobility,Senior Mobile Application Developer,Mobile,Developer,Android 
2743917678,2021-10-10 ,Ryde - Outsmart Mobility,Senior Mobile Application Developer,Mobile,Developer,Design
2743917678,2021-10-10 ,Ryde - Outsmart Mobility,Senior Mobile Application Developer,Mobile,Developer,OOP
2743917678,2021-10-10 ,Ryde - Outsmart Mobility,Senior Mobile Application Developer,Mobile,Developer,UI 
2911609046,2022-02-07 ,Wixcom,Senior Mobile Developer,Mobile,Developer,Google
2911609046,2022-02-07 ,Wixcom,Senior Mobile Developer,Mobile,Developer,Native
2911609046,2022-02-07 ,Wixcom,Senior Mobile Developer,Mobile,Developer,React
2911609046,2022-02-07 ,Wixcom,Senior Mobile Developer,Mobile,Senior,Google
2911609046,2022-02-07 ,Wixcom,Senior Mobile Developer,Mobile,Senior,Native
2911609046,2022-02-07 ,Wixcom,Senior Mobile Developer,Mobile,Senior,React
2817430923,2021-11-03 ,Optimove,Mobile Developer,Mobile,Architect,Android 
2817430923,2021-11-03 ,Optimove,Mobile Developer,Mobile,Architect,Dependency
2817430923,2021-11-03 ,Optimove,Mobile Developer,Mobile,Architect,Design
2817430923,2021-11-03 ,Optimove,Mobile Developer,Mobile,Architect,Java
2817430923,2021-11-03 ,Optimove,Mobile Developer,Mobile,Architect,Model
2817430923,2021-11-03 ,Optimove,Mobile Developer,Mobile,Architect,Multithreading
2817430923,2021-11-03 ,Optimove,Mobile Developer,Mobile,Architect,Native
2817430923,2021-11-03 ,Optimove,Mobile Developer,Mobile,Developer,Android 
2817430923,2021-11-03 ,Optimove,Mobile Developer,Mobile,Developer,Dependency
2817430923,2021-11-03 ,Optimove,Mobile Developer,Mobile,Developer,Design
2817430923,2021-11-03 ,Optimove,Mobile Developer,Mobile,Developer,Java
2817430923,2021-11-03 ,Optimove,Mobile Developer,Mobile,Developer,Model
2817430923,2021-11-03 ,Optimove,Mobile Developer,Mobile,Developer,Multithreading
2817430923,2021-11-03 ,Optimove,Mobile Developer,Mobile,Developer,Native
2910670079,2022-02-10 ,SciPlay,Unity Mobile Developer,Mobile,Developer,Design
2910670079,2022-02-10 ,SciPlay,Unity Mobile Developer,Mobile,Developer,Native
2910670079,2022-02-10 ,SciPlay,Unity Mobile Developer,Mobile,Developer,OOP
2910670079,2022-02-10 ,SciPlay,Unity Mobile Developer,Mobile,Engineer,Design
2910670079,2022-02-10 ,SciPlay,Unity Mobile Developer,Mobile,Engineer,Native
2910670079,2022-02-10 ,SciPlay,Unity Mobile Developer,Mobile,Engineer,OOP
2903822268,2022-02-03 ,Grubhub,Android Developer,Mobile,Engineer,Android 
2903822268,2022-02-03 ,Grubhub,Android Developer,Mobile,Engineer,Architecture
2903822268,2022-02-03 ,Grubhub,Android Developer,Mobile,Engineer,Architecture
2903822268,2022-02-03 ,Grubhub,Android Developer,Mobile,Engineer,Dagger
2903822268,2022-02-03 ,Grubhub,Android Developer,Mobile,Engineer,Design
2903822268,2022-02-03 ,Grubhub,Android Developer,Mobile,Engineer,Java
2903822268,2022-02-03 ,Grubhub,Android Developer,Mobile,Engineer,JetPack
2903822268,2022-02-03 ,Grubhub,Android Developer,Mobile,Engineer,Kotlin
2880993747,2021-12-23 ,Nanit,Android Developer,Mobile,Developer,Android 
2880993747,2021-12-23 ,Nanit,Android Developer,Mobile,Developer,Design
2880993747,2021-12-23 ,Nanit,Android Developer,Mobile,Developer,Kotlin
2880993747,2021-12-23 ,Nanit,Android Developer,Mobile,Developer,Native
2880993747,2021-12-23 ,Nanit,Android Developer,Mobile,Developer,OOP
2880993747,2021-12-23 ,Nanit,Android Developer,Mobile,Developer,UI 
2916908747,2022-01-18 ,Aquant,Mobile Developer,Mobile,Developer,Android 
2916908747,2022-01-18 ,Aquant,Mobile Developer,Mobile,Developer,Design
2916908747,2022-01-18 ,Aquant,Mobile Developer,Mobile,Developer,Gradle
2916908747,2022-01-18 ,Aquant,Mobile Developer,Mobile,Developer,Native
2916908747,2022-01-18 ,Aquant,Mobile Developer,Mobile,Developer,React
2916908747,2022-01-18 ,Aquant,Mobile Developer,Mobile,Developer,SOLID
2890424100,2022-01-24 ,Aquant,Mobile Tech Lead,Mobile,Tech Lead,Android 
2890424100,2022-01-24 ,Aquant,Mobile Tech Lead,Mobile,Tech Lead,Design
2890424100,2022-01-24 ,Aquant,Mobile Tech Lead,Mobile,Tech Lead,Java
2890424100,2022-01-24 ,Aquant,Mobile Tech Lead,Mobile,Tech Lead,Kotlin
2890424100,2022-01-24 ,Aquant,Mobile Tech Lead,Mobile,Tech Lead,Model
2890424100,2022-01-24 ,Aquant,Mobile Tech Lead,Mobile,Tech Lead,Native
2890424100,2022-01-24 ,Aquant,Mobile Tech Lead,Mobile,Tech Lead,React
2890424100,2022-01-24 ,Aquant,Mobile Tech Lead,Mobile,Tech Lead,SOLID
2903134310,2022-02-01 ,200apps,Android Developer,Mobile,Developer,Android 
2903134310,2022-02-01 ,200apps,Android Developer,Mobile,Developer,Flutter
2903134310,2022-02-01 ,200apps,Android Developer,Mobile,Developer,Java
2903134310,2022-02-01 ,200apps,Android Developer,Mobile,Developer,Kotlin
2903822268,2022-02-03 ,Grubhub,Android Developer,Mobile,Engineer,Android 
2903822268,2022-02-03 ,Grubhub,Android Developer,Mobile,Engineer,Architecture
2903822268,2022-02-03 ,Grubhub,Android Developer,Mobile,Engineer,Architecture
2903822268,2022-02-03 ,Grubhub,Android Developer,Mobile,Engineer,Dagger
2903822268,2022-02-03 ,Grubhub,Android Developer,Mobile,Engineer,Design
2903822268,2022-02-03 ,Grubhub,Android Developer,Mobile,Engineer,Java
2903822268,2022-02-03 ,Grubhub,Android Developer,Mobile,Engineer,JetPack
2903822268,2022-02-03 ,Grubhub,Android Developer,Mobile,Engineer,Kotlin
2916908747,2022-01-18 ,Aquant,Mobile Developer,Mobile,Developer,Android 
2916908747,2022-01-18 ,Aquant,Mobile Developer,Mobile,Developer,Design
2916908747,2022-01-18 ,Aquant,Mobile Developer,Mobile,Developer,Gradle
2916908747,2022-01-18 ,Aquant,Mobile Developer,Mobile,Developer,Native
2916908747,2022-01-18 ,Aquant,Mobile Developer,Mobile,Developer,React
2916908747,2022-01-18 ,Aquant,Mobile Developer,Mobile,Developer,SOLID
2909161527,2022-01-13 ,Augury,Mobile Developer,Mobile,Developer,Architecture
2909161527,2022-01-13 ,Augury,Mobile Developer,Mobile,Developer,Architecture
2909161527,2022-01-13 ,Augury,Mobile Developer,Mobile,Developer,Design
2909161527,2022-01-13 ,Augury,Mobile Developer,Mobile,Developer,Gradle
2909161527,2022-01-13 ,Augury,Mobile Developer,Mobile,Developer,IOT
2909161527,2022-01-13 ,Augury,Mobile Developer,Mobile,Developer,Java
2909161527,2022-01-13 ,Augury,Mobile Developer,Mobile,Developer,Kotlin
2905362753,2022-01-10 ,ONE ZERO - Digital Bank,Android Developer,Mobile,Developer,Android 
2905362753,2022-01-10 ,ONE ZERO - Digital Bank,Android Developer,Mobile,Developer,Architecture
2905362753,2022-01-10 ,ONE ZERO - Digital Bank,Android Developer,Mobile,Developer,Architecture
2905362753,2022-01-10 ,ONE ZERO - Digital Bank,Android Developer,Mobile,Developer,Components
2905362753,2022-01-10 ,ONE ZERO - Digital Bank,Android Developer,Mobile,Developer,Coroutines
2905362753,2022-01-10 ,ONE ZERO - Digital Bank,Android Developer,Mobile,Developer,Design
2905362753,2022-01-10 ,ONE ZERO - Digital Bank,Android Developer,Mobile,Developer,Kotlin
2905362753,2022-01-10 ,ONE ZERO - Digital Bank,Android Developer,Mobile,Developer,MVVM
2905362753,2022-01-10 ,ONE ZERO - Digital Bank,Android Developer,Mobile,Developer,UI 
2878404873,2021-12-19 ,Houzz,Android Engineer,Mobile,Engineer,Android 
2878404873,2021-12-19 ,Houzz,Android Engineer,Mobile,Engineer,Components
2878404873,2021-12-19 ,Houzz,Android Engineer,Mobile,Engineer,Design
2878404873,2021-12-19 ,Houzz,Android Engineer,Mobile,Engineer,Kotlin
2878404873,2021-12-19 ,Houzz,Android Engineer,Mobile,Engineer,State
2878404873,2021-12-19 ,Houzz,Android Engineer,Mobile,Engineer,View
2780868756,2021-11-02 ,Avo,Mobile Developer,Mobile,Developer,Custom
2780868756,2021-11-02 ,Avo,Mobile Developer,Mobile,Developer,Dart
2780868756,2021-11-02 ,Avo,Mobile Developer,Mobile,Developer,Design
2780868756,2021-11-02 ,Avo,Mobile Developer,Mobile,Developer,Flutter
2780868756,2021-11-02 ,Avo,Mobile Developer,Mobile,Developer,UI 
2878404873,2021-12-19 ,Houzz,Android Engineer,Mobile,Engineer,Android 
2878404873,2021-12-19 ,Houzz,Android Engineer,Mobile,Engineer,Components
2878404873,2021-12-19 ,Houzz,Android Engineer,Mobile,Engineer,Design
2878404873,2021-12-19 ,Houzz,Android Engineer,Mobile,Engineer,Kotlin
2878404873,2021-12-19 ,Houzz,Android Engineer,Mobile,Engineer,State
2878404873,2021-12-19 ,Houzz,Android Engineer,Mobile,Engineer,View
2819275235,2021-11-05 ,Medallia,Hybrid Mobile Developer,Mobile,Developer,Android 
2819275235,2021-11-05 ,Medallia,Hybrid Mobile Developer,Mobile,Developer,Design
2819275235,2021-11-05 ,Medallia,Hybrid Mobile Developer,Mobile,Developer,Flutter
2819275235,2021-11-05 ,Medallia,Hybrid Mobile Developer,Mobile,Developer,Gradle
2819275235,2021-11-05 ,Medallia,Hybrid Mobile Developer,Mobile,Developer,MVP
2819275235,2021-11-05 ,Medallia,Hybrid Mobile Developer,Mobile,Developer,MVVM
2819275235,2021-11-05 ,Medallia,Hybrid Mobile Developer,Mobile,Developer,Management
2819275235,2021-11-05 ,Medallia,Hybrid Mobile Developer,Mobile,Developer,Native
2819275235,2021-11-05 ,Medallia,Hybrid Mobile Developer,Mobile,Developer,React
2877386111,2022-02-07 ,Taboola,Android Engineer- Supply,Mobile,Developer,Android 
2877386111,2022-02-07 ,Taboola,Android Engineer- Supply,Mobile,Developer,Dart
2877386111,2022-02-07 ,Taboola,Android Engineer- Supply,Mobile,Developer,Dependency
2877386111,2022-02-07 ,Taboola,Android Engineer- Supply,Mobile,Developer,Design
2877386111,2022-02-07 ,Taboola,Android Engineer- Supply,Mobile,Developer,Google
2877386111,2022-02-07 ,Taboola,Android Engineer- Supply,Mobile,Developer,Gradle
2877386111,2022-02-07 ,Taboola,Android Engineer- Supply,Mobile,Developer,Injection
2877386111,2022-02-07 ,Taboola,Android Engineer- Supply,Mobile,Developer,Kotlin
2877386111,2022-02-07 ,Taboola,Android Engineer- Supply,Mobile,Developer,Model
2877386111,2022-02-07 ,Taboola,Android Engineer- Supply,Mobile,Developer,Native
2877386111,2022-02-07 ,Taboola,Android Engineer- Supply,Mobile,Developer,OOP
2877386111,2022-02-07 ,Taboola,Android Engineer- Supply,Mobile,Developer,React
2894745570,2022-01-27 ,Salesforce,Android Developer,Mobile,Engineer,Android 
2894745570,2022-01-27 ,Salesforce,Android Developer,Mobile,Engineer,Architecture
2894745570,2022-01-27 ,Salesforce,Android Developer,Mobile,Engineer,Architecture
2894745570,2022-01-27 ,Salesforce,Android Developer,Mobile,Engineer,Components
2894745570,2022-01-27 ,Salesforce,Android Developer,Mobile,Engineer,Dependency
2894745570,2022-01-27 ,Salesforce,Android Developer,Mobile,Engineer,Design
2894745570,2022-01-27 ,Salesforce,Android Developer,Mobile,Engineer,Injection
2894745570,2022-01-27 ,Salesforce,Android Developer,Mobile,Engineer,Java
2894745570,2022-01-27 ,Salesforce,Android Developer,Mobile,Engineer,Kotlin
2894745570,2022-01-27 ,Salesforce,Android Developer,Mobile,Engineer,Model
2894745570,2022-01-27 ,Salesforce,Android Developer,Mobile,Engineer,Native
2894745570,2022-01-27 ,Salesforce,Android Developer,Mobile,Engineer,React
2894745570,2022-01-27 ,Salesforce,Android Developer,Mobile,Engineer,State
2916158699,2022-02-09 ,anywell,Senior mobile developer,Mobile,Developer,Components
2916158699,2022-02-09 ,anywell,Senior mobile developer,Mobile,Developer,Native
2916158699,2022-02-09 ,anywell,Senior mobile developer,Mobile,Developer,React
2874019874,2022-01-12 ,Intel Corporation,Software Application Engineer: Internet of Things (m/f/d),Mobile,Developer,Architecture
2874019874,2022-01-12 ,Intel Corporation,Software Application Engineer: Internet of Things (m/f/d),Mobile,Developer,Architecture
2874019874,2022-01-12 ,Intel Corporation,Software Application Engineer: Internet of Things (m/f/d),Mobile,Developer,IOT
2874019874,2022-01-12 ,Intel Corporation,Software Application Engineer: Internet of Things (m/f/d),Mobile,Developer,Management
2874019874,2022-01-12 ,Intel Corporation,Software Application Engineer: Internet of Things (m/f/d),Mobile,Developer,TensorFlow
2874019874,2022-01-12 ,Intel Corporation,Software Application Engineer: Internet of Things (m/f/d),Mobile,Engineer,Architecture
2874019874,2022-01-12 ,Intel Corporation,Software Application Engineer: Internet of Things (m/f/d),Mobile,Engineer,Architecture
2874019874,2022-01-12 ,Intel Corporation,Software Application Engineer: Internet of Things (m/f/d),Mobile,Engineer,IOT
2874019874,2022-01-12 ,Intel Corporation,Software Application Engineer: Internet of Things (m/f/d),Mobile,Engineer,Management
2874019874,2022-01-12 ,Intel Corporation,Software Application Engineer: Internet of Things (m/f/d),Mobile,Engineer,TensorFlow
2902025638,2022-01-07 ,Shutterfly,Sr. Manager,Mobile,Sr,Components
2902025638,2022-01-07 ,Shutterfly,Sr. Manager,Mobile,Sr,Java
2902025638,2022-01-07 ,Shutterfly,Sr. Manager,Mobile,Sr,ML
2902025638,2022-01-07 ,Shutterfly,Sr. Manager,Mobile,Sr,Native
2902025638,2022-01-07 ,Shutterfly,Sr. Manager,Mobile,Sr,React
2902025638,2022-01-07 ,Shutterfly,Sr. Manager,Mobile,Sr,State
2793121430,2021-11-10 ,Cyrus,Senior Mobile Developer,Mobile,Developer,Android 
2793121430,2021-11-10 ,Cyrus,Senior Mobile Developer,Mobile,Developer,Design
2793121430,2021-11-10 ,Cyrus,Senior Mobile Developer,Mobile,Developer,Native
2793121430,2021-11-10 ,Cyrus,Senior Mobile Developer,Mobile,Developer,React
2793121430,2021-11-10 ,Cyrus,Senior Mobile Developer,Mobile,Developer,UI 
2903822268,2022-02-03 ,Grubhub,Android Developer,Mobile,Engineer,Android 
2903822268,2022-02-03 ,Grubhub,Android Developer,Mobile,Engineer,Architecture
2903822268,2022-02-03 ,Grubhub,Android Developer,Mobile,Engineer,Architecture
2903822268,2022-02-03 ,Grubhub,Android Developer,Mobile,Engineer,Dagger
2903822268,2022-02-03 ,Grubhub,Android Developer,Mobile,Engineer,Design
2903822268,2022-02-03 ,Grubhub,Android Developer,Mobile,Engineer,Java
2903822268,2022-02-03 ,Grubhub,Android Developer,Mobile,Engineer,JetPack
2903822268,2022-02-03 ,Grubhub,Android Developer,Mobile,Engineer,Kotlin
2758295134,2022-02-03 ,Similarweb,Principal Mobile Developer,Mobile,Developer,Android 
2758295134,2022-02-03 ,Similarweb,Principal Mobile Developer,Mobile,Developer,DI
2758295134,2022-02-03 ,Similarweb,Principal Mobile Developer,Mobile,Developer,Design
2758295134,2022-02-03 ,Similarweb,Principal Mobile Developer,Mobile,Developer,Google
2758295134,2022-02-03 ,Similarweb,Principal Mobile Developer,Mobile,Developer,Java
2758295134,2022-02-03 ,Similarweb,Principal Mobile Developer,Mobile,Developer,Kotlin
2758295134,2022-02-03 ,Similarweb,Principal Mobile Developer,Mobile,Developer,Model
2880796495,2022-01-19 ,ironSource,Android Developer,Mobile,Developer,Android 
2880796495,2022-01-19 ,ironSource,Android Developer,Mobile,Developer,Kotlin
2880796495,2022-01-19 ,ironSource,Android Developer,Mobile,Developer,Multithreading
2880796495,2022-01-19 ,ironSource,Android Developer,Mobile,Developer,Native
2880796495,2022-01-19 ,ironSource,Android Developer,Mobile,Developer,OOP
2897929657,2022-01-26 ,Check Point Software Technologies Ltd,Android Developer,Mobile,Developer,Android 
2897929657,2022-01-26 ,Check Point Software Technologies Ltd,Android Developer,Mobile,Developer,Design
2897929657,2022-01-26 ,Check Point Software Technologies Ltd,Android Developer,Mobile,Developer,SOLID
2897929657,2022-01-26 ,Check Point Software Technologies Ltd,Android Developer,Mobile,Senior,Android 
2897929657,2022-01-26 ,Check Point Software Technologies Ltd,Android Developer,Mobile,Senior,Design
2897929657,2022-01-26 ,Check Point Software Technologies Ltd,Android Developer,Mobile,Senior,SOLID
2816046044,2022-01-24 ,Aidoc Medical,Senior Mobile Engineer,Mobile,Senior,Components
2816046044,2022-01-24 ,Aidoc Medical,Senior Mobile Engineer,Mobile,Senior,Design
2816046044,2022-01-24 ,Aidoc Medical,Senior Mobile Engineer,Mobile,Senior,Native
2816046044,2022-01-24 ,Aidoc Medical,Senior Mobile Engineer,Mobile,Senior,Storage
2816046044,2022-01-24 ,Aidoc Medical,Senior Mobile Engineer,Mobile,Tech Lead,Components
2816046044,2022-01-24 ,Aidoc Medical,Senior Mobile Engineer,Mobile,Tech Lead,Design
2816046044,2022-01-24 ,Aidoc Medical,Senior Mobile Engineer,Mobile,Tech Lead,Native
2816046044,2022-01-24 ,Aidoc Medical,Senior Mobile Engineer,Mobile,Tech Lead,Storage
2880993747,2021-12-23 ,Nanit,Android Developer,Mobile,Developer,Android 
2880993747,2021-12-23 ,Nanit,Android Developer,Mobile,Developer,Design
2880993747,2021-12-23 ,Nanit,Android Developer,Mobile,Developer,Kotlin
2880993747,2021-12-23 ,Nanit,Android Developer,Mobile,Developer,Native
2880993747,2021-12-23 ,Nanit,Android Developer,Mobile,Developer,OOP
2880993747,2021-12-23 ,Nanit,Android Developer,Mobile,Developer,UI 
2871755326,2022-02-06 ,Fundbox,Senior Mobile Engineer (JavaScript),Mobile,Developer,Android 
2871755326,2022-02-06 ,Fundbox,Senior Mobile Engineer (JavaScript),Mobile,Developer,Components
2871755326,2022-02-06 ,Fundbox,Senior Mobile Engineer (JavaScript),Mobile,Developer,Design
2871755326,2022-02-06 ,Fundbox,Senior Mobile Engineer (JavaScript),Mobile,Developer,Native
2871755326,2022-02-06 ,Fundbox,Senior Mobile Engineer (JavaScript),Mobile,Developer,React
2871755326,2022-02-06 ,Fundbox,Senior Mobile Engineer (JavaScript),Mobile,Senior,Android 
2871755326,2022-02-06 ,Fundbox,Senior Mobile Engineer (JavaScript),Mobile,Senior,Components
2871755326,2022-02-06 ,Fundbox,Senior Mobile Engineer (JavaScript),Mobile,Senior,Design
2871755326,2022-02-06 ,Fundbox,Senior Mobile Engineer (JavaScript),Mobile,Senior,Native
2871755326,2022-02-06 ,Fundbox,Senior Mobile Engineer (JavaScript),Mobile,Senior,React
2877386111,2022-02-07 ,Taboola,Android Engineer- Supply,Mobile,Developer,Android 
2877386111,2022-02-07 ,Taboola,Android Engineer- Supply,Mobile,Developer,Dart
2877386111,2022-02-07 ,Taboola,Android Engineer- Supply,Mobile,Developer,Dependency
2877386111,2022-02-07 ,Taboola,Android Engineer- Supply,Mobile,Developer,Design
2877386111,2022-02-07 ,Taboola,Android Engineer- Supply,Mobile,Developer,Google
2877386111,2022-02-07 ,Taboola,Android Engineer- Supply,Mobile,Developer,Gradle
2877386111,2022-02-07 ,Taboola,Android Engineer- Supply,Mobile,Developer,Injection
2877386111,2022-02-07 ,Taboola,Android Engineer- Supply,Mobile,Developer,Kotlin
2877386111,2022-02-07 ,Taboola,Android Engineer- Supply,Mobile,Developer,Model
2877386111,2022-02-07 ,Taboola,Android Engineer- Supply,Mobile,Developer,Native
2877386111,2022-02-07 ,Taboola,Android Engineer- Supply,Mobile,Developer,OOP
2877386111,2022-02-07 ,Taboola,Android Engineer- Supply,Mobile,Developer,React
2727067040,2021-09-23 ,BelongLife,Android Developer,Mobile,Developer,Android 
2727067040,2021-09-23 ,BelongLife,Android Developer,Mobile,Developer,Design
2727067040,2021-09-23 ,BelongLife,Android Developer,Mobile,Developer,Java
2727067040,2021-09-23 ,BelongLife,Android Developer,Mobile,Developer,Kotlin
2727067040,2021-09-23 ,BelongLife,Android Developer,Mobile,Developer,OOP
2727067040,2021-09-23 ,BelongLife,Android Developer,Mobile,Developer,Room
2727067040,2021-09-23 ,BelongLife,Android Developer,Mobile,Developer,UI 
2880993747,2021-12-23 ,Nanit,Android Developer,Mobile,Developer,Android 
2880993747,2021-12-23 ,Nanit,Android Developer,Mobile,Developer,Design
2880993747,2021-12-23 ,Nanit,Android Developer,Mobile,Developer,Kotlin
2880993747,2021-12-23 ,Nanit,Android Developer,Mobile,Developer,Native
2880993747,2021-12-23 ,Nanit,Android Developer,Mobile,Developer,OOP
2880993747,2021-12-23 ,Nanit,Android Developer,Mobile,Developer,UI 
2755396404,2021-10-17 ,BlazePod,Senior Android Developer,Mobile,Developer,BLE
2755396404,2021-10-17 ,BlazePod,Senior Android Developer,Mobile,Developer,IOT
2755396404,2021-10-17 ,BlazePod,Senior Android Developer,Mobile,Developer,Java
2755396404,2021-10-17 ,BlazePod,Senior Android Developer,Mobile,Developer,Kotlin
2755396404,2021-10-17 ,BlazePod,Senior Android Developer,Mobile,Developer,Native
2837778234,2022-02-09 ,Plus500â¢,Android Developer,Mobile,Engineer,Android 
2837778234,2022-02-09 ,Plus500â¢,Android Developer,Mobile,Engineer,Architecture
2837778234,2022-02-09 ,Plus500â¢,Android Developer,Mobile,Engineer,Architecture
2837778234,2022-02-09 ,Plus500â¢,Android Developer,Mobile,Engineer,Components
2837778234,2022-02-09 ,Plus500â¢,Android Developer,Mobile,Engineer,Coroutines
2837778234,2022-02-09 ,Plus500â¢,Android Developer,Mobile,Engineer,Design
2837778234,2022-02-09 ,Plus500â¢,Android Developer,Mobile,Engineer,Java
2837778234,2022-02-09 ,Plus500â¢,Android Developer,Mobile,Engineer,Kotlin
2837778234,2022-02-09 ,Plus500â¢,Android Developer,Mobile,Engineer,MVP
2837778234,2022-02-09 ,Plus500â¢,Android Developer,Mobile,Engineer,MVVM
2837778234,2022-02-09 ,Plus500â¢,Android Developer,Mobile,Engineer,Model
2837778234,2022-02-09 ,Plus500â¢,Android Developer,Mobile,Engineer,Native
2837778234,2022-02-09 ,Plus500â¢,Android Developer,Mobile,Tech Lead,Android 
2837778234,2022-02-09 ,Plus500â¢,Android Developer,Mobile,Tech Lead,Architecture
2837778234,2022-02-09 ,Plus500â¢,Android Developer,Mobile,Tech Lead,Architecture
2837778234,2022-02-09 ,Plus500â¢,Android Developer,Mobile,Tech Lead,Components
2837778234,2022-02-09 ,Plus500â¢,Android Developer,Mobile,Tech Lead,Coroutines
2837778234,2022-02-09 ,Plus500â¢,Android Developer,Mobile,Tech Lead,Design
2837778234,2022-02-09 ,Plus500â¢,Android Developer,Mobile,Tech Lead,Java
2837778234,2022-02-09 ,Plus500â¢,Android Developer,Mobile,Tech Lead,Kotlin
2837778234,2022-02-09 ,Plus500â¢,Android Developer,Mobile,Tech Lead,MVP
2837778234,2022-02-09 ,Plus500â¢,Android Developer,Mobile,Tech Lead,MVVM
2837778234,2022-02-09 ,Plus500â¢,Android Developer,Mobile,Tech Lead,Model
2837778234,2022-02-09 ,Plus500â¢,Android Developer,Mobile,Tech Lead,Native
2910670079,2022-02-10 ,SciPlay,Unity Mobile Developer,Mobile,Developer,Design
2910670079,2022-02-10 ,SciPlay,Unity Mobile Developer,Mobile,Developer,Native
2910670079,2022-02-10 ,SciPlay,Unity Mobile Developer,Mobile,Developer,OOP
2910670079,2022-02-10 ,SciPlay,Unity Mobile Developer,Mobile,Engineer,Design
2910670079,2022-02-10 ,SciPlay,Unity Mobile Developer,Mobile,Engineer,Native
2910670079,2022-02-10 ,SciPlay,Unity Mobile Developer,Mobile,Engineer,OOP
2897929657,2022-01-26 ,Check Point Software Technologies Ltd,Android Developer,Mobile,Developer,Android 
2897929657,2022-01-26 ,Check Point Software Technologies Ltd,Android Developer,Mobile,Developer,Design
2897929657,2022-01-26 ,Check Point Software Technologies Ltd,Android Developer,Mobile,Developer,SOLID
2897929657,2022-01-26 ,Check Point Software Technologies Ltd,Android Developer,Mobile,Senior,Android 
2897929657,2022-01-26 ,Check Point Software Technologies Ltd,Android Developer,Mobile,Senior,Design
2897929657,2022-01-26 ,Check Point Software Technologies Ltd,Android Developer,Mobile,Senior,SOLID
2816728826,2021-11-03 ,Riversidefm,Android developer,Mobile,Developer,Android 
2816728826,2021-11-03 ,Riversidefm,Android developer,Mobile,Developer,Java
2816728826,2021-11-03 ,Riversidefm,Android developer,Mobile,Developer,Kotlin
2816728826,2021-11-03 ,Riversidefm,Android developer,Mobile,Developer,Native
2816728826,2021-11-03 ,Riversidefm,Android developer,Mobile,Engineer,Android 
2816728826,2021-11-03 ,Riversidefm,Android developer,Mobile,Engineer,Java
2816728826,2021-11-03 ,Riversidefm,Android developer,Mobile,Engineer,Kotlin
2816728826,2021-11-03 ,Riversidefm,Android developer,Mobile,Engineer,Native
2913317104,2022-02-09 ,Trax Retail,Android Developer,Mobile,Developer,Android 
2913317104,2022-02-09 ,Trax Retail,Android Developer,Mobile,Developer,Architecture
2913317104,2022-02-09 ,Trax Retail,Android Developer,Mobile,Developer,Architecture
2913317104,2022-02-09 ,Trax Retail,Android Developer,Mobile,Developer,Components
2913317104,2022-02-09 ,Trax Retail,Android Developer,Mobile,Developer,Design
2913317104,2022-02-09 ,Trax Retail,Android Developer,Mobile,Developer,Flutter
2913317104,2022-02-09 ,Trax Retail,Android Developer,Mobile,Developer,Google
2913317104,2022-02-09 ,Trax Retail,Android Developer,Mobile,Developer,JetPack
2913317104,2022-02-09 ,Trax Retail,Android Developer,Mobile,Developer,Kotlin
2913317104,2022-02-09 ,Trax Retail,Android Developer,Mobile,Developer,ML
2913317104,2022-02-09 ,Trax Retail,Android Developer,Mobile,Developer,MVVM
2913317104,2022-02-09 ,Trax Retail,Android Developer,Mobile,Developer,Native
2913317104,2022-02-09 ,Trax Retail,Android Developer,Mobile,Developer,Persistent
2913317104,2022-02-09 ,Trax Retail,Android Developer,Mobile,Developer,TensorFlow
2918236376,2022-01-18 ,Gloat,Mobile Developer - React Native,Mobile,Engineer,Android 
2918236376,2022-01-18 ,Gloat,Mobile Developer - React Native,Mobile,Engineer,Architecture
2918236376,2022-01-18 ,Gloat,Mobile Developer - React Native,Mobile,Engineer,Architecture
2918236376,2022-01-18 ,Gloat,Mobile Developer - React Native,Mobile,Engineer,Design
2918236376,2022-01-18 ,Gloat,Mobile Developer - React Native,Mobile,Engineer,Google
2918236376,2022-01-18 ,Gloat,Mobile Developer - React Native,Mobile,Engineer,Management
2918236376,2022-01-18 ,Gloat,Mobile Developer - React Native,Mobile,Engineer,Native
2918236376,2022-01-18 ,Gloat,Mobile Developer - React Native,Mobile,Engineer,React
2918236376,2022-01-18 ,Gloat,Mobile Developer - React Native,Mobile,Engineer,Redux
2918236376,2022-01-18 ,Gloat,Mobile Developer - React Native,Mobile,Engineer,State
2918236376,2022-01-18 ,Gloat,Mobile Developer - React Native,Mobile,Engineer,UI 
2863900410,2022-01-27 ,General Motors,Senior Android Engineer,Mobile,Engineer,Android 
2863900410,2022-01-27 ,General Motors,Senior Android Engineer,Mobile,Engineer,Design
2863900410,2022-01-27 ,General Motors,Senior Android Engineer,Mobile,Engineer,Java
2863900410,2022-01-27 ,General Motors,Senior Android Engineer,Mobile,Engineer,Kotlin
2863900410,2022-01-27 ,General Motors,Senior Android Engineer,Mobile,Engineer,Management
2863900410,2022-01-27 ,General Motors,Senior Android Engineer,Mobile,Engineer,Multithreading
2863900410,2022-01-27 ,General Motors,Senior Android Engineer,Mobile,Engineer,UI 
2863900410,2022-01-27 ,General Motors,Senior Android Engineer,Mobile,Senior,Android 
2863900410,2022-01-27 ,General Motors,Senior Android Engineer,Mobile,Senior,Design
2863900410,2022-01-27 ,General Motors,Senior Android Engineer,Mobile,Senior,Java
2863900410,2022-01-27 ,General Motors,Senior Android Engineer,Mobile,Senior,Kotlin
2863900410,2022-01-27 ,General Motors,Senior Android Engineer,Mobile,Senior,Management
2863900410,2022-01-27 ,General Motors,Senior Android Engineer,Mobile,Senior,Multithreading
2863900410,2022-01-27 ,General Motors,Senior Android Engineer,Mobile,Senior,UI 
2900369068,2022-02-06 ,Applitools,Senior Android Developer,Mobile,Developer,Android 
2900369068,2022-02-06 ,Applitools,Senior Android Developer,Mobile,Developer,Architecture
2900369068,2022-02-06 ,Applitools,Senior Android Developer,Mobile,Developer,Architecture
2900369068,2022-02-06 ,Applitools,Senior Android Developer,Mobile,Developer,Java
2900369068,2022-02-06 ,Applitools,Senior Android Developer,Mobile,Developer,Kotlin
2900369068,2022-02-06 ,Applitools,Senior Android Developer,Mobile,Developer,UI 
2644819921,2022-02-03 ,Gloat,Senior Mobile Developer - React Native,Mobile,Engineer,Android 
2644819921,2022-02-03 ,Gloat,Senior Mobile Developer - React Native,Mobile,Engineer,Architecture
2644819921,2022-02-03 ,Gloat,Senior Mobile Developer - React Native,Mobile,Engineer,Architecture
2644819921,2022-02-03 ,Gloat,Senior Mobile Developer - React Native,Mobile,Engineer,Design
2644819921,2022-02-03 ,Gloat,Senior Mobile Developer - React Native,Mobile,Engineer,Google
2644819921,2022-02-03 ,Gloat,Senior Mobile Developer - React Native,Mobile,Engineer,Management
2644819921,2022-02-03 ,Gloat,Senior Mobile Developer - React Native,Mobile,Engineer,Native
2644819921,2022-02-03 ,Gloat,Senior Mobile Developer - React Native,Mobile,Engineer,React
2644819921,2022-02-03 ,Gloat,Senior Mobile Developer - React Native,Mobile,Engineer,Redux
2644819921,2022-02-03 ,Gloat,Senior Mobile Developer - React Native,Mobile,Engineer,State
2644819921,2022-02-03 ,Gloat,Senior Mobile Developer - React Native,Mobile,Engineer,UI 
2880796495,2022-01-19 ,ironSource,Android Developer,Mobile,Developer,Android 
2880796495,2022-01-19 ,ironSource,Android Developer,Mobile,Developer,Kotlin
2880796495,2022-01-19 ,ironSource,Android Developer,Mobile,Developer,Multithreading
2880796495,2022-01-19 ,ironSource,Android Developer,Mobile,Developer,Native
2880796495,2022-01-19 ,ironSource,Android Developer,Mobile,Developer,OOP
2876752452,2022-01-16 ,Allot,Senior Mobile Developer (React Native),Mobile,Developer,Native
2876752452,2022-01-16 ,Allot,Senior Mobile Developer (React Native),Mobile,Developer,React
2876752452,2022-01-16 ,Allot,Senior Mobile Developer (React Native),Mobile,Developer,Redux
2758295134,2022-02-03 ,Similarweb,Principal Mobile Developer,Mobile,Developer,Android 
2758295134,2022-02-03 ,Similarweb,Principal Mobile Developer,Mobile,Developer,DI
2758295134,2022-02-03 ,Similarweb,Principal Mobile Developer,Mobile,Developer,Design
2758295134,2022-02-03 ,Similarweb,Principal Mobile Developer,Mobile,Developer,Google
2758295134,2022-02-03 ,Similarweb,Principal Mobile Developer,Mobile,Developer,Java
2758295134,2022-02-03 ,Similarweb,Principal Mobile Developer,Mobile,Developer,Kotlin
2758295134,2022-02-03 ,Similarweb,Principal Mobile Developer,Mobile,Developer,Model
2863900410,2022-01-27 ,General Motors,Senior Android Engineer,Mobile,Engineer,Android 
2863900410,2022-01-27 ,General Motors,Senior Android Engineer,Mobile,Engineer,Design
2863900410,2022-01-27 ,General Motors,Senior Android Engineer,Mobile,Engineer,Java
2863900410,2022-01-27 ,General Motors,Senior Android Engineer,Mobile,Engineer,Kotlin
2863900410,2022-01-27 ,General Motors,Senior Android Engineer,Mobile,Engineer,Management
2863900410,2022-01-27 ,General Motors,Senior Android Engineer,Mobile,Engineer,Multithreading
2863900410,2022-01-27 ,General Motors,Senior Android Engineer,Mobile,Engineer,UI 
2863900410,2022-01-27 ,General Motors,Senior Android Engineer,Mobile,Senior,Android 
2863900410,2022-01-27 ,General Motors,Senior Android Engineer,Mobile,Senior,Design
2863900410,2022-01-27 ,General Motors,Senior Android Engineer,Mobile,Senior,Java
2863900410,2022-01-27 ,General Motors,Senior Android Engineer,Mobile,Senior,Kotlin
2863900410,2022-01-27 ,General Motors,Senior Android Engineer,Mobile,Senior,Management
2863900410,2022-01-27 ,General Motors,Senior Android Engineer,Mobile,Senior,Multithreading
2863900410,2022-01-27 ,General Motors,Senior Android Engineer,Mobile,Senior,UI 
2876752452,2022-01-16 ,Allot,Senior Mobile Developer (React Native),Mobile,Developer,Native
2876752452,2022-01-16 ,Allot,Senior Mobile Developer (React Native),Mobile,Developer,React
2876752452,2022-01-16 ,Allot,Senior Mobile Developer (React Native),Mobile,Developer,Redux
2884404856,2021-12-27 ,Citi,Experienced Android Developer,Mobile,Developer,Android 
2884404856,2021-12-27 ,Citi,Experienced Android Developer,Mobile,Developer,Architecture
2884404856,2021-12-27 ,Citi,Experienced Android Developer,Mobile,Developer,Architecture
2884404856,2021-12-27 ,Citi,Experienced Android Developer,Mobile,Developer,Design
2884404856,2021-12-27 ,Citi,Experienced Android Developer,Mobile,Developer,Kotlin
2884404856,2021-12-27 ,Citi,Experienced Android Developer,Mobile,Developer,Room
2884404856,2021-12-27 ,Citi,Experienced Android Developer,Mobile,Developer,View
2877386190,2022-02-07 ,Taboola,Senior Android Developer,Mobile,Developer,Android 
2877386190,2022-02-07 ,Taboola,Senior Android Developer,Mobile,Developer,Dependency
2877386190,2022-02-07 ,Taboola,Senior Android Developer,Mobile,Developer,Design
2877386190,2022-02-07 ,Taboola,Senior Android Developer,Mobile,Developer,Google
2877386190,2022-02-07 ,Taboola,Senior Android Developer,Mobile,Developer,Gradle
2877386190,2022-02-07 ,Taboola,Senior Android Developer,Mobile,Developer,Injection
2877386190,2022-02-07 ,Taboola,Senior Android Developer,Mobile,Developer,Kotlin
2877386190,2022-02-07 ,Taboola,Senior Android Developer,Mobile,Developer,Model
2877386190,2022-02-07 ,Taboola,Senior Android Developer,Mobile,Developer,Native
2877386190,2022-02-07 ,Taboola,Senior Android Developer,Mobile,Developer,OOP
2877386190,2022-02-07 ,Taboola,Senior Android Developer,Mobile,Senior,Android 
2877386190,2022-02-07 ,Taboola,Senior Android Developer,Mobile,Senior,Dependency
2877386190,2022-02-07 ,Taboola,Senior Android Developer,Mobile,Senior,Design
2877386190,2022-02-07 ,Taboola,Senior Android Developer,Mobile,Senior,Google
2877386190,2022-02-07 ,Taboola,Senior Android Developer,Mobile,Senior,Gradle
2877386190,2022-02-07 ,Taboola,Senior Android Developer,Mobile,Senior,Injection
2877386190,2022-02-07 ,Taboola,Senior Android Developer,Mobile,Senior,Kotlin
2877386190,2022-02-07 ,Taboola,Senior Android Developer,Mobile,Senior,Model
2877386190,2022-02-07 ,Taboola,Senior Android Developer,Mobile,Senior,Native
2877386190,2022-02-07 ,Taboola,Senior Android Developer,Mobile,Senior,OOP
2877386190,2022-02-07 ,Taboola,Senior Android Developer,Mobile,Developer,Android 
2877386190,2022-02-07 ,Taboola,Senior Android Developer,Mobile,Developer,Dependency
2877386190,2022-02-07 ,Taboola,Senior Android Developer,Mobile,Developer,Design
2877386190,2022-02-07 ,Taboola,Senior Android Developer,Mobile,Developer,Google
2877386190,2022-02-07 ,Taboola,Senior Android Developer,Mobile,Developer,Gradle
2877386190,2022-02-07 ,Taboola,Senior Android Developer,Mobile,Developer,Injection
2877386190,2022-02-07 ,Taboola,Senior Android Developer,Mobile,Developer,Kotlin
2877386190,2022-02-07 ,Taboola,Senior Android Developer,Mobile,Developer,Model
2877386190,2022-02-07 ,Taboola,Senior Android Developer,Mobile,Developer,Native
2877386190,2022-02-07 ,Taboola,Senior Android Developer,Mobile,Developer,OOP
2877386190,2022-02-07 ,Taboola,Senior Android Developer,Mobile,Senior,Android 
2877386190,2022-02-07 ,Taboola,Senior Android Developer,Mobile,Senior,Dependency
2877386190,2022-02-07 ,Taboola,Senior Android Developer,Mobile,Senior,Design
2877386190,2022-02-07 ,Taboola,Senior Android Developer,Mobile,Senior,Google
2877386190,2022-02-07 ,Taboola,Senior Android Developer,Mobile,Senior,Gradle
2877386190,2022-02-07 ,Taboola,Senior Android Developer,Mobile,Senior,Injection
2877386190,2022-02-07 ,Taboola,Senior Android Developer,Mobile,Senior,Kotlin
2877386190,2022-02-07 ,Taboola,Senior Android Developer,Mobile,Senior,Model
2877386190,2022-02-07 ,Taboola,Senior Android Developer,Mobile,Senior,Native
2877386190,2022-02-07 ,Taboola,Senior Android Developer,Mobile,Senior,OOP
2776914968,2022-02-12 ,Surprisecom,Senior Android Engineer,Mobile,Senior,Android 
2776914968,2022-02-12 ,Surprisecom,Senior Android Engineer,Mobile,Senior,Coroutines
2776914968,2022-02-12 ,Surprisecom,Senior Android Engineer,Mobile,Senior,Custom
2776914968,2022-02-12 ,Surprisecom,Senior Android Engineer,Mobile,Senior,Design
2776914968,2022-02-12 ,Surprisecom,Senior Android Engineer,Mobile,Senior,Google
2776914968,2022-02-12 ,Surprisecom,Senior Android Engineer,Mobile,Senior,Injection
2776914968,2022-02-12 ,Surprisecom,Senior Android Engineer,Mobile,Senior,Java
2776914968,2022-02-12 ,Surprisecom,Senior Android Engineer,Mobile,Senior,Koin
2776914968,2022-02-12 ,Surprisecom,Senior Android Engineer,Mobile,Senior,Kotlin
2776914968,2022-02-12 ,Surprisecom,Senior Android Engineer,Mobile,Senior,Native
2776914968,2022-02-12 ,Surprisecom,Senior Android Engineer,Mobile,Senior,React
2776914968,2022-02-12 ,Surprisecom,Senior Android Engineer,Mobile,Senior,Retrofit2
2776914968,2022-02-12 ,Surprisecom,Senior Android Engineer,Mobile,Senior,Room
2776914968,2022-02-12 ,Surprisecom,Senior Android Engineer,Mobile,Senior,View
2644819921,2022-02-03 ,Gloat,Senior Mobile Developer - React Native,Mobile,Engineer,Android 
2644819921,2022-02-03 ,Gloat,Senior Mobile Developer - React Native,Mobile,Engineer,Architecture
2644819921,2022-02-03 ,Gloat,Senior Mobile Developer - React Native,Mobile,Engineer,Architecture
2644819921,2022-02-03 ,Gloat,Senior Mobile Developer - React Native,Mobile,Engineer,Design
2644819921,2022-02-03 ,Gloat,Senior Mobile Developer - React Native,Mobile,Engineer,Google
2644819921,2022-02-03 ,Gloat,Senior Mobile Developer - React Native,Mobile,Engineer,Management
2644819921,2022-02-03 ,Gloat,Senior Mobile Developer - React Native,Mobile,Engineer,Native
2644819921,2022-02-03 ,Gloat,Senior Mobile Developer - React Native,Mobile,Engineer,React
2644819921,2022-02-03 ,Gloat,Senior Mobile Developer - React Native,Mobile,Engineer,Redux
2644819921,2022-02-03 ,Gloat,Senior Mobile Developer - React Native,Mobile,Engineer,State
2644819921,2022-02-03 ,Gloat,Senior Mobile Developer - React Native,Mobile,Engineer,UI 
