newmtl blinn3SG
illum 4
Kd 1.00 1.00 1.00
Ka 0.00 0.00 0.00
Tf 1.00 1.00 1.00
map_Kd antomy k.jpg
bump 3k.png -bm 0.288889
Ni 1.00
Ks 0.00 0.00 0.00
newmtl initialShadingGroup
illum 4
Kd 0.50 0.50 0.50
Ka 0.00 0.00 0.00
Tf 1.00 1.00 1.00
Ni 1.00
newmtl pasted__blinn1SG
illum 4
Kd 1.00 1.00 1.00
Ka 0.00 0.00 0.00
Tf 1.00 1.00 1.00
map_Kd awr (2).jpg
bump awr bump.jpg -bm -0.422222
Ni 1.00
Ks 0.49 0.49 0.49
newmtl pasted__pasted__pasted__lambert2SG1
illum 4
Kd 0.14 0.00 0.00
Ka 0.00 0.00 0.00
Tf 1.00 1.00 1.00
Ni 1.00
newmtl pasted__pasted__pasted__lambert2SG2
illum 4
Kd 0.14 0.00 0.00
Ka 0.00 0.00 0.00
Tf 1.00 1.00 1.00
Ni 1.00
newmtl pasted__pasted__pasted__lambert3SG
illum 4
Kd 1.00 1.00 1.00
Ka 0.00 0.00 0.00
Tf 1.00 1.00 1.00
map_Kd un_dimanche_a_paris_tartelette_framboise_4.jpg
Ni 1.00
newmtl pasted__pasted__pasted__lambert3SG1
illum 4
Kd 0.21 0.04 0.01
Ka 0.00 0.00 0.00
Tf 1.00 1.00 1.00
Ni 1.00
newmtl pasted__pasted__pasted__lambert3SG2
illum 4
Kd 0.21 0.04 0.01
Ka 0.00 0.00 0.00
Tf 1.00 1.00 1.00
Ni 1.00
newmtl pasted__pasted__pasted__lambert4SG2
illum 4
Kd 0.55 0.16 0.07
Ka 0.00 0.00 0.00
Tf 1.00 1.00 1.00
Ni 1.00
newmtl pasted__pasted__pasted__lambert4SG3
illum 4
Kd 0.55 0.16 0.07
Ka 0.00 0.00 0.00
Tf 1.00 1.00 1.00
Ni 1.00
newmtl pasted__pasted__pasted__pasted__blinn2SG
illum 4
Kd 1.00 1.00 1.00
Ka 0.13 0.13 0.13
Tf 1.00 1.00 1.00
map_Kd ee (2).png
Ni 1.00
Ks 0.30 0.30 0.30
newmtl pasted__pasted__pasted__pasted__pasted__blinn3SG2
illum 4
Kd 0.00 0.00 0.00
Ka 0.75 0.75 0.75
Tf 1.00 1.00 1.00
Ni 1.00
Ks 0.50 0.50 0.50
newmtl pasted__pasted__pasted__pasted__pasted__blinn3SG3
illum 4
Kd 0.00 0.00 0.00
Ka 0.75 0.75 0.75
Tf 1.00 1.00 1.00
Ni 1.00
Ks 0.50 0.50 0.50
newmtl pasted__pasted__pasted__pasted__pasted__blinn3SG4
illum 4
Kd 0.00 0.00 0.00
Ka 0.75 0.75 0.75
Tf 1.00 1.00 1.00
Ni 1.00
Ks 0.50 0.50 0.50
newmtl pasted__pasted__pasted__pasted__pasted__blinn3SG5
illum 4
Kd 0.00 0.00 0.00
Ka 0.75 0.75 0.75
Tf 1.00 1.00 1.00
Ni 1.00
Ks 0.50 0.50 0.50
newmtl pasted__pasted__pasted__pasted__pasted__lambert4SG1
illum 4
Kd 0.95 0.61 0.38
Ka 0.00 0.00 0.00
Tf 1.00 1.00 1.00
Ni 1.00
newmtl pasted__pasted__pasted__pasted__pasted__lambert6SG2
illum 4
Kd 0.00 0.00 0.00
Ka 0.00 0.00 0.00
Tf 1.00 1.00 1.00
Ni 1.00
newmtl pasted__pasted__pasted__pasted__pasted__lambert6SG3
illum 4
Kd 0.00 0.00 0.00
Ka 0.00 0.00 0.00
Tf 1.00 1.00 1.00
Ni 1.00
newmtl pasted__pasted__pasted__pasted__pasted__pasted__lambert6SG
illum 4
Kd 0.00 0.00 0.00
Ka 0.00 0.00 0.00
Tf 1.00 1.00 1.00
Ni 1.00
newmtl pasted__pasted__pasted__pasted__pasted__pasted__lambert6SG1
illum 4
Kd 0.00 0.00 0.00
Ka 0.00 0.00 0.00
Tf 1.00 1.00 1.00
Ni 1.00
newmtl viens_blue
illum 4
Kd 1.00 1.00 1.00
Ka 0.72 0.72 0.72
Tf 1.00 1.00 1.00
map_Kd bluee.jpg
bump blue (1).jpg -bm -0.866667
Ni 1.00
Ks 0.50 0.50 0.50
newmtl viens_red1
illum 4
Kd 1.00 1.00 1.00
Ka 0.00 0.00 0.00
Tf 1.00 1.00 1.00
map_Kd w1.jpg
bump ww.jpg -bm -0.25974
Ni 1.00
Ks 0.50 0.50 0.50
