﻿<?xml version="1.0" encoding="utf-8"?>
<!--Adventure Cycling Association GPX file-->
<!--Copyright 2022 Adventure Cycling Association-->
<!--Publication Date: 4/6/2022 8:57:48 AM-->
<!--Route: TransAmerica-->
<!--Section: 01-->
<!--Version: 2022-->
<gpx xmlns:xsi="http://www.w3.org/2001/XMLSchema-instance" xsi:schemaLocation="http://www.topografix.com/GPX/1/1 http://www.topografix.com/GPX/1/1/gpx.xsd" creator="www.adventurecycling.org" version="1.1" xmlns="http://www.topografix.com/GPX/1/1">
  <trk>
    <name>TA01EOpt_TCS_2022</name>
    <trkseg>
      <trkpt lat="45.4563357" lon="-123.8460461">
        <ele>7.2603358</ele>
      </trkpt>
      <trkpt lat="45.4563500" lon="-123.8469300">
        <ele>6.7269358</ele>
      </trkpt>
      <trkpt lat="45.4563300" lon="-123.8480000">
        <ele>6.2727838</ele>
      </trkpt>
      <trkpt lat="45.4563200" lon="-123.8490200">
        <ele>5.9679838</ele>
      </trkpt>
      <trkpt lat="45.4563000" lon="-123.8501700">
        <ele>5.5991758</ele>
      </trkpt>
      <trkpt lat="45.4562900" lon="-123.8512300">
        <ele>5.5046878</ele>
      </trkpt>
      <trkpt lat="45.4562800" lon="-123.8522100">
        <ele>5.6418478</ele>
      </trkpt>
      <trkpt lat="45.4562600" lon="-123.8532100">
        <ele>5.6936638</ele>
      </trkpt>
      <trkpt lat="45.4562400" lon="-123.8554500">
        <ele>6.2392558</ele>
      </trkpt>
      <trkpt lat="45.4562100" lon="-123.8573010">
        <ele>5.1724558</ele>
      </trkpt>
      <trkpt lat="45.4562100" lon="-123.8575800">
        <ele>5.1114958</ele>
      </trkpt>
      <trkpt lat="45.4562000" lon="-123.8578800">
        <ele>5.1998878</ele>
      </trkpt>
      <trkpt lat="45.4562000" lon="-123.8580500">
        <ele>5.1297838</ele>
      </trkpt>
      <trkpt lat="45.4561900" lon="-123.8588700">
        <ele>4.8432718</ele>
      </trkpt>
      <trkpt lat="45.4561800" lon="-123.8597000">
        <ele>.8077200</ele>
      </trkpt>
      <trkpt lat="45.4561600" lon="-123.8611000">
        <ele>3.6271199</ele>
      </trkpt>
      <trkpt lat="45.4560300" lon="-123.8691900">
        <ele>2.8986479</ele>
      </trkpt>
      <trkpt lat="45.4562100" lon="-123.8731510">
        <ele>2.5968959</ele>
      </trkpt>
      <trkpt lat="45.4568926" lon="-123.8757057">
        <ele>3.9227759</ele>
      </trkpt>
      <trkpt lat="45.4569026" lon="-123.8757857">
        <ele>2.8681679</ele>
      </trkpt>
      <trkpt lat="45.4568926" lon="-123.8758957">
        <ele>3.1668719</ele>
      </trkpt>
      <trkpt lat="45.4567526" lon="-123.8770257">
        <ele>.9174480</ele>
      </trkpt>
      <trkpt lat="45.4567326" lon="-123.8773657">
        <ele>.8442960</ele>
      </trkpt>
      <trkpt lat="45.4566126" lon="-123.8780857">
        <ele>7.9369917</ele>
      </trkpt>
      <trkpt lat="45.4566126" lon="-123.8781567">
        <ele>7.8821277</ele>
      </trkpt>
      <trkpt lat="45.4553705" lon="-123.8797989">
        <ele>4.2671999</ele>
      </trkpt>
      <trkpt lat="45.4558581" lon="-123.8819432">
        <ele>4.0294559</ele>
      </trkpt>
      <trkpt lat="45.4560897" lon="-123.8829115">
        <ele>4.1544239</ele>
      </trkpt>
      <trkpt lat="45.4563138" lon="-123.8834394">
        <ele>3.4229039</ele>
      </trkpt>
      <trkpt lat="45.4566290" lon="-123.8838381">
        <ele>3.6606479</ele>
      </trkpt>
      <trkpt lat="45.4570400" lon="-123.8841300">
        <ele>2.9413199</ele>
      </trkpt>
      <trkpt lat="45.4580460" lon="-123.8849539">
        <ele>4.8371758</ele>
      </trkpt>
      <trkpt lat="45.4590073" lon="-123.8855345">
        <ele>5.3431438</ele>
      </trkpt>
      <trkpt lat="45.4594594" lon="-123.8856535">
        <ele>4.6756319</ele>
      </trkpt>
      <trkpt lat="45.4608014" lon="-123.8859200">
        <ele>3.5935919</ele>
      </trkpt>
      <trkpt lat="45.4620673" lon="-123.8862150">
        <ele>3.4198559</ele>
      </trkpt>
      <trkpt lat="45.4633617" lon="-123.8860152">
        <ele>3.7398959</ele>
      </trkpt>
      <trkpt lat="45.4642326" lon="-123.8860009">
        <ele>3.7368479</ele>
      </trkpt>
      <trkpt lat="45.4650315" lon="-123.8861519">
        <ele>4.0843199</ele>
      </trkpt>
      <trkpt lat="45.4656841" lon="-123.8863578">
        <ele>5.2486558</ele>
      </trkpt>
      <trkpt lat="45.4660900" lon="-123.8865000">
        <ele>5.8704478</ele>
      </trkpt>
      <trkpt lat="45.4673402" lon="-123.8871763">
        <ele>4.9286158</ele>
      </trkpt>
      <trkpt lat="45.4679160" lon="-123.8874238">
        <ele>4.7884078</ele>
      </trkpt>
      <trkpt lat="45.4685109" lon="-123.8875713">
        <ele>4.8402238</ele>
      </trkpt>
      <trkpt lat="45.4687298" lon="-123.8876570">
        <ele>4.8371758</ele>
      </trkpt>
      <trkpt lat="45.4695579" lon="-123.8878188">
        <ele>4.1757599</ele>
      </trkpt>
      <trkpt lat="45.4700956" lon="-123.8881519">
        <ele>4.4500799</ele>
      </trkpt>
      <trkpt lat="45.4704573" lon="-123.8884613">
        <ele>4.4074079</ele>
      </trkpt>
      <trkpt lat="45.4706810" lon="-123.8888277">
        <ele>4.3159679</ele>
      </trkpt>
      <trkpt lat="45.4708095" lon="-123.8891513">
        <ele>4.0995599</ele>
      </trkpt>
      <trkpt lat="45.4708951" lon="-123.8895939">
        <ele>4.1391839</ele>
      </trkpt>
      <trkpt lat="45.4708951" lon="-123.8900983">
        <ele>4.4439839</ele>
      </trkpt>
      <trkpt lat="45.4708380" lon="-123.8905695">
        <ele>4.0904159</ele>
      </trkpt>
      <trkpt lat="45.4708500" lon="-123.8912700">
        <ele>4.2519599</ele>
      </trkpt>
      <trkpt lat="45.4710950" lon="-123.8918211">
        <ele>4.6817279</ele>
      </trkpt>
      <trkpt lat="45.4713996" lon="-123.8926729">
        <ele>5.0139598</ele>
      </trkpt>
      <trkpt lat="45.4716613" lon="-123.8934962">
        <ele>4.4409359</ele>
      </trkpt>
      <trkpt lat="45.4727939" lon="-123.8954426">
        <ele>7.5316078</ele>
      </trkpt>
      <trkpt lat="45.4751639" lon="-123.8992117">
        <ele>7.9369917</ele>
      </trkpt>
      <trkpt lat="45.4758730" lon="-123.8999493">
        <ele>8.6410797</ele>
      </trkpt>
      <trkpt lat="45.4762500" lon="-123.9003000">
        <ele>7.7693518</ele>
      </trkpt>
      <trkpt lat="45.4769770" lon="-123.9009582">
        <ele>6.0655198</ele>
      </trkpt>
      <trkpt lat="45.4774624" lon="-123.9013865">
        <ele>4.5689519</ele>
      </trkpt>
      <trkpt lat="45.4780097" lon="-123.9017958">
        <ele>4.1818559</ele>
      </trkpt>
      <trkpt lat="45.4783809" lon="-123.9019861">
        <ele>4.2062399</ele>
      </trkpt>
      <trkpt lat="45.4788854" lon="-123.9022669">
        <ele>4.2123359</ele>
      </trkpt>
      <trkpt lat="45.4792661" lon="-123.9025524">
        <ele>3.9806879</ele>
      </trkpt>
      <trkpt lat="45.4797705" lon="-123.9027809">
        <ele>4.1513759</ele>
      </trkpt>
      <trkpt lat="45.4801179" lon="-123.9030854">
        <ele>4.2854879</ele>
      </trkpt>
      <trkpt lat="45.4805557" lon="-123.9032996">
        <ele>4.1208959</ele>
      </trkpt>
      <trkpt lat="45.4810697" lon="-123.9035328">
        <ele>4.4135039</ele>
      </trkpt>
      <trkpt lat="45.4816000" lon="-123.9040000">
        <ele>4.1635679</ele>
      </trkpt>
      <trkpt lat="45.4819300" lon="-123.9043010">
        <ele>3.9563039</ele>
      </trkpt>
      <trkpt lat="45.4834539" lon="-123.9056790">
        <ele>4.2428159</ele>
      </trkpt>
      <trkpt lat="45.4839488" lon="-123.9061835">
        <ele>4.2732959</ele>
      </trkpt>
      <trkpt lat="45.4842391" lon="-123.9065975">
        <ele>4.2915839</ele>
      </trkpt>
      <trkpt lat="45.4851200" lon="-123.9081300">
        <ele>4.2550079</ele>
      </trkpt>
      <trkpt lat="45.4854622" lon="-123.9088628">
        <ele>4.6268639</ele>
      </trkpt>
      <trkpt lat="45.4856700" lon="-123.9095200">
        <ele>4.0568879</ele>
      </trkpt>
      <trkpt lat="45.4860761" lon="-123.9108472">
        <ele>3.9593519</ele>
      </trkpt>
      <trkpt lat="45.4862855" lon="-123.9115278">
        <ele>4.9590958</ele>
      </trkpt>
      <trkpt lat="45.4866043" lon="-123.9122939">
        <ele>4.1909999</ele>
      </trkpt>
      <trkpt lat="45.4869184" lon="-123.9128460">
        <ele>4.3586399</ele>
      </trkpt>
      <trkpt lat="45.4879368" lon="-123.9138834">
        <ele>4.1605199</ele>
      </trkpt>
      <trkpt lat="45.4887100" lon="-123.9146600">
        <ele>4.2092879</ele>
      </trkpt>
      <trkpt lat="45.4894597" lon="-123.9155443">
        <ele>4.3952159</ele>
      </trkpt>
      <trkpt lat="45.4897309" lon="-123.9162486">
        <ele>4.1147999</ele>
      </trkpt>
      <trkpt lat="45.4900307" lon="-123.9170148">
        <ele>4.3281599</ele>
      </trkpt>
      <trkpt lat="45.4905019" lon="-123.9175192">
        <ele>4.4561759</ele>
      </trkpt>
      <trkpt lat="45.4911919" lon="-123.9178333">
        <ele>4.1422319</ele>
      </trkpt>
      <trkpt lat="45.4917800" lon="-123.9181700">
        <ele>4.1117519</ele>
      </trkpt>
      <trkpt lat="45.4921104" lon="-123.9185662">
        <ele>4.0965119</ele>
      </trkpt>
      <trkpt lat="45.4922600" lon="-123.9189500">
        <ele>4.2336719</ele>
      </trkpt>
      <trkpt lat="45.4925054" lon="-123.9198701">
        <ele>4.0721279</ele>
      </trkpt>
      <trkpt lat="45.4926719" lon="-123.9203556">
        <ele>4.0233599</ele>
      </trkpt>
      <trkpt lat="45.4928242" lon="-123.9206363">
        <ele>3.9806879</ele>
      </trkpt>
      <trkpt lat="45.4939700" lon="-123.9229400">
        <ele>4.1452799</ele>
      </trkpt>
      <trkpt lat="45.4948848" lon="-123.9246671">
        <ele>4.0629839</ele>
      </trkpt>
      <trkpt lat="45.4958271" lon="-123.9266421">
        <ele>3.9959279</ele>
      </trkpt>
      <trkpt lat="45.4962792" lon="-123.9284743">
        <ele>4.1666159</ele>
      </trkpt>
      <trkpt lat="45.4966500" lon="-123.9298000">
        <ele>3.8435279</ele>
      </trkpt>
      <trkpt lat="45.4968000" lon="-123.9301500">
        <ele>3.8496239</ele>
      </trkpt>
      <trkpt lat="45.4971500" lon="-123.9309100">
        <ele>3.8404799</ele>
      </trkpt>
      <trkpt lat="45.4977640" lon="-123.9319340">
        <ele>4.4013119</ele>
      </trkpt>
      <trkpt lat="45.4984778" lon="-123.9333284">
        <ele>4.4226479</ele>
      </trkpt>
      <trkpt lat="45.4998389" lon="-123.9351986">
        <ele>4.3952159</ele>
      </trkpt>
      <trkpt lat="45.5003576" lon="-123.9358601">
        <ele>3.8160959</ele>
      </trkpt>
      <trkpt lat="45.5012380" lon="-123.9364931">
        <ele>4.1757599</ele>
      </trkpt>
      <trkpt lat="45.5015800" lon="-123.9368600">
        <ele>4.2702479</ele>
      </trkpt>
      <trkpt lat="45.5020100" lon="-123.9373800">
        <ele>4.2793919</ele>
      </trkpt>
      <trkpt lat="45.5025100" lon="-123.9379000">
        <ele>4.3830239</ele>
      </trkpt>
      <trkpt lat="45.5032000" lon="-123.9383500">
        <ele>4.5232319</ele>
      </trkpt>
      <trkpt lat="45.5035700" lon="-123.9387400">
        <ele>4.4135039</ele>
      </trkpt>
      <trkpt lat="45.5043000" lon="-123.9397500">
        <ele>4.5750479</ele>
      </trkpt>
      <trkpt lat="45.5065100" lon="-123.9430600">
        <ele>5.9923678</ele>
      </trkpt>
      <trkpt lat="45.5065644" lon="-123.9434458">
        <ele>7.4066398</ele>
      </trkpt>
      <trkpt lat="45.5065787" lon="-123.9439777">
        <ele>6.1203838</ele>
      </trkpt>
      <trkpt lat="45.5064700" lon="-123.9444600">
        <ele>4.9316638</ele>
      </trkpt>
      <trkpt lat="45.5062503" lon="-123.9450020">
        <ele>4.5049439</ele>
      </trkpt>
      <trkpt lat="45.5059827" lon="-123.9456659">
        <ele>4.3647359</ele>
      </trkpt>
      <trkpt lat="45.5057221" lon="-123.9462262">
        <ele>4.5750479</ele>
      </trkpt>
      <trkpt lat="45.5052652" lon="-123.9470721">
        <ele>5.0566318</ele>
      </trkpt>
      <trkpt lat="45.5044065" lon="-123.9484152">
        <ele>3.9898319</ele>
      </trkpt>
      <trkpt lat="45.5029217" lon="-123.9474634">
        <ele>9.5097597</ele>
      </trkpt>
      <trkpt lat="45.4998760" lon="-123.9457312">
        <ele>33.8907109</ele>
      </trkpt>
      <trkpt lat="45.4990846" lon="-123.9457277">
        <ele>40.1177747</ele>
      </trkpt>
      <trkpt lat="45.4961450" lon="-123.9468924">
        <ele>69.3267578</ele>
      </trkpt>
      <trkpt lat="45.4950014" lon="-123.9467842">
        <ele>79.2053255</ele>
      </trkpt>
      <trkpt lat="45.4936323" lon="-123.9463975">
        <ele>91.9886371</ele>
      </trkpt>
      <trkpt lat="45.4929884" lon="-123.9467128">
        <ele>98.3467649</ele>
      </trkpt>
      <trkpt lat="45.4924901" lon="-123.9474634">
        <ele>102.5072847</ele>
      </trkpt>
      <trkpt lat="45.4923888" lon="-123.9484403">
        <ele>110.3680765</ele>
      </trkpt>
      <trkpt lat="45.4920904" lon="-123.9492718">
        <ele>115.7325563</ele>
      </trkpt>
      <trkpt lat="45.4915764" lon="-123.9497097">
        <ele>120.9507321</ele>
      </trkpt>
      <trkpt lat="45.4910054" lon="-123.9499952">
        <ele>126.3091160</ele>
      </trkpt>
      <trkpt lat="45.4905899" lon="-123.9497823">
        <ele>129.4424599</ele>
      </trkpt>
      <trkpt lat="45.4901678" lon="-123.9498810">
        <ele>132.7556358</ele>
      </trkpt>
      <trkpt lat="45.4899617" lon="-123.9503391">
        <ele>135.6847637</ele>
      </trkpt>
      <trkpt lat="45.4899394" lon="-123.9508137">
        <ele>136.9344436</ele>
      </trkpt>
      <trkpt lat="45.4902044" lon="-123.9513813">
        <ele>139.3911315</ele>
      </trkpt>
      <trkpt lat="45.4903201" lon="-123.9519749">
        <ele>141.9484035</ele>
      </trkpt>
      <trkpt lat="45.4899475" lon="-123.9526520">
        <ele>147.0873313</ele>
      </trkpt>
      <trkpt lat="45.4893112" lon="-123.9534216">
        <ele>155.8594750</ele>
      </trkpt>
      <trkpt lat="45.4890909" lon="-123.9540797">
        <ele>153.2199071</ele>
      </trkpt>
      <trkpt lat="45.4890828" lon="-123.9546399">
        <ele>152.1622511</ele>
      </trkpt>
      <trkpt lat="45.4884770" lon="-123.9556215">
        <ele>154.7896270</ele>
      </trkpt>
      <trkpt lat="45.4876931" lon="-123.9566767">
        <ele>155.8564270</ele>
      </trkpt>
      <trkpt lat="45.4870102" lon="-123.9578121">
        <ele>156.9872350</ele>
      </trkpt>
      <trkpt lat="45.4867414" lon="-123.9583709">
        <ele>158.2216749</ele>
      </trkpt>
      <trkpt lat="45.4870921" lon="-123.9593049">
        <ele>158.1302349</ele>
      </trkpt>
      <trkpt lat="45.4871369" lon="-123.9593662">
        <ele>158.1485229</ele>
      </trkpt>
      <trkpt lat="45.4879059" lon="-123.9604185">
        <ele>158.1058509</ele>
      </trkpt>
      <trkpt lat="45.4881500" lon="-123.9609788">
        <ele>158.5051389</ele>
      </trkpt>
      <trkpt lat="45.4884936" lon="-123.9618890">
        <ele>158.6666829</ele>
      </trkpt>
      <trkpt lat="45.4887401" lon="-123.9629966">
        <ele>158.6575389</ele>
      </trkpt>
      <trkpt lat="45.4887591" lon="-123.9644052">
        <ele>157.0756270</ele>
      </trkpt>
      <trkpt lat="45.4885688" lon="-123.9652618">
        <ele>155.5912510</ele>
      </trkpt>
      <trkpt lat="45.4882081" lon="-123.9655439">
        <ele>153.6984431</ele>
      </trkpt>
      <trkpt lat="45.4876360" lon="-123.9656616">
        <ele>149.8549152</ele>
      </trkpt>
      <trkpt lat="45.4868746" lon="-123.9656616">
        <ele>148.0200193</ele>
      </trkpt>
      <trkpt lat="45.4862274" lon="-123.9657948">
        <ele>146.0296753</ele>
      </trkpt>
      <trkpt lat="45.4851424" lon="-123.9662136">
        <ele>143.6949074</ele>
      </trkpt>
      <trkpt lat="45.4836766" lon="-123.9668418">
        <ele>138.7449556</ele>
      </trkpt>
      <trkpt lat="45.4823632" lon="-123.9674128">
        <ele>131.2499238</ele>
      </trkpt>
      <trkpt lat="45.4812553" lon="-123.9674427">
        <ele>122.9136441</ele>
      </trkpt>
      <trkpt lat="45.4803394" lon="-123.9673156">
        <ele>111.0782604</ele>
      </trkpt>
      <trkpt lat="45.4793708" lon="-123.9671001">
        <ele>108.7069165</ele>
      </trkpt>
      <trkpt lat="45.4788796" lon="-123.9665753">
        <ele>97.8255569</ele>
      </trkpt>
      <trkpt lat="45.4788854" lon="-123.9660008">
        <ele>97.5268529</ele>
      </trkpt>
      <trkpt lat="45.4788711" lon="-123.9655582">
        <ele>95.9693249</ele>
      </trkpt>
      <trkpt lat="45.4787273" lon="-123.9651095">
        <ele>93.0249570</ele>
      </trkpt>
      <trkpt lat="45.4785570" lon="-123.9648301">
        <ele>90.9096451</ele>
      </trkpt>
      <trkpt lat="45.4782134" lon="-123.9647288">
        <ele>87.2764292</ele>
      </trkpt>
      <trkpt lat="45.4778574" lon="-123.9649728">
        <ele>83.3902293</ele>
      </trkpt>
      <trkpt lat="45.4776718" lon="-123.9656581">
        <ele>81.1529974</ele>
      </trkpt>
      <trkpt lat="45.4778327" lon="-123.9665562">
        <ele>74.6180856</ele>
      </trkpt>
      <trkpt lat="45.4777860" lon="-123.9673285">
        <ele>70.4118457</ele>
      </trkpt>
      <trkpt lat="45.4773948" lon="-123.9680030">
        <ele>68.6196218</ele>
      </trkpt>
      <trkpt lat="45.4768047" lon="-123.9682504">
        <ele>62.7918460</ele>
      </trkpt>
      <trkpt lat="45.4758720" lon="-123.9681172">
        <ele>57.0128382</ele>
      </trkpt>
      <trkpt lat="45.4751591" lon="-123.9680566">
        <ele>49.4294144</ele>
      </trkpt>
      <trkpt lat="45.4743111" lon="-123.9682314">
        <ele>43.3456066</ele>
      </trkpt>
      <trkpt lat="45.4735116" lon="-123.9684598">
        <ele>38.7949428</ele>
      </trkpt>
      <trkpt lat="45.4726930" lon="-123.9688596">
        <ele>32.4063350</ele>
      </trkpt>
      <trkpt lat="45.4717603" lon="-123.9693735">
        <ele>37.7129028</ele>
      </trkpt>
      <trkpt lat="45.4707904" lon="-123.9693986">
        <ele>44.2782946</ele>
      </trkpt>
      <trkpt lat="45.4700766" lon="-123.9692844">
        <ele>48.5637824</ele>
      </trkpt>
      <trkpt lat="45.4695712" lon="-123.9691832">
        <ele>53.4161983</ele>
      </trkpt>
      <trkpt lat="45.4689240" lon="-123.9689738">
        <ele>57.8937101</ele>
      </trkpt>
      <trkpt lat="45.4683529" lon="-123.9685550">
        <ele>60.2010461</ele>
      </trkpt>
      <trkpt lat="45.4676486" lon="-123.9678316">
        <ele>66.9584619</ele>
      </trkpt>
      <trkpt lat="45.4669442" lon="-123.9673367">
        <ele>69.4700138</ele>
      </trkpt>
      <trkpt lat="45.4631561" lon="-123.9641006">
        <ele>79.1535095</ele>
      </trkpt>
      <trkpt lat="45.4625851" lon="-123.9640435">
        <ele>73.3165897</ele>
      </trkpt>
      <trkpt lat="45.4619569" lon="-123.9642529">
        <ele>67.3333658</ele>
      </trkpt>
      <trkpt lat="45.4617665" lon="-123.9644814">
        <ele>64.7852379</ele>
      </trkpt>
      <trkpt lat="45.4613287" lon="-123.9647859">
        <ele>60.1766621</ele>
      </trkpt>
      <trkpt lat="45.4606054" lon="-123.9648430">
        <ele>55.4217822</ele>
      </trkpt>
      <trkpt lat="45.4599010" lon="-123.9648050">
        <ele>44.1289426</ele>
      </trkpt>
      <trkpt lat="45.4592729" lon="-123.9654522">
        <ele>38.1640068</ele>
      </trkpt>
      <trkpt lat="45.4589683" lon="-123.9658329">
        <ele>32.1350630</ele>
      </trkpt>
      <trkpt lat="45.4583211" lon="-123.9666895">
        <ele>27.9714951</ele>
      </trkpt>
      <trkpt lat="45.4578262" lon="-123.9672606">
        <ele>23.5092232</ele>
      </trkpt>
      <trkpt lat="45.4573693" lon="-123.9676793">
        <ele>18.8823594</ele>
      </trkpt>
      <trkpt lat="45.4559416" lon="-123.9672415">
        <ele>13.1734556</ele>
      </trkpt>
      <trkpt lat="45.4544949" lon="-123.9660613">
        <ele>26.9869911</ele>
      </trkpt>
      <trkpt lat="45.4531814" lon="-123.9654712">
        <ele>36.8015508</ele>
      </trkpt>
      <trkpt lat="45.4530016" lon="-123.9648301">
        <ele>40.8035747</ele>
      </trkpt>
      <trkpt lat="45.4528959" lon="-123.9639103">
        <ele>45.6407505</ele>
      </trkpt>
      <trkpt lat="45.4521154" lon="-123.9634534">
        <ele>50.8985504</ele>
      </trkpt>
      <trkpt lat="45.4511827" lon="-123.9632060">
        <ele>57.2018142</ele>
      </trkpt>
      <trkpt lat="45.4511446" lon="-123.9626539">
        <ele>61.0026700</ele>
      </trkpt>
      <trkpt lat="45.4517024" lon="-123.9621746">
        <ele>65.3887419</ele>
      </trkpt>
      <trkpt lat="45.4522677" lon="-123.9620448">
        <ele>69.2048378</ele>
      </trkpt>
      <trkpt lat="45.4524771" lon="-123.9616450">
        <ele>70.5429097</ele>
      </trkpt>
      <trkpt lat="45.4522868" lon="-123.9608455">
        <ele>72.9874057</ele>
      </trkpt>
      <trkpt lat="45.4514111" lon="-123.9598557">
        <ele>76.5261336</ele>
      </trkpt>
      <trkpt lat="45.4503832" lon="-123.9590752">
        <ele>77.4740615</ele>
      </trkpt>
      <trkpt lat="45.4476421" lon="-123.9571336">
        <ele>75.9317736</ele>
      </trkpt>
      <trkpt lat="45.4470329" lon="-123.9567338">
        <ele>64.4255739</ele>
      </trkpt>
      <trkpt lat="45.4460240" lon="-123.9570194">
        <ele>57.0677022</ele>
      </trkpt>
      <trkpt lat="45.4454720" lon="-123.9574191">
        <ele>51.6422623</ele>
      </trkpt>
      <trkpt lat="45.4443298" lon="-123.9569432">
        <ele>43.5620146</ele>
      </trkpt>
      <trkpt lat="45.4430231" lon="-123.9562847">
        <ele>33.3420709</ele>
      </trkpt>
      <trkpt lat="45.4428831" lon="-123.9561247">
        <ele>31.0347350</ele>
      </trkpt>
      <trkpt lat="45.4415522" lon="-123.9561971">
        <ele>37.9140708</ele>
      </trkpt>
      <trkpt lat="45.4409796" lon="-123.9554013">
        <ele>35.5122469</ele>
      </trkpt>
      <trkpt lat="45.4408806" lon="-123.9545222">
        <ele>31.8424550</ele>
      </trkpt>
      <trkpt lat="45.4409796" lon="-123.9536500">
        <ele>30.6110630</ele>
      </trkpt>
      <trkpt lat="45.4407131" lon="-123.9525079">
        <ele>26.8041111</ele>
      </trkpt>
      <trkpt lat="45.4397803" lon="-123.9510231">
        <ele>21.3268553</ele>
      </trkpt>
      <trkpt lat="45.4387524" lon="-123.9499952">
        <ele>14.7065995</ele>
      </trkpt>
      <trkpt lat="45.4385240" lon="-123.9487579">
        <ele>23.1983273</ele>
      </trkpt>
      <trkpt lat="45.4383907" lon="-123.9478061">
        <ele>30.3977030</ele>
      </trkpt>
      <trkpt lat="45.4379910" lon="-123.9474634">
        <ele>27.8678631</ele>
      </trkpt>
      <trkpt lat="45.4326451" lon="-123.9448017">
        <ele>13.1521196</ele>
      </trkpt>
      <trkpt lat="45.4325251" lon="-123.9447017">
        <ele>13.2618476</ele>
      </trkpt>
      <trkpt lat="45.4324572" lon="-123.9449061">
        <ele>12.2468636</ele>
      </trkpt>
      <trkpt lat="45.4321944" lon="-123.9452376">
        <ele>10.2717597</ele>
      </trkpt>
      <trkpt lat="45.4317144" lon="-123.9456286">
        <ele>6.3367918</ele>
      </trkpt>
      <trkpt lat="45.4313009" lon="-123.9458420">
        <ele>5.2517038</ele>
      </trkpt>
      <trkpt lat="45.4308869" lon="-123.9457420">
        <ele>4.8005998</ele>
      </trkpt>
      <trkpt lat="45.4304844" lon="-123.9453976">
        <ele>4.6786799</ele>
      </trkpt>
      <trkpt lat="45.4300444" lon="-123.9447476">
        <ele>.9845040</ele>
      </trkpt>
      <trkpt lat="45.4297528" lon="-123.9434177">
        <ele>4.8371758</ele>
      </trkpt>
      <trkpt lat="45.4294728" lon="-123.9430277">
        <ele>4.5506639</ele>
      </trkpt>
      <trkpt lat="45.4286418" lon="-123.9420331">
        <ele>4.4409359</ele>
      </trkpt>
      <trkpt lat="45.4282018" lon="-123.9414031">
        <ele>4.8036478</ele>
      </trkpt>
      <trkpt lat="45.4274718" lon="-123.9406321">
        <ele>5.4010558</ele>
      </trkpt>
      <trkpt lat="45.4259461" lon="-123.9392591">
        <ele>4.5689519</ele>
      </trkpt>
      <trkpt lat="45.4241187" lon="-123.9380789">
        <ele>4.2428159</ele>
      </trkpt>
      <trkpt lat="45.4221771" lon="-123.9369367">
        <ele>4.3830239</ele>
      </trkpt>
      <trkpt lat="45.4203116" lon="-123.9364227">
        <ele>4.2123359</ele>
      </trkpt>
      <trkpt lat="45.4183699" lon="-123.9360801">
        <ele>4.4104559</ele>
      </trkpt>
      <trkpt lat="45.4163331" lon="-123.9351474">
        <ele>4.3190159</ele>
      </trkpt>
      <trkpt lat="45.4144438" lon="-123.9340052">
        <ele>4.0507919</ele>
      </trkpt>
    </trkseg>
  </trk>
</gpx>