﻿<?xml version="1.0" encoding="utf-8"?>
<!--Adventure Cycling Association GPX file-->
<!--Copyright 2020 Adventure Cycling Association-->
<!--Publication Date: 1/30/2020 4:06:43 PM-->
<!--Route: Parks, Peaks, and Prairies-->
<!--Section: 02-->
<!--Version: 2020-->
<gpx xmlns:xsi="http://www.w3.org/2001/XMLSchema-instance" xsi:schemaLocation="http://www.topografix.com/GPX/1/1 http://www.topografix.com/GPX/1/1/gpx.xsd" creator="www.adventurecycling.org" version="1.1" xmlns="http://www.topografix.com/GPX/1/1">
  <trk>
    <name>PPP02WAlt_SCr_2020</name>
    <trkseg>
      <trkpt lat="43.8739159" lon="-102.2385059">
        <ele>950.8449056</ele>
      </trkpt>
      <trkpt lat="43.8738183" lon="-102.2388091">
        <ele>949.8390656</ele>
      </trkpt>
      <trkpt lat="43.8737795" lon="-102.2391871">
        <ele>948.8423696</ele>
      </trkpt>
      <trkpt lat="43.8737922" lon="-102.2394772">
        <ele>947.7786177</ele>
      </trkpt>
      <trkpt lat="43.8738292" lon="-102.2396417">
        <ele>947.3153217</ele>
      </trkpt>
      <trkpt lat="43.8739463" lon="-102.2399882">
        <ele>946.3612977</ele>
      </trkpt>
      <trkpt lat="43.8740293" lon="-102.2402894">
        <ele>945.8766657</ele>
      </trkpt>
      <trkpt lat="43.8740465" lon="-102.2405325">
        <ele>945.5139537</ele>
      </trkpt>
      <trkpt lat="43.8740050" lon="-102.2409221">
        <ele>944.6788018</ele>
      </trkpt>
      <trkpt lat="43.8737807" lon="-102.2416062">
        <ele>940.1372819</ele>
      </trkpt>
      <trkpt lat="43.8733384" lon="-102.2426835">
        <ele>939.6099779</ele>
      </trkpt>
      <trkpt lat="43.8719971" lon="-102.2457728">
        <ele>946.5777057</ele>
      </trkpt>
      <trkpt lat="43.8711124" lon="-102.2477562">
        <ele>945.1481938</ele>
      </trkpt>
      <trkpt lat="43.8708627" lon="-102.2485125">
        <ele>945.4011777</ele>
      </trkpt>
      <trkpt lat="43.8708019" lon="-102.2488250">
        <ele>945.3828897</ele>
      </trkpt>
      <trkpt lat="43.8707945" lon="-102.2491385">
        <ele>945.7913217</ele>
      </trkpt>
      <trkpt lat="43.8708484" lon="-102.2495185">
        <ele>945.3859377</ele>
      </trkpt>
      <trkpt lat="43.8709623" lon="-102.2498613">
        <ele>945.5200497</ele>
      </trkpt>
      <trkpt lat="43.8713118" lon="-102.2504393">
        <ele>945.6358737</ele>
      </trkpt>
      <trkpt lat="43.8719381" lon="-102.2514837">
        <ele>948.1748577</ele>
      </trkpt>
      <trkpt lat="43.8721737" lon="-102.2518821">
        <ele>949.8908816</ele>
      </trkpt>
      <trkpt lat="43.8724293" lon="-102.2521699">
        <ele>949.8512576</ele>
      </trkpt>
      <trkpt lat="43.8727819" lon="-102.2524080">
        <ele>952.8108655</ele>
      </trkpt>
      <trkpt lat="43.8729674" lon="-102.2525507">
        <ele>952.6096975</ele>
      </trkpt>
      <trkpt lat="43.8731244" lon="-102.2527719">
        <ele>951.0277856</ele>
      </trkpt>
      <trkpt lat="43.8735239" lon="-102.2534924">
        <ele>946.0839297</ele>
      </trkpt>
      <trkpt lat="43.8737721" lon="-102.2539379">
        <ele>948.3394497</ele>
      </trkpt>
      <trkpt lat="43.8738848" lon="-102.2540959">
        <ele>950.1164336</ele>
      </trkpt>
      <trkpt lat="43.8740752" lon="-102.2543032">
        <ele>948.0620817</ele>
      </trkpt>
      <trkpt lat="43.8742628" lon="-102.2544407">
        <ele>946.6051377</ele>
      </trkpt>
      <trkpt lat="43.8745110" lon="-102.2545281">
        <ele>946.6173297</ele>
      </trkpt>
      <trkpt lat="43.8747108" lon="-102.2546061">
        <ele>945.5352897</ele>
      </trkpt>
      <trkpt lat="43.8748571" lon="-102.2546819">
        <ele>945.4651857</ele>
      </trkpt>
      <trkpt lat="43.8749742" lon="-102.2547606">
        <ele>946.2180417</ele>
      </trkpt>
      <trkpt lat="43.8750863" lon="-102.2548755">
        <ele>945.8675217</ele>
      </trkpt>
      <trkpt lat="43.8753806" lon="-102.2552665">
        <ele>943.5754258</ele>
      </trkpt>
      <trkpt lat="43.8756401" lon="-102.2555772">
        <ele>943.5327538</ele>
      </trkpt>
      <trkpt lat="43.8761512" lon="-102.2561969">
        <ele>944.9439778</ele>
      </trkpt>
      <trkpt lat="43.8762756" lon="-102.2563477">
        <ele>945.0658978</ele>
      </trkpt>
      <trkpt lat="43.8769892" lon="-102.2572192">
        <ele>946.7057217</ele>
      </trkpt>
      <trkpt lat="43.8772946" lon="-102.2574220">
        <ele>944.6666098</ele>
      </trkpt>
      <trkpt lat="43.8776773" lon="-102.2575753">
        <ele>943.6668658</ele>
      </trkpt>
      <trkpt lat="43.8784617" lon="-102.2578281">
        <ele>942.4507138</ele>
      </trkpt>
      <trkpt lat="43.8791710" lon="-102.2581154">
        <ele>942.2617378</ele>
      </trkpt>
      <trkpt lat="43.8794087" lon="-102.2582721">
        <ele>940.8322259</ele>
      </trkpt>
      <trkpt lat="43.8795844" lon="-102.2584706">
        <ele>941.3168579</ele>
      </trkpt>
      <trkpt lat="43.8797664" lon="-102.2587113">
        <ele>941.8533059</ele>
      </trkpt>
      <trkpt lat="43.8799401" lon="-102.2590823">
        <ele>942.6793138</ele>
      </trkpt>
      <trkpt lat="43.8800708" lon="-102.2595093">
        <ele>940.5213299</ele>
      </trkpt>
      <trkpt lat="43.8806870" lon="-102.2620896">
        <ele>928.2348423</ele>
      </trkpt>
      <trkpt lat="43.8807949" lon="-102.2624474">
        <ele>928.2378903</ele>
      </trkpt>
      <trkpt lat="43.8809011" lon="-102.2627531">
        <ele>928.2958023</ele>
      </trkpt>
      <trkpt lat="43.8810467" lon="-102.2629949">
        <ele>928.4207703</ele>
      </trkpt>
      <trkpt lat="43.8812143" lon="-102.2632463">
        <ele>929.1461943</ele>
      </trkpt>
      <trkpt lat="43.8814519" lon="-102.2635028">
        <ele>930.7250582</ele>
      </trkpt>
      <trkpt lat="43.8821331" lon="-102.2642379">
        <ele>927.0522183</ele>
      </trkpt>
      <trkpt lat="43.8880871" lon="-102.2706635">
        <ele>921.8675705</ele>
      </trkpt>
      <trkpt lat="43.8882241" lon="-102.2708331">
        <ele>921.9346265</ele>
      </trkpt>
      <trkpt lat="43.8884166" lon="-102.2711454">
        <ele>921.4530425</ele>
      </trkpt>
      <trkpt lat="43.8887507" lon="-102.2717311">
        <ele>921.6785945</ele>
      </trkpt>
      <trkpt lat="43.8899245" lon="-102.2738402">
        <ele>915.2869387</ele>
      </trkpt>
      <trkpt lat="43.8900616" lon="-102.2741178">
        <ele>914.9455627</ele>
      </trkpt>
      <trkpt lat="43.8901642" lon="-102.2743994">
        <ele>912.0255788</ele>
      </trkpt>
      <trkpt lat="43.8903250" lon="-102.2753257">
        <ele>909.9102669</ele>
      </trkpt>
      <trkpt lat="43.8905284" lon="-102.2770067">
        <ele>905.6948830</ele>
      </trkpt>
      <trkpt lat="43.8906424" lon="-102.2777073">
        <ele>904.6920910</ele>
      </trkpt>
      <trkpt lat="43.8907321" lon="-102.2780501">
        <ele>904.8932590</ele>
      </trkpt>
      <trkpt lat="43.8908468" lon="-102.2783943">
        <ele>908.6362029</ele>
      </trkpt>
      <trkpt lat="43.8909729" lon="-102.2786413">
        <ele>909.0598749</ele>
      </trkpt>
      <trkpt lat="43.8912312" lon="-102.2789621">
        <ele>908.9745309</ele>
      </trkpt>
      <trkpt lat="43.8928573" lon="-102.2808867">
        <ele>909.8554029</ele>
      </trkpt>
      <trkpt lat="43.8931177" lon="-102.2811343">
        <ele>909.7548189</ele>
      </trkpt>
      <trkpt lat="43.8933218" lon="-102.2812757">
        <ele>909.7578669</ele>
      </trkpt>
      <trkpt lat="43.8953814" lon="-102.2823296">
        <ele>909.7365309</ele>
      </trkpt>
      <trkpt lat="43.8956760" lon="-102.2825372">
        <ele>910.0504749</ele>
      </trkpt>
      <trkpt lat="43.8959259" lon="-102.2827768">
        <ele>910.5137709</ele>
      </trkpt>
      <trkpt lat="43.8961630" lon="-102.2830852">
        <ele>910.1693469</ele>
      </trkpt>
      <trkpt lat="43.8964411" lon="-102.2836088">
        <ele>910.6996989</ele>
      </trkpt>
      <trkpt lat="43.8976186" lon="-102.2861180">
        <ele>898.5747552</ele>
      </trkpt>
      <trkpt lat="43.8989447" lon="-102.2888681">
        <ele>897.5567233</ele>
      </trkpt>
      <trkpt lat="43.9016189" lon="-102.2944755">
        <ele>914.3633947</ele>
      </trkpt>
      <trkpt lat="43.9017855" lon="-102.2948052">
        <ele>915.3174187</ele>
      </trkpt>
      <trkpt lat="43.9019855" lon="-102.2950982">
        <ele>915.3478987</ele>
      </trkpt>
      <trkpt lat="43.9022152" lon="-102.2953500">
        <ele>915.1619707</ele>
      </trkpt>
      <trkpt lat="43.9032099" lon="-102.2962700">
        <ele>909.3220029</ele>
      </trkpt>
      <trkpt lat="43.9034977" lon="-102.2965850">
        <ele>908.1271869</ele>
      </trkpt>
      <trkpt lat="43.9036636" lon="-102.2968564">
        <ele>904.8597310</ele>
      </trkpt>
      <trkpt lat="43.9038240" lon="-102.2972121">
        <ele>904.5183551</ele>
      </trkpt>
      <trkpt lat="43.9039421" lon="-102.2976090">
        <ele>903.8264591</ele>
      </trkpt>
      <trkpt lat="43.9040014" lon="-102.2979503">
        <ele>903.3723071</ele>
      </trkpt>
      <trkpt lat="43.9040077" lon="-102.2984153">
        <ele>903.1010351</ele>
      </trkpt>
      <trkpt lat="43.9038621" lon="-102.3018364">
        <ele>907.4596750</ele>
      </trkpt>
      <trkpt lat="43.9038266" lon="-102.3032469">
        <ele>903.4363151</ele>
      </trkpt>
      <trkpt lat="43.9038538" lon="-102.3037717">
        <ele>903.9118031</ele>
      </trkpt>
      <trkpt lat="43.9039362" lon="-102.3041680">
        <ele>903.9758111</ele>
      </trkpt>
      <trkpt lat="43.9041361" lon="-102.3046987">
        <ele>903.7868351</ele>
      </trkpt>
      <trkpt lat="43.9045607" lon="-102.3056422">
        <ele>904.1891711</ele>
      </trkpt>
      <trkpt lat="43.9048695" lon="-102.3063845">
        <ele>903.9422831</ele>
      </trkpt>
      <trkpt lat="43.9050265" lon="-102.3068698">
        <ele>904.5366431</ele>
      </trkpt>
      <trkpt lat="43.9050827" lon="-102.3072026">
        <ele>904.7530510</ele>
      </trkpt>
      <trkpt lat="43.9051035" lon="-102.3077167">
        <ele>905.2437790</ele>
      </trkpt>
      <trkpt lat="43.9051918" lon="-102.3141061">
        <ele>897.3128833</ele>
      </trkpt>
      <trkpt lat="43.9051684" lon="-102.3145177">
        <ele>897.3067873</ele>
      </trkpt>
      <trkpt lat="43.9051062" lon="-102.3148342">
        <ele>897.2397313</ele>
      </trkpt>
      <trkpt lat="43.9049994" lon="-102.3150933">
        <ele>896.9684593</ele>
      </trkpt>
      <trkpt lat="43.9048135" lon="-102.3153553">
        <ele>897.6451153</ele>
      </trkpt>
      <trkpt lat="43.9045708" lon="-102.3155124">
        <ele>897.4287073</ele>
      </trkpt>
      <trkpt lat="43.9043138" lon="-102.3155695">
        <ele>897.1330513</ele>
      </trkpt>
      <trkpt lat="43.9028076" lon="-102.3155838">
        <ele>904.2044111</ele>
      </trkpt>
      <trkpt lat="43.9025149" lon="-102.3156551">
        <ele>903.9209471</ele>
      </trkpt>
      <trkpt lat="43.9022651" lon="-102.3158193">
        <ele>903.4698431</ele>
      </trkpt>
      <trkpt lat="43.9020295" lon="-102.3160692">
        <ele>902.8145231</ele>
      </trkpt>
      <trkpt lat="43.9018653" lon="-102.3163119">
        <ele>902.0037551</ele>
      </trkpt>
      <trkpt lat="43.9017154" lon="-102.3166545">
        <ele>900.4340352</ele>
      </trkpt>
      <trkpt lat="43.9016369" lon="-102.3169972">
        <ele>899.1447312</ele>
      </trkpt>
      <trkpt lat="43.9010829" lon="-102.3199648">
        <ele>904.0824911</ele>
      </trkpt>
      <trkpt lat="43.9010031" lon="-102.3203602">
        <ele>905.1797710</ele>
      </trkpt>
      <trkpt lat="43.9010087" lon="-102.3207091">
        <ele>907.4901550</ele>
      </trkpt>
      <trkpt lat="43.9010587" lon="-102.3210518">
        <ele>907.9382109</ele>
      </trkpt>
      <trkpt lat="43.9011642" lon="-102.3214733">
        <ele>908.0601309</ele>
      </trkpt>
      <trkpt lat="43.9020652" lon="-102.3239071">
        <ele>908.1393789</ele>
      </trkpt>
      <trkpt lat="43.9030498" lon="-102.3263751">
        <ele>905.2834030</ele>
      </trkpt>
      <trkpt lat="43.9032493" lon="-102.3269025">
        <ele>905.4540910</ele>
      </trkpt>
      <trkpt lat="43.9033291" lon="-102.3272775">
        <ele>904.3537631</ele>
      </trkpt>
      <trkpt lat="43.9033558" lon="-102.3276350">
        <ele>904.4116751</ele>
      </trkpt>
      <trkpt lat="43.9033465" lon="-102.3280527">
        <ele>904.0581071</ele>
      </trkpt>
      <trkpt lat="43.9032450" lon="-102.3287228">
        <ele>905.1645310</ele>
      </trkpt>
      <trkpt lat="43.9030859" lon="-102.3298283">
        <ele>905.7436510</ele>
      </trkpt>
      <trkpt lat="43.9030758" lon="-102.3300688">
        <ele>905.3809390</ele>
      </trkpt>
      <trkpt lat="43.9030641" lon="-102.3303465">
        <ele>905.3596030</ele>
      </trkpt>
      <trkpt lat="43.9031181" lon="-102.3308204">
        <ele>906.3898270</ele>
      </trkpt>
      <trkpt lat="43.9032181" lon="-102.3312201">
        <ele>904.2714671</ele>
      </trkpt>
      <trkpt lat="43.9033431" lon="-102.3315629">
        <ele>904.0001951</ele>
      </trkpt>
      <trkpt lat="43.9035369" lon="-102.3320196">
        <ele>904.7835310</ele>
      </trkpt>
      <trkpt lat="43.9038770" lon="-102.3327350">
        <ele>904.9694590</ele>
      </trkpt>
      <trkpt lat="43.9053803" lon="-102.3359958">
        <ele>904.6951390</ele>
      </trkpt>
      <trkpt lat="43.9060181" lon="-102.3368987">
        <ele>903.9392351</ele>
      </trkpt>
      <trkpt lat="43.9071692" lon="-102.3384772">
        <ele>904.3842431</ele>
      </trkpt>
      <trkpt lat="43.9084529" lon="-102.3401384">
        <ele>904.9603150</ele>
      </trkpt>
      <trkpt lat="43.9088241" lon="-102.3405381">
        <ele>904.1251631</ele>
      </trkpt>
      <trkpt lat="43.9095345" lon="-102.3413285">
        <ele>903.8752271</ele>
      </trkpt>
      <trkpt lat="43.9103195" lon="-102.3421706">
        <ele>904.1373551</ele>
      </trkpt>
      <trkpt lat="43.9111180" lon="-102.3430298">
        <ele>904.0763951</ele>
      </trkpt>
      <trkpt lat="43.9114127" lon="-102.3434002">
        <ele>904.4726351</ele>
      </trkpt>
      <trkpt lat="43.9116630" lon="-102.3438394">
        <ele>904.4269151</ele>
      </trkpt>
      <trkpt lat="43.9118867" lon="-102.3443460">
        <ele>904.2318431</ele>
      </trkpt>
      <trkpt lat="43.9121149" lon="-102.3448977">
        <ele>903.8691311</ele>
      </trkpt>
      <trkpt lat="43.9128288" lon="-102.3466653">
        <ele>903.9361871</ele>
      </trkpt>
      <trkpt lat="43.9136072" lon="-102.3485552">
        <ele>908.9074749</ele>
      </trkpt>
      <trkpt lat="43.9138241" lon="-102.3491162">
        <ele>909.2305629</ele>
      </trkpt>
      <trkpt lat="43.9139546" lon="-102.3494036">
        <ele>910.1449629</ele>
      </trkpt>
      <trkpt lat="43.9142004" lon="-102.3498277">
        <ele>910.5869229</ele>
      </trkpt>
      <trkpt lat="43.9145054" lon="-102.3502206">
        <ele>911.2239548</ele>
      </trkpt>
      <trkpt lat="43.9162858" lon="-102.3517892">
        <ele>909.8797869</ele>
      </trkpt>
      <trkpt lat="43.9163825" lon="-102.3519160">
        <ele>909.9864669</ele>
      </trkpt>
      <trkpt lat="43.9164962" lon="-102.3521017">
        <ele>910.1327709</ele>
      </trkpt>
      <trkpt lat="43.9165432" lon="-102.3522772">
        <ele>910.0931469</ele>
      </trkpt>
      <trkpt lat="43.9165669" lon="-102.3525814">
        <ele>910.0321869</ele>
      </trkpt>
      <trkpt lat="43.9165402" lon="-102.3528365">
        <ele>910.6966509</ele>
      </trkpt>
      <trkpt lat="43.9164290" lon="-102.3531052">
        <ele>911.1873788</ele>
      </trkpt>
      <trkpt lat="43.9162452" lon="-102.3533017">
        <ele>909.9011229</ele>
      </trkpt>
      <trkpt lat="43.9153344" lon="-102.3538286">
        <ele>898.9679472</ele>
      </trkpt>
      <trkpt lat="43.9138123" lon="-102.3546267">
        <ele>892.2288194</ele>
      </trkpt>
      <trkpt lat="43.9134746" lon="-102.3548405">
        <ele>892.3202594</ele>
      </trkpt>
      <trkpt lat="43.9131490" lon="-102.3550964">
        <ele>892.0306995</ele>
      </trkpt>
      <trkpt lat="43.9124229" lon="-102.3557329">
        <ele>888.8912596</ele>
      </trkpt>
      <trkpt lat="43.9099227" lon="-102.3580208">
        <ele>877.2966679</ele>
      </trkpt>
      <trkpt lat="43.9097003" lon="-102.3582948">
        <ele>873.8310920</ele>
      </trkpt>
      <trkpt lat="43.9095367" lon="-102.3586117">
        <ele>871.7950281</ele>
      </trkpt>
      <trkpt lat="43.9094633" lon="-102.3588664">
        <ele>870.8562441</ele>
      </trkpt>
      <trkpt lat="43.9094300" lon="-102.3590999">
        <ele>868.5092842</ele>
      </trkpt>
      <trkpt lat="43.9094070" lon="-102.3596601">
        <ele>865.5740603</ele>
      </trkpt>
      <trkpt lat="43.9094196" lon="-102.3600109">
        <ele>862.4468124</ele>
      </trkpt>
      <trkpt lat="43.9094841" lon="-102.3602687">
        <ele>861.7122444</ele>
      </trkpt>
      <trkpt lat="43.9095789" lon="-102.3604743">
        <ele>860.8283245</ele>
      </trkpt>
      <trkpt lat="43.9096758" lon="-102.3606333">
        <ele>859.5542605</ele>
      </trkpt>
      <trkpt lat="43.9097981" lon="-102.3608033">
        <ele>858.1277965</ele>
      </trkpt>
      <trkpt lat="43.9099136" lon="-102.3609842">
        <ele>857.5730606</ele>
      </trkpt>
      <trkpt lat="43.9100399" lon="-102.3612290">
        <ele>855.9271406</ele>
      </trkpt>
      <trkpt lat="43.9100804" lon="-102.3615178">
        <ele>852.6444447</ele>
      </trkpt>
      <trkpt lat="43.9100814" lon="-102.3617266">
        <ele>849.6909328</ele>
      </trkpt>
      <trkpt lat="43.9100328" lon="-102.3619509">
        <ele>850.1298448</ele>
      </trkpt>
      <trkpt lat="43.9099662" lon="-102.3621460">
        <ele>849.6726448</ele>
      </trkpt>
      <trkpt lat="43.9098710" lon="-102.3623173">
        <ele>848.7308128</ele>
      </trkpt>
      <trkpt lat="43.9097354" lon="-102.3624459">
        <ele>847.0086929</ele>
      </trkpt>
      <trkpt lat="43.9094870" lon="-102.3625659">
        <ele>843.8875410</ele>
      </trkpt>
      <trkpt lat="43.9092240" lon="-102.3626992">
        <ele>842.5586130</ele>
      </trkpt>
      <trkpt lat="43.9089623" lon="-102.3628735">
        <ele>839.4801331</ele>
      </trkpt>
      <trkpt lat="43.9081260" lon="-102.3636646">
        <ele>834.2832933</ele>
      </trkpt>
      <trkpt lat="43.9074477" lon="-102.3644139">
        <ele>824.6912376</ele>
      </trkpt>
      <trkpt lat="43.9067475" lon="-102.3652479">
        <ele>825.4837176</ele>
      </trkpt>
      <trkpt lat="43.9064755" lon="-102.3656954">
        <ele>828.9828215</ele>
      </trkpt>
      <trkpt lat="43.9063210" lon="-102.3661066">
        <ele>830.9945014</ele>
      </trkpt>
      <trkpt lat="43.9062470" lon="-102.3665029">
        <ele>832.5245974</ele>
      </trkpt>
      <trkpt lat="43.9062466" lon="-102.3669930">
        <ele>832.4179174</ele>
      </trkpt>
      <trkpt lat="43.9063487" lon="-102.3674977">
        <ele>831.4395094</ele>
      </trkpt>
      <trkpt lat="43.9081453" lon="-102.3746461">
        <ele>828.6292535</ele>
      </trkpt>
      <trkpt lat="43.9084296" lon="-102.3754933">
        <ele>831.4821814</ele>
      </trkpt>
      <trkpt lat="43.9102381" lon="-102.3798261">
        <ele>831.6437254</ele>
      </trkpt>
      <trkpt lat="43.9103400" lon="-102.3802180">
        <ele>830.0191414</ele>
      </trkpt>
      <trkpt lat="43.9103850" lon="-102.3806792">
        <ele>831.2261494</ele>
      </trkpt>
      <trkpt lat="43.9103585" lon="-102.3811048">
        <ele>829.6229015</ele>
      </trkpt>
      <trkpt lat="43.9102614" lon="-102.3816207">
        <ele>829.5375575</ele>
      </trkpt>
      <trkpt lat="43.9099854" lon="-102.3822394">
        <ele>830.9000134</ele>
      </trkpt>
      <trkpt lat="43.9087684" lon="-102.3844762">
        <ele>826.1695176</ele>
      </trkpt>
      <trkpt lat="43.9085958" lon="-102.3849234">
        <ele>825.7824216</ele>
      </trkpt>
      <trkpt lat="43.9085381" lon="-102.3854084">
        <ele>828.5652455</ele>
      </trkpt>
      <trkpt lat="43.9085680" lon="-102.3858679">
        <ele>829.7996854</ele>
      </trkpt>
      <trkpt lat="43.9086688" lon="-102.3863883">
        <ele>831.1926214</ele>
      </trkpt>
      <trkpt lat="43.9090021" lon="-102.3879671">
        <ele>827.0473415</ele>
      </trkpt>
      <trkpt lat="43.9093196" lon="-102.3888935">
        <ele>824.8619256</ele>
      </trkpt>
      <trkpt lat="43.9097706" lon="-102.3898176">
        <ele>830.6531254</ele>
      </trkpt>
      <trkpt lat="43.9099090" lon="-102.3902347">
        <ele>828.9828215</ele>
      </trkpt>
      <trkpt lat="43.9099115" lon="-102.3906572">
        <ele>831.9637654</ele>
      </trkpt>
      <trkpt lat="43.9098268" lon="-102.3910179">
        <ele>830.8329574</ele>
      </trkpt>
      <trkpt lat="43.9094619" lon="-102.3918714">
        <ele>824.8863096</ele>
      </trkpt>
      <trkpt lat="43.9093169" lon="-102.3922978">
        <ele>824.0603016</ele>
      </trkpt>
      <trkpt lat="43.9092791" lon="-102.3927611">
        <ele>825.1271016</ele>
      </trkpt>
      <trkpt lat="43.9093548" lon="-102.3932836">
        <ele>825.1514856</ele>
      </trkpt>
      <trkpt lat="43.9099835" lon="-102.3964936">
        <ele>819.5797418</ele>
      </trkpt>
      <trkpt lat="43.9100901" lon="-102.3968397">
        <ele>818.4672218</ele>
      </trkpt>
      <trkpt lat="43.9102257" lon="-102.3971202">
        <ele>817.8667658</ele>
      </trkpt>
      <trkpt lat="43.9104898" lon="-102.3974869">
        <ele>818.3453018</ele>
      </trkpt>
      <trkpt lat="43.9108029" lon="-102.3979136">
        <ele>820.9970617</ele>
      </trkpt>
      <trkpt lat="43.9110831" lon="-102.3983537">
        <ele>818.5403738</ele>
      </trkpt>
      <trkpt lat="43.9113369" lon="-102.3988575">
        <ele>819.8601578</ele>
      </trkpt>
      <trkpt lat="43.9117488" lon="-102.3999111">
        <ele>814.7059899</ele>
      </trkpt>
      <trkpt lat="43.9118022" lon="-102.4003432">
        <ele>815.6508699</ele>
      </trkpt>
      <trkpt lat="43.9118018" lon="-102.4007170">
        <ele>814.4133819</ele>
      </trkpt>
      <trkpt lat="43.9116268" lon="-102.4030154">
        <ele>801.2490704</ele>
      </trkpt>
      <trkpt lat="43.9115111" lon="-102.4039471">
        <ele>797.0275905</ele>
      </trkpt>
      <trkpt lat="43.9113642" lon="-102.4045386">
        <ele>793.3242706</ele>
      </trkpt>
      <trkpt lat="43.9109973" lon="-102.4056819">
        <ele>787.0240548</ele>
      </trkpt>
      <trkpt lat="43.9106171" lon="-102.4069518">
        <ele>777.9806391</ele>
      </trkpt>
      <trkpt lat="43.9105243" lon="-102.4076371">
        <ele>777.9471111</ele>
      </trkpt>
      <trkpt lat="43.9104886" lon="-102.4085579">
        <ele>772.0248473</ele>
      </trkpt>
      <trkpt lat="43.9104386" lon="-102.4091933">
        <ele>768.3398154</ele>
      </trkpt>
      <trkpt lat="43.9102887" lon="-102.4099000">
        <ele>767.2730154</ele>
      </trkpt>
      <trkpt lat="43.9100246" lon="-102.4108422">
        <ele>765.4320235</ele>
      </trkpt>
      <trkpt lat="43.9098533" lon="-102.4115561">
        <ele>763.0667756</ele>
      </trkpt>
      <trkpt lat="43.9097747" lon="-102.4121985">
        <ele>761.4147596</ele>
      </trkpt>
      <trkpt lat="43.9097676" lon="-102.4127625">
        <ele>759.5554797</ele>
      </trkpt>
      <trkpt lat="43.9097962" lon="-102.4142187">
        <ele>761.9451116</ele>
      </trkpt>
      <trkpt lat="43.9097533" lon="-102.4148397">
        <ele>762.0944636</ele>
      </trkpt>
      <trkpt lat="43.9096463" lon="-102.4153394">
        <ele>762.2712476</ele>
      </trkpt>
      <trkpt lat="43.9095220" lon="-102.4157171">
        <ele>762.4205996</ele>
      </trkpt>
      <trkpt lat="43.9093038" lon="-102.4162421">
        <ele>763.2953756</ele>
      </trkpt>
      <trkpt lat="43.9090114" lon="-102.4167143">
        <ele>763.7220956</ele>
      </trkpt>
      <trkpt lat="43.9081227" lon="-102.4179521">
        <ele>768.8579754</ele>
      </trkpt>
      <trkpt lat="43.9067430" lon="-102.4198799">
        <ele>778.2366711</ele>
      </trkpt>
      <trkpt lat="43.9059526" lon="-102.4209164">
        <ele>783.9150949</ele>
      </trkpt>
      <trkpt lat="43.9056592" lon="-102.4211390">
        <ele>787.1795028</ele>
      </trkpt>
      <trkpt lat="43.9053195" lon="-102.4212708">
        <ele>788.6943588</ele>
      </trkpt>
      <trkpt lat="43.9047663" lon="-102.4213214">
        <ele>794.8421746</ele>
      </trkpt>
      <trkpt lat="43.9044987" lon="-102.4214609">
        <ele>796.2747345</ele>
      </trkpt>
      <trkpt lat="43.9042941" lon="-102.4216233">
        <ele>797.2470465</ele>
      </trkpt>
      <trkpt lat="43.9040976" lon="-102.4217832">
        <ele>799.9018544</ele>
      </trkpt>
      <trkpt lat="43.9039330" lon="-102.4218868">
        <ele>802.0141183</ele>
      </trkpt>
      <trkpt lat="43.9037201" lon="-102.4218996">
        <ele>802.6633423</ele>
      </trkpt>
      <trkpt lat="43.9033846" lon="-102.4218077">
        <ele>806.7659502</ele>
      </trkpt>
      <trkpt lat="43.9024880" lon="-102.4214119">
        <ele>813.6087100</ele>
      </trkpt>
      <trkpt lat="43.9022571" lon="-102.4213342">
        <ele>814.4743419</ele>
      </trkpt>
      <trkpt lat="43.9021700" lon="-102.4213056">
        <ele>814.7334219</ele>
      </trkpt>
      <trkpt lat="43.9018670" lon="-102.4212419">
        <ele>814.9193499</ele>
      </trkpt>
      <trkpt lat="43.9015025" lon="-102.4212185">
        <ele>820.3905097</ele>
      </trkpt>
      <trkpt lat="43.9010434" lon="-102.4212511">
        <ele>824.4443496</ele>
      </trkpt>
      <trkpt lat="43.9006962" lon="-102.4213390">
        <ele>825.9622536</ele>
      </trkpt>
      <trkpt lat="43.9005117" lon="-102.4214434">
        <ele>827.3338535</ele>
      </trkpt>
      <trkpt lat="43.9003346" lon="-102.4216435">
        <ele>829.3059095</ele>
      </trkpt>
      <trkpt lat="43.9001136" lon="-102.4219832">
        <ele>831.0859414</ele>
      </trkpt>
      <trkpt lat="43.8999538" lon="-102.4222241">
        <ele>833.2561173</ele>
      </trkpt>
      <trkpt lat="43.8997571" lon="-102.4223880">
        <ele>834.6246693</ele>
      </trkpt>
      <trkpt lat="43.8994851" lon="-102.4224965">
        <ele>837.9622292</ele>
      </trkpt>
      <trkpt lat="43.8988115" lon="-102.4227592">
        <ele>843.9180210</ele>
      </trkpt>
      <trkpt lat="43.8985130" lon="-102.4229932">
        <ele>844.7684130</ele>
      </trkpt>
      <trkpt lat="43.8982597" lon="-102.4233568">
        <ele>849.4318528</ele>
      </trkpt>
      <trkpt lat="43.8977786" lon="-102.4242172">
        <ele>855.0096926</ele>
      </trkpt>
      <trkpt lat="43.8968510" lon="-102.4261169">
        <ele>866.1592763</ele>
      </trkpt>
      <trkpt lat="43.8965531" lon="-102.4265771">
        <ele>866.5341803</ele>
      </trkpt>
      <trkpt lat="43.8948713" lon="-102.4285821">
        <ele>867.9393082</ele>
      </trkpt>
      <trkpt lat="43.8943859" lon="-102.4291341">
        <ele>867.5491642</ele>
      </trkpt>
      <trkpt lat="43.8940718" lon="-102.4295434">
        <ele>866.6378123</ele>
      </trkpt>
      <trkpt lat="43.8939195" lon="-102.4298289">
        <ele>866.6439083</ele>
      </trkpt>
      <trkpt lat="43.8938256" lon="-102.4301287">
        <ele>866.4366443</ele>
      </trkpt>
      <trkpt lat="43.8937504" lon="-102.4304512">
        <ele>866.4854123</ele>
      </trkpt>
      <trkpt lat="43.8937118" lon="-102.4307664">
        <ele>866.6774363</ele>
      </trkpt>
      <trkpt lat="43.8937197" lon="-102.4333862">
        <ele>867.6558442</ele>
      </trkpt>
      <trkpt lat="43.8937268" lon="-102.4395466">
        <ele>869.4480682</ele>
      </trkpt>
      <trkpt lat="43.8937768" lon="-102.4544373">
        <ele>867.3571402</ele>
      </trkpt>
      <trkpt lat="43.8937339" lon="-102.4550940">
        <ele>867.1498763</ele>
      </trkpt>
      <trkpt lat="43.8935468" lon="-102.4557530">
        <ele>867.1529243</ele>
      </trkpt>
      <trkpt lat="43.8933627" lon="-102.4562076">
        <ele>867.1955962</ele>
      </trkpt>
      <trkpt lat="43.8931563" lon="-102.4565491">
        <ele>867.1559723</ele>
      </trkpt>
      <trkpt lat="43.8928987" lon="-102.4568857">
        <ele>867.2596042</ele>
      </trkpt>
      <trkpt lat="43.8925685" lon="-102.4571775">
        <ele>867.2809402</ele>
      </trkpt>
      <trkpt lat="43.8922280" lon="-102.4573917">
        <ele>867.3510442</ele>
      </trkpt>
      <trkpt lat="43.8918423" lon="-102.4575425">
        <ele>867.4424842</ele>
      </trkpt>
      <trkpt lat="43.8858586" lon="-102.4576273">
        <ele>868.6312042</ele>
      </trkpt>
      <trkpt lat="43.8832236" lon="-102.4576144">
        <ele>869.1585082</ele>
      </trkpt>
      <trkpt lat="43.8803568" lon="-102.4575116">
        <ele>873.0538521</ele>
      </trkpt>
      <trkpt lat="43.8744840" lon="-102.4575526">
        <ele>875.6995160</ele>
      </trkpt>
      <trkpt lat="43.8575360" lon="-102.4575599">
        <ele>872.9319321</ele>
      </trkpt>
      <trkpt lat="43.8533354" lon="-102.4575075">
        <ele>861.2062764</ele>
      </trkpt>
      <trkpt lat="43.8529117" lon="-102.4575413">
        <ele>860.0937565</ele>
      </trkpt>
      <trkpt lat="43.8525224" lon="-102.4576441">
        <ele>858.1034125</ele>
      </trkpt>
      <trkpt lat="43.8521658" lon="-102.4578390">
        <ele>855.5918606</ele>
      </trkpt>
      <trkpt lat="43.8518274" lon="-102.4581453">
        <ele>854.0952927</ele>
      </trkpt>
      <trkpt lat="43.8515318" lon="-102.4585276">
        <ele>851.1722608</ele>
      </trkpt>
      <trkpt lat="43.8511321" lon="-102.4590558">
        <ele>847.9200449</ele>
      </trkpt>
      <trkpt lat="43.8507394" lon="-102.4596412">
        <ele>842.2629570</ele>
      </trkpt>
      <trkpt lat="43.8505467" lon="-102.4601266">
        <ele>841.5253411</ele>
      </trkpt>
      <trkpt lat="43.8504396" lon="-102.4605906">
        <ele>842.5677570</ele>
      </trkpt>
      <trkpt lat="43.8503611" lon="-102.4611616">
        <ele>843.4516770</ele>
      </trkpt>
      <trkpt lat="43.8503443" lon="-102.4618448">
        <ele>845.9601809</ele>
      </trkpt>
      <trkpt lat="43.8503611" lon="-102.4651306">
        <ele>843.5004450</ele>
      </trkpt>
      <trkpt lat="43.8504825" lon="-102.4949762">
        <ele>877.8574999</ele>
      </trkpt>
      <trkpt lat="43.8504039" lon="-102.4955615">
        <ele>877.7630119</ele>
      </trkpt>
      <trkpt lat="43.8502439" lon="-102.4960010">
        <ele>877.8635959</ele>
      </trkpt>
      <trkpt lat="43.8500684" lon="-102.4963539">
        <ele>878.0586679</ele>
      </trkpt>
      <trkpt lat="43.8498686" lon="-102.4966108">
        <ele>878.2720279</ele>
      </trkpt>
      <trkpt lat="43.8496758" lon="-102.4967822">
        <ele>878.3787079</ele>
      </trkpt>
      <trkpt lat="43.8495116" lon="-102.4968892">
        <ele>878.3878519</ele>
      </trkpt>
      <trkpt lat="43.8493403" lon="-102.4969892">
        <ele>878.4701479</ele>
      </trkpt>
      <trkpt lat="43.8489882" lon="-102.4970915">
        <ele>878.5768279</ele>
      </trkpt>
      <trkpt lat="43.8359650" lon="-102.4970522">
        <ele>882.8958437</ele>
      </trkpt>
      <trkpt lat="43.8214924" lon="-102.4970522">
        <ele>890.4853635</ele>
      </trkpt>
      <trkpt lat="43.8096438" lon="-102.4970570">
        <ele>888.3609076</ele>
      </trkpt>
      <trkpt lat="43.8092850" lon="-102.4970963">
        <ele>888.2633716</ele>
      </trkpt>
      <trkpt lat="43.8090014" lon="-102.4971688">
        <ele>888.3609076</ele>
      </trkpt>
      <trkpt lat="43.8086444" lon="-102.4973294">
        <ele>888.6016996</ele>
      </trkpt>
      <trkpt lat="43.8083098" lon="-102.4975653">
        <ele>889.0741395</ele>
      </trkpt>
      <trkpt lat="43.8079544" lon="-102.4979243">
        <ele>889.5953475</ele>
      </trkpt>
      <trkpt lat="43.8076276" lon="-102.4983607">
        <ele>889.4094195</ele>
      </trkpt>
      <trkpt lat="43.8074309" lon="-102.4987095">
        <ele>889.3697955</ele>
      </trkpt>
      <trkpt lat="43.8072573" lon="-102.4991668">
        <ele>889.3210275</ele>
      </trkpt>
      <trkpt lat="43.8071222" lon="-102.4996394">
        <ele>889.3728435</ele>
      </trkpt>
      <trkpt lat="43.8070298" lon="-102.5001579">
        <ele>889.5679155</ele>
      </trkpt>
      <trkpt lat="43.8070739" lon="-102.5080181">
        <ele>890.8389315</ele>
      </trkpt>
      <trkpt lat="43.8070389" lon="-102.5084729">
        <ele>890.8998915</ele>
      </trkpt>
      <trkpt lat="43.8069506" lon="-102.5090461">
        <ele>892.2349154</ele>
      </trkpt>
      <trkpt lat="43.8068266" lon="-102.5094586">
        <ele>893.2011314</ele>
      </trkpt>
      <trkpt lat="43.8066219" lon="-102.5099644">
        <ele>893.7162434</ele>
      </trkpt>
      <trkpt lat="43.8063601" lon="-102.5103451">
        <ele>894.8622914</ele>
      </trkpt>
      <trkpt lat="43.8060270" lon="-102.5107139">
        <ele>894.3654674</ele>
      </trkpt>
      <trkpt lat="43.8056106" lon="-102.5109875">
        <ele>895.5511393</ele>
      </trkpt>
      <trkpt lat="43.8051109" lon="-102.5111422">
        <ele>895.7096353</ele>
      </trkpt>
      <trkpt lat="43.8047178" lon="-102.5111376">
        <ele>894.0941954</ele>
      </trkpt>
      <trkpt lat="43.8044009" lon="-102.5110873">
        <ele>891.4393875</ele>
      </trkpt>
      <trkpt lat="43.8040848" lon="-102.5109673">
        <ele>887.6994916</ele>
      </trkpt>
      <trkpt lat="43.8037973" lon="-102.5107939">
        <ele>886.1968276</ele>
      </trkpt>
      <trkpt lat="43.8032687" lon="-102.5104148">
        <ele>881.3535558</ele>
      </trkpt>
      <trkpt lat="43.8032257" lon="-102.5103901">
        <ele>880.7348118</ele>
      </trkpt>
      <trkpt lat="43.8028266" lon="-102.5102023">
        <ele>877.4490679</ele>
      </trkpt>
      <trkpt lat="43.8023388" lon="-102.5100358">
        <ele>874.4285000</ele>
      </trkpt>
      <trkpt lat="43.8011124" lon="-102.5097191">
        <ele>865.8605723</ele>
      </trkpt>
      <trkpt lat="43.8010334" lon="-102.5097015">
        <ele>865.0924763</ele>
      </trkpt>
      <trkpt lat="43.7997999" lon="-102.5093758">
        <ele>860.8740445</ele>
      </trkpt>
      <trkpt lat="43.7995070" lon="-102.5093295">
        <ele>860.4320845</ele>
      </trkpt>
      <trkpt lat="43.7992913" lon="-102.5093204">
        <ele>859.7981005</ele>
      </trkpt>
      <trkpt lat="43.7989975" lon="-102.5093803">
        <ele>857.1890126</ele>
      </trkpt>
      <trkpt lat="43.7987066" lon="-102.5095053">
        <ele>855.3632606</ele>
      </trkpt>
      <trkpt lat="43.7983853" lon="-102.5096887">
        <ele>855.0737006</ele>
      </trkpt>
      <trkpt lat="43.7980792" lon="-102.5099586">
        <ele>853.4064447</ele>
      </trkpt>
      <trkpt lat="43.7978200" lon="-102.5103119">
        <ele>851.4161008</ele>
      </trkpt>
      <trkpt lat="43.7968223" lon="-102.5116932">
        <ele>847.7981249</ele>
      </trkpt>
      <trkpt lat="43.7935666" lon="-102.5162437">
        <ele>848.1090209</ele>
      </trkpt>
      <trkpt lat="43.7920953" lon="-102.5183020">
        <ele>843.7199010</ele>
      </trkpt>
      <trkpt lat="43.7913843" lon="-102.5192854">
        <ele>844.8324210</ele>
      </trkpt>
      <trkpt lat="43.7910970" lon="-102.5196970">
        <ele>844.8537570</ele>
      </trkpt>
      <trkpt lat="43.7909348" lon="-102.5200023">
        <ele>842.7353970</ele>
      </trkpt>
      <trkpt lat="43.7907430" lon="-102.5204431">
        <ele>842.4580290</ele>
      </trkpt>
      <trkpt lat="43.7906002" lon="-102.5208361">
        <ele>840.7145731</ele>
      </trkpt>
      <trkpt lat="43.7900524" lon="-102.5226004">
        <ele>845.4572609</ele>
      </trkpt>
      <trkpt lat="43.7897371" lon="-102.5236607">
        <ele>846.8166689</ele>
      </trkpt>
      <trkpt lat="43.7895708" lon="-102.5242763">
        <ele>846.8044769</ele>
      </trkpt>
      <trkpt lat="43.7871484" lon="-102.5346014">
        <ele>847.7615489</ele>
      </trkpt>
      <trkpt lat="43.7870349" lon="-102.5350298">
        <ele>847.9322369</ele>
      </trkpt>
      <trkpt lat="43.7869395" lon="-102.5352997">
        <ele>847.9383329</ele>
      </trkpt>
      <trkpt lat="43.7868551" lon="-102.5355138">
        <ele>847.9230929</ele>
      </trkpt>
      <trkpt lat="43.7867329" lon="-102.5357380">
        <ele>848.0023409</ele>
      </trkpt>
      <trkpt lat="43.7866056" lon="-102.5359543">
        <ele>848.1730289</ele>
      </trkpt>
      <trkpt lat="43.7865061" lon="-102.5360919">
        <ele>848.2096049</ele>
      </trkpt>
      <trkpt lat="43.7863674" lon="-102.5362622">
        <ele>848.4564928</ele>
      </trkpt>
      <trkpt lat="43.7862281" lon="-102.5364074">
        <ele>848.6820448</ele>
      </trkpt>
      <trkpt lat="43.7860484" lon="-102.5365628">
        <ele>848.7795808</ele>
      </trkpt>
      <trkpt lat="43.7858987" lon="-102.5366662">
        <ele>848.8893088</ele>
      </trkpt>
      <trkpt lat="43.7856971" lon="-102.5367882">
        <ele>849.0142768</ele>
      </trkpt>
      <trkpt lat="43.7854867" lon="-102.5368756">
        <ele>849.2032528</ele>
      </trkpt>
      <trkpt lat="43.7852424" lon="-102.5369510">
        <ele>849.3587008</ele>
      </trkpt>
      <trkpt lat="43.7850060" lon="-102.5369822">
        <ele>849.5171968</ele>
      </trkpt>
      <trkpt lat="43.7780909" lon="-102.5369732">
        <ele>850.8674608</ele>
      </trkpt>
    </trkseg>
  </trk>
</gpx>