﻿<?xml version="1.0" encoding="utf-8"?>
<!--Adventure Cycling Association GPX file-->
<!--Copyright 2023 Adventure Cycling Association-->
<!--Publication Date: 2/21/2023 11:12:45 AM-->
<!--Route: TransAmerica-->
<!--Section: 03-->
<!--Version: 2022-->
<gpx xmlns:xsi="http://www.w3.org/2001/XMLSchema-instance" xsi:schemaLocation="http://www.topografix.com/GPX/1/1 http://www.topografix.com/GPX/1/1/gpx.xsd" creator="www.adventurecycling.org" version="1.1" xmlns="http://www.topografix.com/GPX/1/1">
  <trk>
    <name>TA03WAlt_Alt_2022</name>
    <trkseg>
      <trkpt lat="46.8726918" lon="-113.9919891">
        <ele>980.1026566</ele>
      </trkpt>
      <trkpt lat="46.8731208" lon="-113.9934324">
        <ele>979.3498007</ele>
      </trkpt>
      <trkpt lat="46.8720264" lon="-113.9941242">
        <ele>977.5941527</ele>
      </trkpt>
      <trkpt lat="46.8711264" lon="-113.9947042">
        <ele>976.6157447</ele>
      </trkpt>
      <trkpt lat="46.8700037" lon="-113.9953455">
        <ele>974.6314968</ele>
      </trkpt>
      <trkpt lat="46.8697515" lon="-113.9954930">
        <ele>974.4150888</ele>
      </trkpt>
      <trkpt lat="46.8688425" lon="-113.9960546">
        <ele>974.3663208</ele>
      </trkpt>
      <trkpt lat="46.8679241" lon="-113.9966447">
        <ele>972.2174809</ele>
      </trkpt>
      <trkpt lat="46.8676290" lon="-113.9968303">
        <ele>975.1679448</ele>
      </trkpt>
      <trkpt lat="46.8674364" lon="-113.9969732">
        <ele>976.0366248</ele>
      </trkpt>
      <trkpt lat="46.8672364" lon="-113.9970832">
        <ele>976.0610088</ele>
      </trkpt>
      <trkpt lat="46.8667964" lon="-113.9973042">
        <ele>976.5944087</ele>
      </trkpt>
      <trkpt lat="46.8660253" lon="-113.9974965">
        <ele>976.8138647</ele>
      </trkpt>
      <trkpt lat="46.8649688" lon="-113.9974965">
        <ele>977.0698967</ele>
      </trkpt>
      <trkpt lat="46.8639932" lon="-113.9974728">
        <ele>977.0272247</ele>
      </trkpt>
      <trkpt lat="46.8630462" lon="-113.9974478">
        <ele>976.7833847</ele>
      </trkpt>
      <trkpt lat="46.8620516" lon="-113.9974383">
        <ele>976.6157447</ele>
      </trkpt>
      <trkpt lat="46.8615376" lon="-113.9974394">
        <ele>976.5151608</ele>
      </trkpt>
      <trkpt lat="46.8610950" lon="-113.9974394">
        <ele>976.5151608</ele>
      </trkpt>
      <trkpt lat="46.8601432" lon="-113.9974430">
        <ele>976.5151608</ele>
      </trkpt>
      <trkpt lat="46.8600147" lon="-113.9974525">
        <ele>976.5151608</ele>
      </trkpt>
      <trkpt lat="46.8591962" lon="-113.9974525">
        <ele>976.5151608</ele>
      </trkpt>
      <trkpt lat="46.8582397" lon="-113.9974240">
        <ele>976.5151608</ele>
      </trkpt>
      <trkpt lat="46.8571499" lon="-113.9974192">
        <ele>976.5151608</ele>
      </trkpt>
      <trkpt lat="46.8568358" lon="-113.9974192">
        <ele>976.6157447</ele>
      </trkpt>
      <trkpt lat="46.8524528" lon="-113.9974145">
        <ele>976.8321527</ele>
      </trkpt>
      <trkpt lat="46.8506512" lon="-113.9974132">
        <ele>976.1615928</ele>
      </trkpt>
      <trkpt lat="46.8497712" lon="-113.9973942">
        <ele>975.6830568</ele>
      </trkpt>
      <trkpt lat="46.8433496" lon="-113.9973190">
        <ele>981.1389766</ele>
      </trkpt>
      <trkpt lat="46.8424496" lon="-113.9973300">
        <ele>983.0683605</ele>
      </trkpt>
      <trkpt lat="46.8420251" lon="-113.9972762">
        <ele>983.2878165</ele>
      </trkpt>
      <trkpt lat="46.8416919" lon="-113.9972643">
        <ele>983.1018885</ele>
      </trkpt>
      <trkpt lat="46.8415016" lon="-113.9972762">
        <ele>983.5347045</ele>
      </trkpt>
      <trkpt lat="46.8413469" lon="-113.9974308">
        <ele>983.9888565</ele>
      </trkpt>
      <trkpt lat="46.8411447" lon="-113.9977402">
        <ele>983.3944965</ele>
      </trkpt>
      <trkpt lat="46.8409365" lon="-113.9984837">
        <ele>980.5049926</ele>
      </trkpt>
      <trkpt lat="46.8403654" lon="-114.0001970">
        <ele>977.1857207</ele>
      </trkpt>
      <trkpt lat="46.8395326" lon="-114.0027192">
        <ele>973.2416089</ele>
      </trkpt>
      <trkpt lat="46.8380573" lon="-114.0064787">
        <ele>973.1623609</ele>
      </trkpt>
      <trkpt lat="46.8374149" lon="-114.0080492">
        <ele>973.2477049</ele>
      </trkpt>
      <trkpt lat="46.8353209" lon="-114.0130698">
        <ele>983.1689445</ele>
      </trkpt>
      <trkpt lat="46.8350116" lon="-114.0136171">
        <ele>983.1476085</ele>
      </trkpt>
      <trkpt lat="46.8344643" lon="-114.0156159">
        <ele>973.6317528</ele>
      </trkpt>
      <trkpt lat="46.8342740" lon="-114.0166866">
        <ele>970.6203289</ele>
      </trkpt>
      <trkpt lat="46.8342264" lon="-114.0184950">
        <ele>969.5047610</ele>
      </trkpt>
      <trkpt lat="46.8342464" lon="-114.0194850">
        <ele>969.1786250</ele>
      </trkpt>
      <trkpt lat="46.8342464" lon="-114.0200850">
        <ele>968.9408810</ele>
      </trkpt>
      <trkpt lat="46.8342564" lon="-114.0207350">
        <ele>968.4897770</ele>
      </trkpt>
      <trkpt lat="46.8342464" lon="-114.0211850">
        <ele>968.3556650</ele>
      </trkpt>
      <trkpt lat="46.8342464" lon="-114.0215150">
        <ele>968.1758330</ele>
      </trkpt>
      <trkpt lat="46.8342264" lon="-114.0223850">
        <ele>967.8649370</ele>
      </trkpt>
      <trkpt lat="46.8342364" lon="-114.0229050">
        <ele>967.7704490</ele>
      </trkpt>
      <trkpt lat="46.8342364" lon="-114.0246860">
        <ele>967.2583850</ele>
      </trkpt>
      <trkpt lat="46.8342364" lon="-114.0248850">
        <ele>967.1638971</ele>
      </trkpt>
      <trkpt lat="46.8342364" lon="-114.0251950">
        <ele>967.0633131</ele>
      </trkpt>
      <trkpt lat="46.8342364" lon="-114.0276860">
        <ele>966.3927531</ele>
      </trkpt>
      <trkpt lat="46.8342364" lon="-114.0284850">
        <ele>966.4567611</ele>
      </trkpt>
      <trkpt lat="46.8342364" lon="-114.0289650">
        <ele>966.4598091</ele>
      </trkpt>
      <trkpt lat="46.8342364" lon="-114.0294850">
        <ele>966.4110411</ele>
      </trkpt>
      <trkpt lat="46.8342364" lon="-114.0297860">
        <ele>966.3592251</ele>
      </trkpt>
      <trkpt lat="46.8342364" lon="-114.0303950">
        <ele>966.3683691</ele>
      </trkpt>
      <trkpt lat="46.8342364" lon="-114.0305850">
        <ele>966.2830251</ele>
      </trkpt>
      <trkpt lat="46.8342364" lon="-114.0316050">
        <ele>965.8593531</ele>
      </trkpt>
      <trkpt lat="46.8342364" lon="-114.0321850">
        <ele>965.7465771</ele>
      </trkpt>
      <trkpt lat="46.8342264" lon="-114.0328850">
        <ele>965.4631131</ele>
      </trkpt>
      <trkpt lat="46.8342264" lon="-114.0337850">
        <ele>965.0699211</ele>
      </trkpt>
      <trkpt lat="46.8342264" lon="-114.0340860">
        <ele>964.9601931</ele>
      </trkpt>
      <trkpt lat="46.8342264" lon="-114.0353950">
        <ele>964.4542251</ele>
      </trkpt>
      <trkpt lat="46.8342264" lon="-114.0356650">
        <ele>964.3749771</ele>
      </trkpt>
      <trkpt lat="46.8342264" lon="-114.0375150">
        <ele>964.0640811</ele>
      </trkpt>
      <trkpt lat="46.8342264" lon="-114.0379360">
        <ele>963.9543532</ele>
      </trkpt>
      <trkpt lat="46.8342026" lon="-114.0392677">
        <ele>963.6556492</ele>
      </trkpt>
      <trkpt lat="46.8341788" lon="-114.0402671">
        <ele>963.4544812</ele>
      </trkpt>
      <trkpt lat="46.8342002" lon="-114.0407460">
        <ele>963.3874252</ele>
      </trkpt>
      <trkpt lat="46.8342002" lon="-114.0410050">
        <ele>963.3508492</ele>
      </trkpt>
      <trkpt lat="46.8342740" lon="-114.0416710">
        <ele>963.3660892</ele>
      </trkpt>
      <trkpt lat="46.8343692" lon="-114.0428845">
        <ele>963.0734812</ele>
      </trkpt>
      <trkpt lat="46.8341764" lon="-114.0428932">
        <ele>963.0612892</ele>
      </trkpt>
      <trkpt lat="46.8332764" lon="-114.0428932">
        <ele>962.8906012</ele>
      </trkpt>
      <trkpt lat="46.8330064" lon="-114.0428932">
        <ele>962.8540252</ele>
      </trkpt>
      <trkpt lat="46.8322264" lon="-114.0428932">
        <ele>962.6040892</ele>
      </trkpt>
      <trkpt lat="46.8305144" lon="-114.0429083">
        <ele>961.2507772</ele>
      </trkpt>
      <trkpt lat="46.8305144" lon="-114.0441694">
        <ele>961.3605052</ele>
      </trkpt>
      <trkpt lat="46.8305144" lon="-114.0449094">
        <ele>961.3666012</ele>
      </trkpt>
      <trkpt lat="46.8305144" lon="-114.0451394">
        <ele>961.3574572</ele>
      </trkpt>
      <trkpt lat="46.8305244" lon="-114.0453504">
        <ele>961.3696492</ele>
      </trkpt>
      <trkpt lat="46.8305344" lon="-114.0469894">
        <ele>961.5311932</ele>
      </trkpt>
      <trkpt lat="46.8305444" lon="-114.0475804">
        <ele>961.5068092</ele>
      </trkpt>
      <trkpt lat="46.8305444" lon="-114.0481294">
        <ele>961.4915692</ele>
      </trkpt>
      <trkpt lat="46.8305544" lon="-114.0488194">
        <ele>961.4671852</ele>
      </trkpt>
      <trkpt lat="46.8304864" lon="-114.0504632">
        <ele>960.8301533</ele>
      </trkpt>
      <trkpt lat="46.8309665" lon="-114.0504512">
        <ele>960.7813853</ele>
      </trkpt>
      <trkpt lat="46.8311807" lon="-114.0502846">
        <ele>960.9246413</ele>
      </trkpt>
      <trkpt lat="46.8315614" lon="-114.0498801">
        <ele>961.2629692</ele>
      </trkpt>
      <trkpt lat="46.8318986" lon="-114.0497557">
        <ele>961.2599212</ele>
      </trkpt>
      <trkpt lat="46.8322990" lon="-114.0496660">
        <ele>961.2964972</ele>
      </trkpt>
      <trkpt lat="46.8325608" lon="-114.0498325">
        <ele>961.1440972</ele>
      </trkpt>
      <trkpt lat="46.8329852" lon="-114.0502349">
        <ele>961.3178332</ele>
      </trkpt>
    </trkseg>
  </trk>
</gpx>