<?xml version="1.0" encoding="UTF-8" standalone="no"?>
<!-- Created with Inkscape (http://www.inkscape.org/) -->

<svg
   width="120"
   height="120"
   viewBox="0 0 120 120"
   version="1.1"
   id="svg5"
   sodipodi:docname="md0_vector_03.svg"
   inkscape:version="1.2.1 (9c6d41e410, 2022-07-14)"
   xmlns:inkscape="http://www.inkscape.org/namespaces/inkscape"
   xmlns:sodipodi="http://sodipodi.sourceforge.net/DTD/sodipodi-0.dtd"
   xmlns:xlink="http://www.w3.org/1999/xlink"
   xmlns="http://www.w3.org/2000/svg"
   xmlns:svg="http://www.w3.org/2000/svg"
   xmlns:rdf="http://www.w3.org/1999/02/22-rdf-syntax-ns#"
   xmlns:cc="http://creativecommons.org/ns#"
   xmlns:dc="http://purl.org/dc/elements/1.1/">
  <sodipodi:namedview
     id="namedview7"
     pagecolor="#505050"
     bordercolor="#eeeeee"
     borderopacity="1"
     inkscape:showpageshadow="0"
     inkscape:pageopacity="0"
     inkscape:pagecheckerboard="0"
     inkscape:deskcolor="#505050"
     inkscape:document-units="px"
     showgrid="true"
     inkscape:zoom="5.6568543"
     inkscape:cx="57.540814"
     inkscape:cy="54.447222"
     inkscape:window-width="1920"
     inkscape:window-height="1017"
     inkscape:window-x="-8"
     inkscape:window-y="-8"
     inkscape:window-maximized="1"
     inkscape:current-layer="layer1"
     showguides="false">
    <inkscape:grid
       type="xygrid"
       id="grid234"
       dotted="true"
       originx="0"
       originy="0"
       visible="false" />
    <sodipodi:guide
       position="0,120"
       orientation="0,120"
       id="guide7937"
       inkscape:locked="false" />
    <sodipodi:guide
       position="120,120"
       orientation="120,0"
       id="guide7939"
       inkscape:locked="false" />
    <sodipodi:guide
       position="120,0"
       orientation="0,-120"
       id="guide7941"
       inkscape:locked="false" />
    <sodipodi:guide
       position="0,0"
       orientation="-120,0"
       id="guide7943"
       inkscape:locked="false" />
    <sodipodi:guide
       position="60,60"
       orientation="-1,0"
       id="guide7945"
       inkscape:locked="false"
       inkscape:label=""
       inkscape:color="rgb(0,134,229)" />
    <sodipodi:guide
       position="60,60"
       orientation="0,1"
       id="guide7947"
       inkscape:locked="false"
       inkscape:label=""
       inkscape:color="rgb(0,134,229)" />
  </sodipodi:namedview>
  <defs
     id="defs2">
    <linearGradient
       inkscape:collect="always"
       id="linearGradient9725">
      <stop
         style="stop-color:#f6ff00;stop-opacity:1;"
         offset="0.05527391"
         id="stop9733" />
      <stop
         style="stop-color:#028200;stop-opacity:1;"
         offset="0.2974138"
         id="stop9735" />
      <stop
         style="stop-color:#624598;stop-opacity:1;"
         offset="0.46545383"
         id="stop9745" />
      <stop
         style="stop-color:#ff00f5;stop-opacity:1;"
         offset="0.58886915"
         id="stop9741" />
      <stop
         style="stop-color:#b6b6b6;stop-opacity:1;"
         offset="0.75589508"
         id="stop9743" />
      <stop
         style="stop-color:#dadada;stop-opacity:1;"
         offset="0.81405306"
         id="stop10473" />
      <stop
         style="stop-color:#000000;stop-opacity:1;"
         offset="0.94523329"
         id="stop9723" />
    </linearGradient>
    <linearGradient
       inkscape:collect="always"
       id="linearGradient3472">
      <stop
         style="stop-color:#000000;stop-opacity:1;"
         offset="0.24489796"
         id="stop3468" />
      <stop
         style="stop-color:#000000;stop-opacity:0;"
         offset="0.59821433"
         id="stop3480" />
      <stop
         style="stop-color:#000000;stop-opacity:1;"
         offset="0.6434949"
         id="stop3482" />
      <stop
         style="stop-color:#000000;stop-opacity:1;"
         offset="1"
         id="stop3470" />
    </linearGradient>
    <linearGradient
       inkscape:collect="always"
       id="linearGradient3464">
      <stop
         style="stop-color:#20ffff;stop-opacity:0;"
         offset="0.08390943"
         id="stop3460" />
      <stop
         style="stop-color:#1bffc9;stop-opacity:0.74486804;"
         offset="0.21100508"
         id="stop10481" />
      <stop
         style="stop-color:#17ff94;stop-opacity:0.49803922;"
         offset="0.39692426"
         id="stop10477" />
      <stop
         style="stop-color:#686ce6;stop-opacity:1;"
         offset="1"
         id="stop10479" />
      <stop
         style="stop-color:#b9ceff;stop-opacity:1;"
         offset="1"
         id="stop3462" />
    </linearGradient>
    <linearGradient
       inkscape:collect="always"
       id="linearGradient3456">
      <stop
         style="stop-color:#311900;stop-opacity:1;"
         offset="0"
         id="stop3452" />
      <stop
         style="stop-color:#3b7126;stop-opacity:0.81231672;"
         offset="0.26189879"
         id="stop3476" />
      <stop
         style="stop-color:#004a2e;stop-opacity:1;"
         offset="0.52636915"
         id="stop3478" />
      <stop
         style="stop-color:#071750;stop-opacity:0.45747802;"
         offset="0.75059503"
         id="stop9701" />
      <stop
         style="stop-color:#02b000;stop-opacity:0.5777126;"
         offset="0.84787017"
         id="stop10475" />
      <stop
         style="stop-color:#6e6e6e;stop-opacity:0;"
         offset="0.95334685"
         id="stop3454" />
    </linearGradient>
    <linearGradient
       id="linearGradient3436"
       inkscape:swatch="solid">
      <stop
         style="stop-color:#414141;stop-opacity:1;"
         offset="0"
         id="stop3434" />
    </linearGradient>
    <linearGradient
       inkscape:collect="always"
       xlink:href="#linearGradient3456"
       id="linearGradient3458"
       x1="-23.070166"
       y1="64.443649"
       x2="-16.075151"
       y2="64.443649"
       gradientUnits="userSpaceOnUse"
       gradientTransform="matrix(6.4862011,0,0,6.4862011,169.5512,-357.86801)"
       spreadMethod="pad" />
    <linearGradient
       inkscape:collect="always"
       xlink:href="#linearGradient3464"
       id="linearGradient3466"
       x1="-18.068745"
       y1="64.434952"
       x2="-11.173339"
       y2="64.434952"
       gradientUnits="userSpaceOnUse"
       gradientTransform="matrix(6.4862011,0,0,6.4862011,169.5512,-357.86801)" />
    <linearGradient
       inkscape:collect="always"
       xlink:href="#linearGradient3472"
       id="linearGradient3474"
       x1="-15.944056"
       y1="64.44735"
       x2="-9.1658375"
       y2="64.44735"
       gradientUnits="userSpaceOnUse"
       gradientTransform="matrix(6.4862011,0,0,6.4862011,169.5512,-357.86801)" />
    <linearGradient
       inkscape:collect="always"
       xlink:href="#linearGradient9725"
       id="linearGradient9727"
       x1="3.8968594"
       y1="60.005592"
       x2="116.12199"
       y2="60.005592"
       gradientUnits="userSpaceOnUse" />
  </defs>
  <g
     inkscape:groupmode="layer"
     id="layer3"
     inkscape:label="Background">
    <rect
       style="fill:#ffffff;fill-opacity:1;fill-rule:nonzero;stroke:#e7e7e7;stroke-width:6.68299;stroke-opacity:0"
       id="rect7934"
       width="112.0283"
       height="67.85334"
       x="3.9952807"
       y="26.07893"
       ry="3.9589326"
       rx="56.014149"
       inkscape:label="InnerBorder1" />
    <rect
       style="fill:#1a1a1a;fill-opacity:1;fill-rule:nonzero;stroke:#e7e7e7;stroke-width:6.43749;stroke-opacity:0"
       id="rect7931"
       width="109.43611"
       height="64.450386"
       x="5.2913632"
       y="27.780397"
       ry="3.7603855"
       rx="54.718056"
       inkscape:label="InnerBorder1" />
    <rect
       style="fill:#000000;fill-opacity:1;fill-rule:nonzero;stroke:#e7e7e7;stroke-width:6.41053;stroke-opacity:0"
       id="rect7900"
       width="105.81461"
       height="66.0989"
       x="7.1021223"
       y="26.956139"
       ry="3.648488"
       rx="4.6619568"
       inkscape:label="OuterBorder0" />
    <rect
       style="fill:#84ff44;fill-opacity:1;fill-rule:nonzero;stroke:#e7e7e7;stroke-width:6.30721;stroke-opacity:0"
       id="rect7897"
       width="107.53947"
       height="62.959122"
       x="6.2396841"
       y="28.526026"
       ry="31.479561"
       rx="3.4946089"
       inkscape:label="InnerBorder1" />
    <rect
       style="fill:#828183;fill-opacity:1;fill-rule:nonzero;stroke:#e7e7e7;stroke-width:6.26637;stroke-opacity:0"
       id="rect6701"
       width="106.76953"
       height="62.59457"
       x="6.6246586"
       y="28.708307"
       ry="31.297285"
       rx="3.4695892"
       inkscape:label="InnerBorder0" />
    <rect
       style="fill:url(#linearGradient9727);fill-opacity:1;fill-rule:nonzero;stroke:#e7e7e7;stroke-width:6.18784;stroke-opacity:0"
       id="rect7727"
       width="106.03729"
       height="61.456944"
       x="6.9907794"
       y="29.277121"
       ry="30.728472"
       rx="3.4457943"
       inkscape:label="ColorfulBG" />
  </g>
  <g
     inkscape:label="MD0_Text"
     inkscape:groupmode="layer"
     id="layer1"
     style="display:inline"
     transform="translate(-5.1265241)">
    <text
       xml:space="preserve"
       style="font-style:normal;font-variant:normal;font-weight:bold;font-stretch:normal;font-size:77.8344px;font-family:'Liberation Mono';-inkscape-font-specification:'Liberation Mono, Bold';font-variant-ligatures:normal;font-variant-caps:normal;font-variant-numeric:normal;font-variant-east-asian:normal;opacity:1;mix-blend-mode:normal;fill:url(#linearGradient3458);fill-opacity:1;fill-rule:nonzero;stroke:#e7e7e7;stroke-width:6.18784;stroke-opacity:0;image-rendering:auto"
       x="19.244871"
       y="85.760887"
       id="text599"
       inkscape:label="Moss"><tspan
         sodipodi:role="line"
         id="tspan597"
         x="19.244871"
         y="85.760887"
         style="fill:url(#linearGradient3458);fill-opacity:1;fill-rule:nonzero;stroke-width:6.18784">M</tspan></text>
    <text
       xml:space="preserve"
       style="font-style:normal;font-variant:normal;font-weight:bold;font-stretch:normal;font-size:77.8344px;font-family:'Liberation Mono';-inkscape-font-specification:'Liberation Mono, Bold';font-variant-ligatures:normal;font-variant-caps:normal;font-variant-numeric:normal;font-variant-east-asian:normal;fill:url(#linearGradient3466);fill-opacity:1;stroke:#e7e7e7;stroke-width:6.18784;stroke-opacity:0"
       x="50.316895"
       y="85.704475"
       id="text653"
       inkscape:label="Dew"><tspan
         sodipodi:role="line"
         id="tspan651"
         x="50.316895"
         y="85.704475"
         style="fill:url(#linearGradient3466);fill-opacity:1;stroke-width:6.18784">D</tspan></text>
    <text
       xml:space="preserve"
       style="font-style:normal;font-variant:normal;font-weight:bold;font-stretch:normal;font-size:77.8344px;font-family:'Liberation Mono';-inkscape-font-specification:'Liberation Mono, Bold';font-variant-ligatures:normal;font-variant-caps:normal;font-variant-numeric:normal;font-variant-east-asian:normal;fill:url(#linearGradient3474);fill-opacity:1;stroke:#e7e7e7;stroke-width:6.18784;stroke-opacity:0"
       x="64.782166"
       y="85.803894"
       id="text657"
       inkscape:label="Zero"><tspan
         sodipodi:role="line"
         id="tspan655"
         x="64.782166"
         y="85.803894"
         style="fill:url(#linearGradient3474);fill-opacity:1;stroke-width:6.18784">0</tspan></text>
  </g>
  <metadata
     id="metadata236">
    <rdf:RDF>
      <cc:Work
         rdf:about="">
        <dc:rights>
          <cc:Agent>
            <dc:title>https://gitlab.com/GPDMCC/MD0</dc:title>
          </cc:Agent>
        </dc:rights>
        <dc:creator>
          <cc:Agent>
            <dc:title>Nohbdy Ahtall</dc:title>
          </cc:Agent>
        </dc:creator>
        <dc:date>20220924</dc:date>
        <cc:license
           rdf:resource="https://gitlab.com/GPDMCC/MD0" />
      </cc:Work>
    </rdf:RDF>
  </metadata>
</svg>
