<?xml version="1.0" encoding="iso-8859-1"?>
<!-- Generator: Adobe Illustrator 16.0.0, SVG Export Plug-In . SVG Version: 6.00 Build 0)  -->
<!DOCTYPE svg PUBLIC "-//W3C//DTD SVG 1.1//EN" "http://www.w3.org/Graphics/SVG/1.1/DTD/svg11.dtd">
<svg version="1.1" xmlns="http://www.w3.org/2000/svg" xmlns:xlink="http://www.w3.org/1999/xlink" x="0px" y="0px"
	 width="28.442px" height="28.441px" viewBox="0 0 28.442 28.441" style="enable-background:new 0 0 28.442 28.441;"
	 xml:space="preserve">
<g id="Highlighted_Guides-_Icon">
	<circle style="fill:#4F5DBC;" cx="14.221" cy="14.221" r="14.221"/>
	<circle style="fill:#FFFFFF;" cx="21.745" cy="16.404" r="1.366"/>
	<circle style="fill:#FFFFFF;" cx="16.813" cy="21.152" r="1.366"/>
	<circle style="fill:#FFFFFF;" cx="21.745" cy="21.152" r="1.366"/>
	<circle style="fill:#FFFFFF;" cx="11.727" cy="21.267" r="1.366"/>
	<circle style="fill:#FFFFFF;" cx="6.853" cy="21.152" r="1.366"/>
	<circle style="fill:#FFFFFF;" cx="11.727" cy="16.485" r="1.366"/>
	<circle style="fill:#FFFFFF;" cx="11.727" cy="11.417" r="1.366"/>
	<circle style="fill:#FFFFFF;" cx="16.738" cy="16.403" r="1.366"/>
	<circle style="fill:#FFFFFF;" cx="16.738" cy="11.417" r="1.366"/>
	<circle style="fill:#FFFFFF;" cx="21.631" cy="11.685" r="1.366"/>
	<circle style="fill:#FFFFFF;" cx="21.631" cy="6.698" r="1.366"/>
</g>
<g id="Layer_1">
</g>
</svg>
