<svg width="16" height="16" viewBox="0 0 16 16" fill="none" xmlns="http://www.w3.org/2000/svg">
<path d="M14.6668 6.16016L9.8735 5.74683L8.00016 1.3335L6.12683 5.7535L1.3335 6.16016L4.9735 9.3135L3.88016 14.0002L8.00016 11.5135L12.1202 14.0002L11.0335 9.3135L14.6668 6.16016ZM8.00016 10.2668L5.4935 11.7802L6.16016 8.92683L3.94683 7.00683L6.86683 6.7535L8.00016 4.06683L9.14016 6.76016L12.0602 7.0135L9.84683 8.9335L10.5135 11.7868L8.00016 10.2668Z" fill="#A1A1AA"/>
</svg>
