<svg width="22" height="22" viewBox="0 0 22 22" fill="none" xmlns="http://www.w3.org/2000/svg">
<path d="M5.8161 12.9077C5.89652 12.9872 6.02883 12.9872 6.10926 12.9077L8.7503 10.2974L10.984 12.5077C11.0644 12.5872 11.1968 12.5872 11.2772 12.5077L17.1482 6.70002C17.2286 6.62053 17.2286 6.48977 17.1482 6.41028L16.1935 5.46669C16.1544 5.42852 16.1018 5.4071 16.0469 5.4071C15.992 5.4071 15.9393 5.42852 15.9003 5.46669L11.1319 10.1846L8.89817 7.97438C8.85917 7.9362 8.80649 7.91479 8.75159 7.91479C8.6967 7.91479 8.64402 7.9362 8.60501 7.97438L4.86138 11.6744C4.82275 11.7129 4.80109 11.765 4.80109 11.8192C4.80109 11.8735 4.82275 11.9256 4.86138 11.9641L5.8161 12.9077Z" fill="#74879E"/>
<path d="M21.1698 1.84615H11.934V0.205127C11.934 0.0923073 11.8406 0 11.7264 0H10.2736C10.1594 0 10.066 0.0923073 10.066 0.205127V1.84615H0.830189C0.370991 1.84615 0 2.21281 0 2.66666V15.9999C0 16.4538 0.370991 16.8204 0.830189 16.8204H10.0764V17.641L5.80094 20.4127C5.77822 20.4273 5.75863 20.4462 5.74332 20.4683C5.72801 20.4904 5.71727 20.5153 5.71173 20.5415C5.70618 20.5677 5.70594 20.5948 5.71101 20.6211C5.71608 20.6474 5.72636 20.6724 5.74127 20.6948L6.52736 21.905V21.9076C6.58962 22.0025 6.71934 22.0281 6.81533 21.9666L11 19.2538L15.1847 21.9666C15.2807 22.0281 15.4104 22.0025 15.4726 21.9076V21.905L16.2587 20.6948C16.2883 20.6495 16.2986 20.5945 16.2874 20.5417C16.2763 20.4889 16.2445 20.4426 16.1991 20.4127L11.934 17.6487V16.8204H21.1698C21.629 16.8204 22 16.4538 22 15.9999V2.66666C22 2.21281 21.629 1.84615 21.1698 1.84615ZM20.1321 14.9743H1.86792V3.69229H20.1321V14.9743Z" fill="#74879E"/>
</svg>
