<?xml version="1.0" encoding="iso-8859-1"?>
<!-- Generator: Adobe Illustrator 16.0.0, SVG Export Plug-In . SVG Version: 6.00 Build 0)  -->
<!DOCTYPE svg PUBLIC "-//W3C//DTD SVG 1.1//EN" "http://www.w3.org/Graphics/SVG/1.1/DTD/svg11.dtd">
<svg version="1.1" xmlns="http://www.w3.org/2000/svg" xmlns:xlink="http://www.w3.org/1999/xlink" x="0px" y="0px"
	 width="28.442px" height="28.442px" viewBox="0 0 28.442 28.442" style="enable-background:new 0 0 28.442 28.442;"
	 xml:space="preserve">
<g id="Discussion-_Icon">	
	<circle style="fill:#E6EBF1;" cx="14.221" cy="14.22" r="14.221"/>
		<path style="fill-rule:evenodd;clip-rule:evenodd;fill:none;stroke:#78889D;stroke-width:1.6;stroke-linejoin:round;stroke-miterlimit:10;" d="
		M14.389,22.11c5.878-0.031,10.623-4.1,10.597-9.088s-4.812-9.008-10.691-8.978C8.417,4.076,3.67,8.144,3.697,13.132
		c0.019,3.63,2.565,6.738,6.211,8.155l-0.212,3.224c0.001,0.208,0.085,0.409,0.232,0.557c0.311,0.306,0.808,0.304,1.115-0.006
		l2.816-2.848l-0.041-0.042L14.389,22.11z"/>
	<path style="fill-rule:evenodd;clip-rule:evenodd;fill:#78889D;" d="M20,12.731c0,0.393-0.318,0.711-0.711,0.711H8.711
		C8.318,13.442,8,13.124,8,12.731v-0.578c0-0.393,0.318-0.711,0.711-0.711h10.578c0.393,0,0.711,0.318,0.711,0.711V12.731z"/>
	<path style="fill-rule:evenodd;clip-rule:evenodd;fill:#78889D;" d="M17,16.731c0,0.393-0.318,0.711-0.711,0.711H8.711
		C8.318,17.442,8,17.124,8,16.731v-0.578c0-0.393,0.318-0.711,0.711-0.711h7.578c0.393,0,0.711,0.318,0.711,0.711V16.731z"/>
</g>
</svg>
