<svg xmlns="http://www.w3.org/2000/svg" version="1.1" xmlns:xlink="http://www.w3.org/1999/xlink" xmlns:svgjs="http://svgjs.com/svgjs" width="800" height="300" preserveAspectRatio="none" viewBox="0 0 800 300">
    <g mask="url(&quot;#SvgjsMask1115&quot;)" fill="none">
        <rect width="800" height="300" x="0" y="0" fill="rgba(12, 143, 46, 1)"></rect>
        <path d="M0,320.016C57.311,306.421,94.854,256.306,142.198,221.265C185.871,188.941,241.422,169.84,267.388,122.112C294.053,73.099,294.592,13.985,284.855,-40.956C275.32,-94.756,243.324,-139.121,213.031,-184.592C178.461,-236.483,156.479,-312.244,95.488,-325.201C33.714,-338.324,-13.996,-270.162,-71.98,-245.14C-121.014,-223.98,-177.982,-224.034,-218.789,-189.582C-263.282,-152.018,-307.115,-102.691,-309.611,-44.515C-312.08,13.043,-249.837,51.102,-231.457,105.703C-209.874,169.819,-242.991,254.898,-193.351,300.861C-144.846,345.773,-64.32,335.273,0,320.016" fill="#20bd49"></path>
        <path d="M800 629.6569999999999C860.154 621.423 906.123 577.172 954.844 540.942 1000.28 507.155 1040.825 470.837 1074.645 425.426 1116.3310000000001 369.454 1173.873 315.961 1174.377 246.173 1174.894 174.65699999999998 1136.637 99.636 1077.288 59.72900000000001 1020 21.208000000000027 943.904 47.627999999999986 874.927 44.821 824.043 42.75 775.705 38.541 725.2429999999999 45.40299999999999 666.263 53.423 597.684 46.12899999999999 555.6179999999999 88.24199999999999 513.345 130.563 523.087 199.801 512.256 258.629 500.924 320.175 471.902 381.573 490.615 441.291 510.156 503.653 559.4639999999999 553.439 615.284 587.424 670.347 620.9490000000001 736.13 638.4 800 629.6569999999999" fill="#20bd49"></path>
    </g>
    <defs>
        <mask id="SvgjsMask1115">
            <rect width="800" height="300" fill="#ffffff"></rect>
        </mask>
    </defs>
</svg>