<svg width="24" height="24" viewBox="0 0 24 24" fill="none" xmlns="http://www.w3.org/2000/svg">
<path d="M12.0004 24.0008C18.6281 24.0008 24.0008 18.6281 24.0008 12.0004C24.0008 5.37277 18.6281 0 12.0004 0C5.37277 0 0 5.37277 0 12.0004C0 18.6281 5.37277 24.0008 12.0004 24.0008Z" fill="#525EB6"/>
<g clip-path="url(#clip0_13702_17281)">
<path d="M14.3333 5.5835H7.33333C6.69166 5.5835 6.16666 6.1085 6.16666 6.75016V14.9168H7.33333V6.75016H14.3333V5.5835ZM16.0833 7.91683H9.66666C9.025 7.91683 8.5 8.44183 8.5 9.0835V17.2502C8.5 17.8918 9.025 18.4168 9.66666 18.4168H16.0833C16.725 18.4168 17.25 17.8918 17.25 17.2502V9.0835C17.25 8.44183 16.725 7.91683 16.0833 7.91683ZM16.0833 17.2502H9.66666V9.0835H16.0833V17.2502Z" fill="white"/>
</g>
<rect x="9" y="9" width="8" height="9" rx="1" fill="white"/>
<defs>
<clipPath id="clip0_13702_17281">
<rect width="14" height="14" fill="white" transform="translate(5 5)"/>
</clipPath>
</defs>
</svg>
