<svg width="98" height="98" viewBox="0 0 98 98" fill="none" xmlns="http://www.w3.org/2000/svg">
<circle cx="48.5" cy="48.5" r="17.5" fill="#E960D5"/>
<circle cx="49" cy="49" r="49" fill="#E960D5" fill-opacity="0.3"/>
<path d="M49 20.4167C43.3467 20.4167 37.8204 22.0931 33.1199 25.2339C28.4194 28.3747 24.7558 32.8388 22.5924 38.0617C20.429 43.2846 19.863 49.0318 20.9659 54.5764C22.0688 60.121 24.7911 65.2141 28.7885 69.2115C32.786 73.209 37.879 75.9313 43.4236 77.0342C48.9683 78.1371 54.7154 77.571 59.9383 75.4076C65.1613 73.2442 69.6254 69.5806 72.7661 64.8801C75.9069 60.1796 77.5833 54.6533 77.5833 49.0001C77.5833 41.4193 74.5718 34.149 69.2114 28.7886C63.851 23.4282 56.5807 20.4167 49 20.4167ZM59.6234 50.0958L45.9034 59.6235C45.6603 59.8561 45.3571 60.0163 45.0279 60.0861C44.6988 60.1559 44.3567 60.1326 44.0401 60.0188C43.7234 59.905 43.4448 59.7052 43.2353 59.4419C43.0259 59.1785 42.8941 58.862 42.8546 58.5279V38.9959C42.8614 38.6401 42.973 38.2942 43.1753 38.0015C43.3776 37.7088 43.6618 37.4822 43.9922 37.35C44.3226 37.2178 44.6846 37.186 45.033 37.2584C45.3814 37.3309 45.7007 37.5044 45.9511 37.7573L59.6234 47.6186C59.7906 47.7786 59.9236 47.9709 60.0145 48.1838C60.1054 48.3966 60.1522 48.6257 60.1522 48.8572C60.1522 49.0886 60.1054 49.3177 60.0145 49.5305C59.9236 49.7434 59.7906 49.9357 59.6234 50.0958Z" fill="white"/>
</svg>
