<svg width="24" height="24" viewBox="0 0 24 24" fill="none" xmlns="http://www.w3.org/2000/svg">
    <path d="M12.36 6L12.76 8L18 8V14H14.64L14.24 12H7L7 6L12.36 6ZM14 4L5 4L5 21H7V14L12.6 14L13 16H20V6L14.4 6L14 4Z" fill="#A1A1AA"/>
</svg>
