<svg width="24" height="24" viewBox="0 0 24 24" fill="none" xmlns="http://www.w3.org/2000/svg">
<g clip-path="url(#clip0_14235_136697)">
<path d="M19 7V11H5.83L9.41 7.41L8 6L2 12L8 18L9.41 16.59L5.83 13H21V7H19Z" fill="#A1A1AA"/>
</g>
<defs>
<clipPath id="clip0_14235_136697">
<rect width="24" height="24" fill="white"/>
</clipPath>
</defs>
</svg>
