<?xml version="1.0" encoding="utf-8"?>
<!-- Generator: Adobe Illustrator 16.0.0, SVG Export Plug-In . SVG Version: 6.00 Build 0)  -->
<!DOCTYPE svg PUBLIC "-//W3C//DTD SVG 1.1//EN" "http://www.w3.org/Graphics/SVG/1.1/DTD/svg11.dtd">
<svg version="1.1" id="Layer_1" xmlns="http://www.w3.org/2000/svg" xmlns:xlink="http://www.w3.org/1999/xlink" x="0px" y="0px"
	 width="28.441px" height="28.441px" viewBox="0 0 28.441 28.441" enable-background="new 0 0 28.441 28.441" xml:space="preserve">
<g id="Layer_1_1_">
</g>
<g id="Layer_2">
	<circle fill="#4F5DBC" cx="14.22" cy="14.22" r="14.221"/>
	<g>
		
			<path fill="none" stroke="#FFFFFF" stroke-width="1.63" stroke-linecap="round" stroke-linejoin="round" stroke-miterlimit="10" d="
			M21.477,21.401c-1.768-1.06-2.782-3.028-2.618-5.085v-3.025c0,0,1.1-2.896-2.422-2.896H6.246c-1.232,0-1.695,0.407-1.695,1.431
			v6.956c0,1.111,0.55,2.619,3.302,2.619H21.477z"/>
		<path fill="#FFFFFF" d="M7.441,22.146c0,0,1.66-0.535,1.66-4.551V9.212c0-1.229,0.569-1.854,2.424-1.854h9.385
			c2.979,0,2.979,0.717,2.979,2.617v8.327c0,1.706-0.421,3.833-2.412,3.833L7.441,22.146z"/>
		<path fill="#4F5DBC" d="M11.661,10.77h9.669c0.157,0,0.285,0.127,0.285,0.284v2.844c0,0.157-0.127,0.285-0.285,0.285h-9.669
			c-0.157,0-0.285-0.128-0.285-0.285v-2.844C11.377,10.897,11.504,10.77,11.661,10.77z"/>
	</g>
</g>
</svg>
