<?xml version="1.0" encoding="iso-8859-1"?>
<!-- Generator: Adobe Illustrator 16.0.0, SVG Export Plug-In . SVG Version: 6.00 Build 0)  -->
<!DOCTYPE svg PUBLIC "-//W3C//DTD SVG 1.1//EN" "http://www.w3.org/Graphics/SVG/1.1/DTD/svg11.dtd">
<svg version="1.1" xmlns="http://www.w3.org/2000/svg" xmlns:xlink="http://www.w3.org/1999/xlink" x="0px" y="0px"
	 width="22.174px" height="22.174px" viewBox="0 0 22.174 22.174" style="enable-background:new 0 0 22.174 22.174;"
	 xml:space="preserve">
<g id="Admissions_x5F_Icon_x5F_Highlighted">
	<g>
		<g>
			<circle style="fill:#4F5DBC;" cx="11.087" cy="11.087" r="11.087"/>
			<g>
				<defs>
					<path id="SVGID_1_" d="M9.162,10.875h3.51c2.076,0,3.762,1.684,3.762,3.76l0,0v1.756c0,1.107-0.898,2.006-2.006,2.006H7.406
						c-1.107,0-2.006-0.898-2.006-2.006v-1.756C5.4,12.559,7.083,10.875,9.162,10.875z"/>
				</defs>
				<use xlink:href="#SVGID_1_"  style="overflow:visible;fill-rule:evenodd;clip-rule:evenodd;fill:#FFFFFF;"/>
				<clipPath id="SVGID_2_">
					<use xlink:href="#SVGID_1_"  style="overflow:visible;"/>
				</clipPath>
			</g>
			<g>
				<defs>
					<path id="SVGID_3_" d="M13.424,13.883h1.004c0.275,0,0.5,0.225,0.5,0.502s-0.225,0.502-0.5,0.502h-1.004
						c-0.277,0-0.502-0.225-0.502-0.502S13.146,13.883,13.424,13.883z"/>
				</defs>
				<use xlink:href="#SVGID_3_"  style="overflow:visible;fill-rule:evenodd;clip-rule:evenodd;fill:#4F5DBC;"/>
				<clipPath id="SVGID_4_">
					<use xlink:href="#SVGID_3_"  style="overflow:visible;"/>
				</clipPath>
			</g>
			<g>
				<defs>
					<polygon id="SVGID_5_" points="9.412,11.109 12.422,11.109 12.422,11.879 10.916,14.385 9.412,11.879 					"/>
				</defs>
				<use xlink:href="#SVGID_5_"  style="overflow:visible;fill-rule:evenodd;clip-rule:evenodd;fill:#4F5DBC;"/>
				<clipPath id="SVGID_6_">
					<use xlink:href="#SVGID_5_"  style="overflow:visible;"/>
				</clipPath>
			</g>
			<circle style="fill-rule:evenodd;clip-rule:evenodd;fill:#FFFFFF;" cx="10.917" cy="6.863" r="4.167"/>
		</g>
	</g>
</g>
<g id="Layer_1">
</g>
</svg>
