<svg viewBox="0 0 34 34" fill="none" xmlns="http://www.w3.org/2000/svg">
<g clip-path="url(#clip0_27229_202117)">
<path d="M15.5479 22.3736C15.4602 22.3741 15.3732 22.3573 15.292 22.3241C15.2107 22.2909 15.1369 22.242 15.0746 22.1802L10.7812 17.8869C10.7194 17.8246 10.6706 17.7507 10.6374 17.6695C10.6042 17.5883 10.5874 17.5013 10.5879 17.4136C10.5874 17.3258 10.6042 17.2388 10.6374 17.1576C10.6706 17.0764 10.7194 17.0025 10.7812 16.9402L20.3346 7.36023C20.6786 7.0166 21.087 6.74411 21.5364 6.55831C21.9858 6.37251 22.4673 6.27703 22.9536 6.27734C23.4399 6.27765 23.9213 6.37374 24.3704 6.56011C24.8196 6.74648 25.2276 7.0195 25.5712 7.36356C25.9149 7.70762 26.1874 8.116 26.3732 8.56537C26.559 9.01475 26.6544 9.49631 26.6541 9.98258C26.6538 10.4689 26.5577 10.9503 26.3713 11.3994C26.185 11.8486 25.912 12.2566 25.5679 12.6002L16.0212 22.1802C15.9589 22.242 15.8851 22.2909 15.8038 22.3241C15.7226 22.3573 15.6356 22.3741 15.5479 22.3736ZM12.2146 17.4136L15.5479 20.7469L24.6546 11.6669C25.0959 11.2245 25.3437 10.6251 25.3437 10.0002C25.3437 9.37535 25.0959 8.77597 24.6546 8.33356C24.2048 7.90635 23.6082 7.66816 22.9879 7.66816C22.3676 7.66816 21.771 7.90635 21.3212 8.33356L12.2146 17.4136Z" fill="#71717A"/>
<path d="M11.9203 23.8531C11.7441 23.8559 11.5739 23.7888 11.447 23.6665L9.30034 21.5131C9.20672 21.4201 9.1428 21.3014 9.11669 21.1721C9.09058 21.0427 9.10346 20.9085 9.15368 20.7865L10.6337 17.1598C10.6753 17.0584 10.7413 16.9687 10.8258 16.8989C10.9103 16.829 11.0107 16.7811 11.1182 16.7594C11.2257 16.7376 11.3368 16.7427 11.4419 16.7742C11.5469 16.8056 11.6426 16.8625 11.7203 16.9398L16.0203 21.2331C16.1006 21.3108 16.1601 21.4073 16.1934 21.5139C16.2267 21.6205 16.2326 21.7337 16.2107 21.8432C16.1888 21.9527 16.1398 22.055 16.0681 22.1406C15.9964 22.2262 15.9043 22.2924 15.8003 22.3331L12.1737 23.8131C12.0916 23.8387 12.0063 23.8522 11.9203 23.8531ZM10.5537 20.8798L12.0803 22.3998L14.367 21.4665L11.4937 18.5931L10.5537 20.8798Z" fill="#71717A"/>
<path d="M10.9603 24.9982H7.62693C7.50631 24.9988 7.38779 24.9666 7.284 24.9051C7.18021 24.8437 7.09504 24.7552 7.03757 24.6492C6.9801 24.5431 6.95247 24.4235 6.95764 24.3029C6.96281 24.1824 7.00058 24.0656 7.06693 23.9648L9.33333 20.332L9.86 20.852L12 22.9987C12.118 23.1165 12.6667 23.6654 12.6667 23.6654L11.4669 24.7582C11.405 24.8326 11.3275 24.8926 11.24 24.934C11.1525 24.9755 11.0571 24.9974 10.9603 24.9982ZM10.2469 23.2248L10.6469 23.6648L8.66667 23.2248L9.86693 22.0915L10.2469 23.2248Z" fill="#F8DF01"/>
<path d="M7.04102 25.668H27.041V27.668H7.04102V25.668Z" fill="#F8DF01"/>
</g>
<rect x="5" y="5" width="24" height="24" stroke="#71717A" stroke-width="2"/>
<rect x="0.5" y="0.5" width="33" height="33" stroke="#EB5757"/>
<defs>
<clipPath id="clip0_27229_202117">
<rect x="5" y="5" width="24" height="24" fill="white"/>
</clipPath>
</defs>
</svg>
