<?xml version="1.0" encoding="iso-8859-1"?>
<!-- Generator: Adobe Illustrator 16.0.0, SVG Export Plug-In . SVG Version: 6.00 Build 0)  -->
<!DOCTYPE svg PUBLIC "-//W3C//DTD SVG 1.1//EN" "http://www.w3.org/Graphics/SVG/1.1/DTD/svg11.dtd">
<svg version="1.1" xmlns="http://www.w3.org/2000/svg" xmlns:xlink="http://www.w3.org/1999/xlink" x="0px" y="0px"
	 width="15.006px" height="14.883px" viewBox="0 0 15.006 14.883" style="enable-background:new 0 0 15.006 14.883;"
	 xml:space="preserve">
<g id="Workshops">
	<g>
		<g>
			<g>
				<g>
					<g>
						<path style="fill:#78869B;" d="M7.459,13.676c-0.294,0-0.531-0.238-0.531-0.529v-1.947c0-0.293,0.237-0.531,0.531-0.531
							s0.531,0.238,0.531,0.531v1.947C7.99,13.438,7.753,13.676,7.459,13.676z"/>
					</g>
					<g>
						<path style="fill:#78869B;" d="M13.01,14.883c-0.139,0-0.279-0.055-0.384-0.164L9.521,11.49
							c-0.203-0.211-0.197-0.547,0.016-0.752c0.211-0.203,0.547-0.197,0.751,0.016l3.104,3.229c0.204,0.211,0.197,0.549-0.014,0.75
							C13.275,14.832,13.143,14.883,13.01,14.883z"/>
					</g>
					<g>
						<path style="fill:#78869B;" d="M2.006,14.883c-0.133,0-0.266-0.051-0.368-0.15c-0.212-0.201-0.219-0.539-0.015-0.75
							l3.104-3.229c0.205-0.213,0.541-0.219,0.753-0.016c0.211,0.205,0.217,0.541,0.015,0.752l-3.105,3.229
							C2.283,14.828,2.145,14.883,2.006,14.883z"/>
					</g>
					<g>
						<g>
							<path style="fill:#78869B;" d="M14.297,11.562H0.707C0.316,11.562,0,11.246,0,10.855s0.316-0.709,0.707-0.709h13.59
								c0.391,0,0.709,0.318,0.709,0.709S14.688,11.562,14.297,11.562z"/>
						</g>
					</g>
				</g>
			</g>
			<g>
				<path style="fill:#FFFFFF;" d="M0.938,8.398c-0.093,0-0.169-0.076-0.169-0.17V0.748c0-0.095,0.074-0.169,0.169-0.169h12.939
					c0.094,0,0.17,0.076,0.17,0.169v7.481c0,0.094-0.076,0.17-0.17,0.17H0.938z"/>
				<g>
					<path style="fill:#6B7C93;" d="M13.47,1.157V7.82H1.348V1.157H13.47 M13.878,0H0.938C0.524,0,0.191,0.334,0.191,0.748v7.481
						c0,0.412,0.333,0.748,0.747,0.748h12.939c0.413,0,0.748-0.336,0.748-0.748V0.748C14.626,0.334,14.291,0,13.878,0L13.878,0z"/>
				</g>
			</g>
		</g>
	</g>
</g>
<g id="Layer_1">
</g>
</svg>
