<svg width="47" height="57" viewBox="0 0 47 57" fill="none" xmlns="http://www.w3.org/2000/svg">
<rect x="0.5" y="0.5" width="46" height="56" fill="#C0C0C0"/>
<path d="M25.8847 28.8604L25.2087 28.8946L25.4401 29.5307L28.3592 37.555L26.4807 38.2389L23.5598 30.2158L23.3282 29.5797L22.7884 29.988L19.5293 32.4526L20.8022 19.7159L29.9652 28.6542L25.8847 28.8604Z" fill="white" stroke="black"/>
<rect x="0.5" y="0.5" width="46" height="56" stroke="black"/>
</svg>
