<?xml version="1.0" encoding="iso-8859-1"?>
<!-- Generator: Adobe Illustrator 16.0.0, SVG Export Plug-In . SVG Version: 6.00 Build 0)  -->
<!DOCTYPE svg PUBLIC "-//W3C//DTD SVG 1.1//EN" "http://www.w3.org/Graphics/SVG/1.1/DTD/svg11.dtd">
<svg version="1.1" xmlns="http://www.w3.org/2000/svg" xmlns:xlink="http://www.w3.org/1999/xlink" x="0px" y="0px"
	 width="28.441px" height="28.441px" viewBox="0 0 28.441 28.441" style="enable-background:new 0 0 28.441 28.441;"
	 xml:space="preserve">
<g id="Highlighted_Live_Sessions-_Icon">
	<circle style="fill:#4F5DBC;" cx="14.221" cy="14.221" r="14.221"/>
	<path style="fill:none;stroke:#FFFFFF;stroke-width:1.6319;stroke-miterlimit:10;" d="M21.576,12.98v6.756
		c-0.004,1.518-1.277,2.744-2.795,2.738l-9.166-0.031c-1.518-0.006-2.744-1.242-2.738-2.76V12.98H21.576z"/>
	<path style="fill:none;stroke:#FFFFFF;stroke-width:1.6319;stroke-miterlimit:10;" d="M6.865,12.877V9.879
		c0.006-1.518,1.279-2.746,2.797-2.74l9.166,0.033c1.518,0.004,2.744,1.24,2.74,2.758v2.998L6.865,12.877z"/>
	
		<line style="fill:none;stroke:#FFFFFF;stroke-width:1.63;stroke-linecap:round;stroke-linejoin:round;stroke-miterlimit:10;" x1="10.629" y1="5.967" x2="10.615" y2="8.699"/>
	
		<line style="fill:none;stroke:#FFFFFF;stroke-width:1.63;stroke-linecap:round;stroke-linejoin:round;stroke-miterlimit:10;" x1="17.961" y1="5.99" x2="17.947" y2="8.725"/>
	
		<line style="fill:none;stroke:#FFFFFF;stroke-width:1.63;stroke-linecap:round;stroke-linejoin:round;stroke-miterlimit:10;" x1="16.691" y1="17.727" x2="11.783" y2="17.727"/>
	
		<line style="fill:none;stroke:#FFFFFF;stroke-width:1.63;stroke-linecap:round;stroke-linejoin:round;stroke-miterlimit:10;" x1="15.344" y1="15.583" x2="17.158" y2="17.727"/>
	
		<line style="fill:none;stroke:#FFFFFF;stroke-width:1.63;stroke-linecap:round;stroke-linejoin:round;stroke-miterlimit:10;" x1="15.344" y1="19.87" x2="17.158" y2="17.727"/>
</g>
<g id="Layer_1">
</g>
</svg>
