,mean_fit_time,std_fit_time,mean_score_time,std_score_time,param_bootstrap,param_max_depth,param_max_features,param_min_samples_leaf,param_min_samples_split,param_n_estimators,params,split0_test_score,split1_test_score,split2_test_score,split3_test_score,split4_test_score,split5_test_score,split6_test_score,split7_test_score,split8_test_score,split9_test_score,mean_test_score,std_test_score,rank_test_score,split0_train_score,split1_train_score,split2_train_score,split3_train_score,split4_train_score,split5_train_score,split6_train_score,split7_train_score,split8_train_score,split9_train_score,mean_train_score,std_train_score
34,4.107929420471192,0.09079299455457165,0.01424405574798584,0.002390371096706773,True,800,sqrt,3,18,15,"{'bootstrap': True, 'max_depth': 800, 'max_features': 'sqrt', 'min_samples_leaf': 3, 'min_samples_split': 18, 'n_estimators': 15}",0.19276501528765377,0.20436299407371283,0.19358366975746744,0.14595986282711704,0.2561520979448204,0.173463207208989,0.20142648279132258,0.19115899003672132,0.15612731775080035,0.19057801427845644,0.19055791263075333,0.028446150926414056,1,0.6675252984795149,0.6563601071262031,0.6763091502321887,0.6666100711496301,0.6604158297708593,0.6628896199676616,0.6673238033412452,0.6662227170078958,0.6614532528711592,0.6605665790634961,0.6645676429009855,0.005236819822838222
0,7.043293595314026,0.4009773433645578,0.01952700614929199,0.008229534487002555,True,400,sqrt,3,10,12,"{'bootstrap': True, 'max_depth': 400, 'max_features': 'sqrt', 'min_samples_leaf': 3, 'min_samples_split': 10, 'n_estimators': 12}",0.1884778936331334,0.21784485295442402,0.19832095186326038,0.12265775305967375,0.24283399849843923,0.2028221373164789,0.18277041429478058,0.16593432647093698,0.18626562783112888,0.1939635732181495,0.19018903860909891,0.029996382814967047,2,0.7672529883329822,0.7661033465155598,0.7686123630020599,0.7749146806719858,0.7714024050810665,0.7681980961161576,0.7902212604037928,0.7847496730023834,0.7792943538204566,0.7640126014405161,0.7734761768386961,0.008257550047965172
24,4.285283422470092,0.6803009178635768,0.01655468940734863,0.006227673837394283,True,400,sqrt,9,18,12,"{'bootstrap': True, 'max_depth': 400, 'max_features': 'sqrt', 'min_samples_leaf': 9, 'min_samples_split': 18, 'n_estimators': 12}",0.1647463421582792,0.19697266610846853,0.20276886192084909,0.15601264045236019,0.2783242934685043,0.1761969082995647,0.20139021593732076,0.1593193687875556,0.14547018870422002,0.21336312365121268,0.1894548104165517,0.0368681152394008,3,0.534649938473997,0.5488905167607563,0.5429746562464495,0.5393766666006043,0.5345515994702822,0.5408273610380006,0.5593454781299336,0.5474236649812214,0.535735686208811,0.5552388318431685,0.5439014399753226,0.008214764272995815
31,5.796022176742554,0.27881358792518685,0.019124388694763184,0.008315216116633084,True,800,sqrt,3,14,15,"{'bootstrap': True, 'max_depth': 800, 'max_features': 'sqrt', 'min_samples_leaf': 3, 'min_samples_split': 14, 'n_estimators': 15}",0.16710442930764413,0.17301889614598398,0.17371608002191474,0.14547018870422002,0.29313658241794527,0.18131878260548973,0.19986427486142222,0.22812709467847558,0.15612731775080035,0.17276696814848902,0.1890635945861304,0.0409376723182633,4,0.7213422682505838,0.729810152183684,0.7136342453341054,0.7152785860593722,0.7098996434732339,0.7224247920374616,0.7083973536330408,0.710716261357629,0.7233476139848151,0.7192797300568977,0.7174130646370824,0.006590632281815552
18,5.048868584632873,0.44428340983940645,0.034198951721191403,0.032440211499276464,True,400,sqrt,9,10,12,"{'bootstrap': True, 'max_depth': 400, 'max_features': 'sqrt', 'min_samples_leaf': 9, 'min_samples_split': 10, 'n_estimators': 12}",0.18939718856345777,0.1950952224593664,0.2208968900016678,0.18595732328084935,0.23492229631658768,0.18730480482030165,0.16818264178293174,0.17836032392794265,0.1389119808128132,0.19057801427845644,0.18896069778213834,0.024966263520922443,5,0.5424424008233217,0.5456036352564256,0.536834009827754,0.5634659585539084,0.5455549095029715,0.5460015499889448,0.5495505014537077,0.5540989743009666,0.541326952801725,0.546935726476704,0.547181461898643,0.006993144401390365
39,2.8469558000564574,0.04505779435024091,0.013930034637451173,0.003494537231590241,True,800,sqrt,6,14,12,"{'bootstrap': True, 'max_depth': 800, 'max_features': 'sqrt', 'min_samples_leaf': 6, 'min_samples_split': 14, 'n_estimators': 12}",0.1688101683226786,0.17565913019624135,0.20279570462897034,0.17688961657828495,0.2625836366355886,0.17634194007687098,0.18947066692145997,0.18773738469886048,0.1864162946919169,0.16112683716733223,0.18878180388122867,0.026985335302538913,6,0.6374689723754567,0.6242216641715923,0.6425400213871518,0.6389403854203788,0.641041384059549,0.6391983841873132,0.6369261452658672,0.6455800246828334,0.6508319848470645,0.6213864753716256,0.6378135441768833,0.008492573845817804
64,5.9520200252532955,0.6421485699935441,0.02402024269104004,0.012152025931759682,True,1600,sqrt,6,10,15,"{'bootstrap': True, 'max_depth': 1600, 'max_features': 'sqrt', 'min_samples_leaf': 6, 'min_samples_split': 10, 'n_estimators': 15}",0.1691029886732519,0.22218961079138688,0.19358366975746744,0.1440434636320287,0.24654224799178603,0.19976625778717272,0.2147518690728566,0.19518095843210082,0.12794196248941525,0.16905389545351202,0.18821441575966183,0.034332438592457694,7,0.6696674732665482,0.6575621512753156,0.6700278387886831,0.6737072918630521,0.6586347155902077,0.6842956576138948,0.6699168086655353,0.6726324660538849,0.666813996517182,0.6620647158042451,0.6685323115438548,0.007487362799755821
62,6.561289262771607,1.0370066035767989,0.02439284324645996,0.009406721735701338,True,1600,sqrt,3,18,18,"{'bootstrap': True, 'max_depth': 1600, 'max_features': 'sqrt', 'min_samples_leaf': 3, 'min_samples_split': 18, 'n_estimators': 18}",0.1895261547764442,0.21488064977002042,0.23810540141191938,0.1672950221881606,0.2420895299606468,0.15967528688954358,0.14826243568794895,0.18611265514121456,0.14499740851024923,0.19057801427845644,0.18815234763214472,0.032908454232791505,8,0.6635501682647524,0.6675011603496663,0.6641078244557241,0.6676666784222336,0.6715544404250429,0.6603331553274165,0.6707296123718529,0.6751125931223245,0.6676528606092258,0.6779453750987186,0.6686153868446958,0.005099100682748164
36,4.14724018573761,0.0847174238082025,0.025993824005126953,0.015492854552707177,True,800,sqrt,6,10,12,"{'bootstrap': True, 'max_depth': 800, 'max_features': 'sqrt', 'min_samples_leaf': 6, 'min_samples_split': 10, 'n_estimators': 12}",0.204464073037108,0.17711347873183192,0.21793302095540845,0.1435961520515765,0.2103146430172096,0.18280659990149417,0.17445182843738627,0.17301889614598398,0.16789129667422675,0.21936798530273016,0.1870969575534504,0.02360113273035086,9,0.6673481178614283,0.6527898225249169,0.6559146362858936,0.6610738176753354,0.654162697827108,0.6679136547537607,0.6596973933230139,0.6622284653624704,0.667817531788378,0.6596131830033778,0.6608559320405684,0.00528696195717877
43,3.9058284521102906,0.6262425292953874,0.013083100318908691,0.0019650270400786,True,800,sqrt,6,18,15,"{'bootstrap': True, 'max_depth': 800, 'max_features': 'sqrt', 'min_samples_leaf': 6, 'min_samples_split': 18, 'n_estimators': 15}",0.18008992535951907,0.21347230028591668,0.19526538728921805,0.17320637346300627,0.2180225408794806,0.18298673052955694,0.18150997469486485,0.1633779025304436,0.1435961520515765,0.2089250869253213,0.18604483961102722,0.022201222910791407,10,0.6015834616319503,0.5844578765997378,0.5875945784208072,0.5984562615969296,0.6018800591199412,0.6056129634943809,0.58487329488949,0.5913161251208878,0.5972285309727683,0.5893209464197193,0.5942324098266611,0.007271050110589642
27,4.761588740348816,0.13932085174659525,0.019636034965515137,0.013994226401600772,True,800,sqrt,3,10,12,"{'bootstrap': True, 'max_depth': 800, 'max_features': 'sqrt', 'min_samples_leaf': 3, 'min_samples_split': 10, 'n_estimators': 12}",0.16568868874045728,0.18801496490241631,0.19976625778717272,0.2132054158364579,0.2327287231390538,0.16675072791684165,0.1970414701091815,0.1956689326512019,0.13447749006081744,0.16453322237187984,0.18578624682929765,0.02688957332952554,11,0.7727605993046522,0.7755505983991077,0.7815237037818662,0.7717246894595443,0.771160093965447,0.7684434137153258,0.7667634384823052,0.7679522581729112,0.7823642276523264,0.770436988878191,0.7728680011811677,0.005132723317869755
77,5.3183817863464355,0.1255162325723129,0.018111252784729005,0.006068199381528998,True,1600,sqrt,9,14,18,"{'bootstrap': True, 'max_depth': 1600, 'max_features': 'sqrt', 'min_samples_leaf': 9, 'min_samples_split': 14, 'n_estimators': 18}",0.19824645266198448,0.1445241211495567,0.1687642300253276,0.17571665763079425,0.25005498399354853,0.1578546787229994,0.18626562783112888,0.18730480482030165,0.18150997469486485,0.19950754013125205,0.18497579364974376,0.02713254113032377,12,0.536619789790155,0.5409055145178614,0.5461325913770283,0.5601578759567264,0.5389730538030066,0.5509579135196158,0.5374745289650045,0.5514880244133464,0.5625352276261313,0.530291144481746,0.5455535664450621,0.010046665968334909
3,4.855108380317688,0.3336433254580622,0.017130231857299803,0.0069146241915435235,True,400,sqrt,3,14,12,"{'bootstrap': True, 'max_depth': 400, 'max_features': 'sqrt', 'min_samples_leaf': 3, 'min_samples_split': 14, 'n_estimators': 12}",0.1519725708433186,0.1984396752430323,0.19826022745253968,0.1742103037989975,0.22508792033824643,0.20436299407371283,0.16846959531012096,0.17445182843738627,0.15291093398865052,0.19826022745253968,0.18464044547110042,0.02266011206830441,13,0.7118948168841319,0.7056925221303123,0.7103563047347425,0.7154688651446013,0.7056925221303123,0.7037208189494287,0.7218440199241112,0.7070413458162532,0.7058210226040758,0.7031609627859834,0.7090693201103953,0.005610451764187319
5,6.735270476341247,0.8368613535979179,0.0269773006439209,0.025059304758412042,True,400,sqrt,3,14,18,"{'bootstrap': True, 'max_depth': 400, 'max_features': 'sqrt', 'min_samples_leaf': 3, 'min_samples_split': 14, 'n_estimators': 18}",0.15722021147385823,0.16437366606468573,0.22230969345550877,0.173463207208989,0.2279647104675746,0.18759540239230088,0.2104077997638648,0.17276696814848902,0.14120661187612704,0.18908384448082882,0.18463738005903532,0.02702485925741611,14,0.7224575200668129,0.7266664520497772,0.7232471306261373,0.7342565874501363,0.7242243587631786,0.719855566508063,0.7138711261546122,0.7264476211383679,0.7236859555686976,0.7235483619601841,0.7238260680285966,0.004909839989734784
32,7.057765293121338,0.19528330244718708,0.019486331939697267,0.003251647855518345,True,800,sqrt,3,14,18,"{'bootstrap': True, 'max_depth': 800, 'max_features': 'sqrt', 'min_samples_leaf': 3, 'min_samples_split': 14, 'n_estimators': 18}",0.20740425430343434,0.16995597578668253,0.20585476645278922,0.18563936032822415,0.22596937382628624,0.18685153286059997,0.14913496534875614,0.17542454699742893,0.15392494322691486,0.1833388153936254,0.18435139338974296,0.022776547987926922,15,0.728085819634376,0.717173267989023,0.7268245165664883,0.7194484857363688,0.7196521738981676,0.7201601026687093,0.7276378388769453,0.7266056702287547,0.7139752784596556,0.7192445013779936,0.7218807655436482,0.004731410176876246
63,5.210764145851135,0.10006563661522855,0.016737866401672363,0.004532959768429561,True,1600,sqrt,6,10,12,"{'bootstrap': True, 'max_depth': 1600, 'max_features': 'sqrt', 'min_samples_leaf': 6, 'min_samples_split': 10, 'n_estimators': 12}",0.14919269660458268,0.1939635732181495,0.2119810004854339,0.1920779449103166,0.2680894779660211,0.18150997469486485,0.1464040468219251,0.20882546808472724,0.1527245046668888,0.13505038687165483,0.18397958365910613,0.03826233037539909,16,0.6609634235138118,0.6597606135435401,0.6516864031826335,0.6513245458560544,0.6676804705679471,0.6733945203260616,0.6739808856396594,0.6624287649418215,0.6553229159699622,0.671006543251631,0.6627549086793122,0.008076234541980108
38,4.651454257965088,0.5484086850217831,0.015197181701660156,0.002022800089546254,True,800,sqrt,6,10,18,"{'bootstrap': True, 'max_depth': 800, 'max_features': 'sqrt', 'min_samples_leaf': 6, 'min_samples_split': 10, 'n_estimators': 18}",0.14883910521136556,0.18298673052955694,0.17836032392794265,0.1684700184530633,0.2513196498751722,0.2028221373164789,0.16292145187752316,0.1950081487793377,0.1525011607731971,0.19518095843210082,0.18383863053992996,0.028423952205251183,17,0.6777068138371418,0.664506760172401,0.6675151504028274,0.6760512018781362,0.6676666784222336,0.6517454698684677,0.6634281763154747,0.6653341250340805,0.6782003244170531,0.6759429617283683,0.6688097662076185,0.007901843142617293
33,3.880263900756836,0.7055686407753872,0.012064719200134277,0.001968157034186097,True,800,sqrt,3,18,12,"{'bootstrap': True, 'max_depth': 800, 'max_features': 'sqrt', 'min_samples_leaf': 3, 'min_samples_split': 18, 'n_estimators': 12}",0.18834428070120546,0.2073751863346447,0.18023796581506324,0.18188369676842053,0.24654224799178603,0.1923985278191822,0.1806272235817663,0.2208968900016678,0.0967862419963883,0.14220024661811237,0.18372955902746457,0.03910300072182855,18,0.650254160283612,0.659105562702706,0.6700625717434352,0.6637846948661521,0.6500160557188932,0.656097160521627,0.660309921915033,0.6666542930664502,0.6572022669142731,0.6533436899588825,0.6586830377691064,0.006367397592378239
45,3.997349810600281,0.3626735511976791,0.015260696411132812,0.00564446091187546,True,800,sqrt,9,10,12,"{'bootstrap': True, 'max_depth': 800, 'max_features': 'sqrt', 'min_samples_leaf': 9, 'min_samples_split': 10, 'n_estimators': 12}",0.15629811233975532,0.18023796581506324,0.16404692373238916,0.20284816930672578,0.22268105305765307,0.20439111384063036,0.17878320838013628,0.16437366606468573,0.16962000294493174,0.19387074883042166,0.18371326509171007,0.020403391420888657,19,0.5580338661141278,0.5571450154894673,0.5510024394002788,0.5450224630770582,0.5329688930154228,0.5407291724143275,0.5352086611730678,0.5285797081706152,0.547020736578913,0.5377453176404963,0.5433456273073775,0.009545894175973218
7,5.035321307182312,0.7727658804386405,0.017003512382507323,0.004308126712442002,True,400,sqrt,3,18,15,"{'bootstrap': True, 'max_depth': 400, 'max_features': 'sqrt', 'min_samples_leaf': 3, 'min_samples_split': 18, 'n_estimators': 15}",0.17332515774274593,0.17106284254603665,0.22218961079138688,0.18131878260548973,0.23233635054394275,0.18446916910319955,0.18131878260548973,0.1742103037989975,0.14311297187457828,0.17225147875268565,0.18355886142231498,0.02448287963308776,20,0.6639789016632964,0.674892315832681,0.6632304011500508,0.6682436999681427,0.661540418529363,0.666828605035475,0.6614138781461771,0.6670332067283751,0.666471181891392,0.668203745759071,0.6661836354704024,0.003785218059460942
4,6.14953875541687,0.16738821845410648,0.01985805034637451,0.007566930355463044,True,400,sqrt,3,14,15,"{'bootstrap': True, 'max_depth': 400, 'max_features': 'sqrt', 'min_samples_leaf': 3, 'min_samples_split': 14, 'n_estimators': 15}",0.19098673957839263,0.1937765119501701,0.2147518690728566,0.19093184424390497,0.20289906709659788,0.15065656472554545,0.19093184424390497,0.17565913019624135,0.13613805754827568,0.18626562783112888,0.18330023910898702,0.022395092813616086,21,0.7159849647086696,0.7152345898978161,0.712792071874102,0.7169048773696529,0.7140793549683955,0.7117422989482174,0.7004069223945935,0.7231999007785348,0.7210734537573618,0.7149976334164427,0.7146416068113787,0.005803340174927658
25,3.3292113542556763,0.0698899045990632,0.014716506004333496,0.0037372404508801823,True,400,sqrt,9,18,15,"{'bootstrap': True, 'max_depth': 400, 'max_features': 'sqrt', 'min_samples_leaf': 9, 'min_samples_split': 18, 'n_estimators': 15}",0.1998155798470207,0.204348613879326,0.1717198719343509,0.17666228862255795,0.2520186619566267,0.2028221373164789,0.169339119299993,0.1604143559694463,0.13087172861564367,0.16258403842700286,0.18306075881336664,0.03145285044062226,22,0.5429084110273172,0.5333001818236149,0.5460880292972519,0.5615837493322824,0.538588188233171,0.5480457630362301,0.5412153097347887,0.5434447379262173,0.5558091543913268,0.55528703065183,0.546627055545403,0.008250960449520898
57,4.619100332260132,0.24977058972079932,0.013032341003417968,0.004198708759006451,True,1600,sqrt,3,14,12,"{'bootstrap': True, 'max_depth': 1600, 'max_features': 'sqrt', 'min_samples_leaf': 3, 'min_samples_split': 14, 'n_estimators': 12}",0.16909060153185862,0.1864162946919169,0.21793302095540845,0.17251119196729559,0.19976625778717272,0.20292395018164167,0.20146221308774837,0.1925021913559436,0.13257619654652908,0.15432462475778563,0.18294972849294588,0.02451372936377931,23,0.7014595081715463,0.7154117733009209,0.7161946467519991,0.7267819309787733,0.7168331884507477,0.712342644018151,0.7057785923488842,0.7162171737404801,0.7093039029598676,0.7085153068050136,0.7128838667526383,0.006711260049119111
55,5.103168225288391,0.6763428350334878,0.016796231269836426,0.005839113375353743,True,1600,sqrt,3,10,15,"{'bootstrap': True, 'max_depth': 1600, 'max_features': 'sqrt', 'min_samples_leaf': 3, 'min_samples_split': 10, 'n_estimators': 15}",0.18793133109024507,0.15432462475778563,0.21043980979871857,0.17733395374210803,0.25900296401180867,0.19093184424390497,0.16107693074737006,0.1833388153936254,0.12475110698617631,0.17733395374210803,0.18264688645369884,0.03372653245529564,24,0.7707521037736558,0.7772411593831817,0.7793168074458869,0.7866730139749911,0.7986841440411867,0.778906227047973,0.7898022880827006,0.7767558199347818,0.7879341649766782,0.7741208048929393,0.7820186533553976,0.008073413669596826
51,3.7911571502685546,0.08457520723133974,0.013229560852050782,0.004337423794340805,True,800,sqrt,9,18,12,"{'bootstrap': True, 'max_depth': 800, 'max_features': 'sqrt', 'min_samples_leaf': 9, 'min_samples_split': 18, 'n_estimators': 12}",0.17671040165369933,0.1998156392014796,0.16905389545351202,0.1749444216236522,0.2538060091404275,0.19020745917337978,0.16292145187752316,0.18430018690743244,0.13559840770114406,0.17792421746293263,0.18252782041439064,0.028847709232130144,25,0.5414889035772944,0.5444108454941361,0.5342554226549463,0.5474210071183483,0.5199334417401358,0.5342968611166814,0.5469344011593997,0.553479667320829,0.545510906507277,0.5229964030013414,0.539072785969039,0.010419303979780912
49,3.7033471345901487,0.34843348940181734,0.014212822914123536,0.0033495297616847252,True,800,sqrt,9,14,15,"{'bootstrap': True, 'max_depth': 800, 'max_features': 'sqrt', 'min_samples_leaf': 9, 'min_samples_split': 14, 'n_estimators': 15}",0.1833927232935575,0.1923985278191822,0.1857995772506459,0.17320637346300627,0.2674068785148699,0.18280659990149417,0.13839167757356785,0.16224132945271175,0.1742103037989975,0.16147483676298013,0.18213296693516268,0.032046856627225506,26,0.5594446378127991,0.5564806621313465,0.5538397587897503,0.5600531579956413,0.5316272024618367,0.5506865455057481,0.5431875726908233,0.5380626546925573,0.5626618276955773,0.5487198506384707,0.5504763870414551,0.009662512758665856
75,4.07053906917572,0.33969408511597926,0.011113333702087402,0.00289958635991294,True,1600,sqrt,9,14,12,"{'bootstrap': True, 'max_depth': 1600, 'max_features': 'sqrt', 'min_samples_leaf': 9, 'min_samples_split': 14, 'n_estimators': 12}",0.1863183348958103,0.1950952224593664,0.1886787733253289,0.15822935478574962,0.21515029063442248,0.1831641149176273,0.204348613879326,0.15495865214650373,0.1500996557347346,0.17469870745341498,0.18107452231131024,0.020476527952814166,27,0.5506473708529098,0.5350768315179812,0.5584014901361584,0.555140306055186,0.542785120212548,0.5440914593955124,0.537903610651709,0.5448874646780689,0.5600311307342811,0.5469344011593997,0.5475899185393753,0.00794663688682096
2,5.315775918960571,0.6889252022036099,0.016406726837158204,0.002875712625208761,True,400,sqrt,3,10,18,"{'bootstrap': True, 'max_depth': 400, 'max_features': 'sqrt', 'min_samples_leaf': 3, 'min_samples_split': 10, 'n_estimators': 18}",0.1845183967899915,0.19971611333345618,0.19675994824664234,0.15495865214650373,0.19668685945371345,0.19081568884343103,0.16501220636024128,0.18947066692145997,0.1477522453659469,0.18280659990149417,0.18084998278732364,0.017513543710579955,28,0.7842317670798501,0.7940232868852375,0.7737240385519412,0.7906402211826925,0.7823326894268653,0.7816873991869775,0.7903254627096638,0.7926715598133898,0.7881190618111585,0.7816873991869775,0.7859442885834753,0.005983774761156865
30,3.8063108921051025,0.7619154352528307,0.015034627914428712,0.006507355183647645,True,800,sqrt,3,14,12,"{'bootstrap': True, 'max_depth': 800, 'max_features': 'sqrt', 'min_samples_leaf': 3, 'min_samples_split': 14, 'n_estimators': 12}",0.182304742461445,0.21180939816534916,0.1575417484423125,0.15535421513351289,0.25309860515931315,0.16469538867574096,0.13804433170260322,0.21775800648108234,0.17016913995521665,0.1551059480480631,0.18058826708347778,0.034065594017610536,29,0.7179579759291229,0.7099611351044528,0.7071032132459953,0.7072095581339293,0.7131258975847841,0.7119784912786173,0.710086191979812,0.7222808339228856,0.7163392017855554,0.7078088751492353,0.7123851374114389,0.004817867865548777
71,9.830460786819458,0.43657775045881014,0.023111963272094728,0.00807149278817317,True,1600,sqrt,6,18,18,"{'bootstrap': True, 'max_depth': 1600, 'max_features': 'sqrt', 'min_samples_leaf': 6, 'min_samples_split': 18, 'n_estimators': 18}",0.17298836873737433,0.22383837898542458,0.18773738469886048,0.11078493827585623,0.2701675584736314,0.1672950221881606,0.13251038070939003,0.19518095843210082,0.13449379876286105,0.2073666596608087,0.1802358607580433,0.045184897816203926,30,0.5952257738287547,0.593821921013881,0.5972102769238066,0.6127532208647707,0.6052393982540596,0.603711562302064,0.600736598719212,0.5938363137877775,0.5945338142135657,0.5981400720555503,0.5995208951963441,0.005849724709971664
21,4.829052853584289,0.8588395753609914,0.017056918144226073,0.004548006425018731,True,400,sqrt,9,14,12,"{'bootstrap': True, 'max_depth': 400, 'max_features': 'sqrt', 'min_samples_leaf': 9, 'min_samples_split': 14, 'n_estimators': 12}",0.1939244577980661,0.1525011607731971,0.18003886898555188,0.1857995772506459,0.204348613879326,0.1632536916025571,0.16818264178293174,0.184960861544598,0.17518633902950087,0.19387074883042166,0.18020761243661496,0.014954548844530822,31,0.5568453381514904,0.5393976152406927,0.5388935186283695,0.5435469539833229,0.5576219604214565,0.5317547806289327,0.5653680542394518,0.5514131458308804,0.5358713121714713,0.5515885315510307,0.5472301210847099,0.010386733323552708
52,4.698257255554199,0.06242241110883976,0.018821120262145996,0.00689978272321856,True,800,sqrt,9,18,15,"{'bootstrap': True, 'max_depth': 800, 'max_features': 'sqrt', 'min_samples_leaf': 9, 'min_samples_split': 18, 'n_estimators': 15}",0.15683882614444378,0.17836032392794265,0.1936808300897368,0.1632536916025571,0.2315692044039901,0.17371608002191474,0.19518095843210082,0.17643141375116855,0.12550288883705463,0.20584855690944504,0.18003672778600724,0.0275440017905034,32,0.5616857867577474,0.5392773434890465,0.5518735964188136,0.5410907010828404,0.5496140189443214,0.5395597866985777,0.543948860962963,0.5531009960532278,0.5459560272587318,0.5407962200065684,0.5466903337672837,0.006937743270238156
29,5.395463633537292,0.5324613588816938,0.01650955677032471,0.005828096246070301,True,800,sqrt,3,10,18,"{'bootstrap': True, 'max_depth': 800, 'max_features': 'sqrt', 'min_samples_leaf': 3, 'min_samples_split': 10, 'n_estimators': 18}",0.18212284735209916,0.1632536916025571,0.1421239062999613,0.17836032392794265,0.2402563928373047,0.169339119299993,0.18921475110342267,0.18131878260548973,0.16073448768519427,0.18947066692145997,0.17961966417684738,0.0245201522149769,33,0.7904694758813184,0.7793168074458869,0.7876367078125035,0.7893805252720416,0.7885087693898732,0.7929853029014957,0.7754036952091559,0.7910062711371921,0.7866565418864195,0.7832718088648576,0.7864635905800745,0.005262183569616091
23,5.806875133514405,0.121243382515952,0.02130119800567627,0.0062912671938029924,True,400,sqrt,9,14,18,"{'bootstrap': True, 'max_depth': 400, 'max_features': 'sqrt', 'min_samples_leaf': 9, 'min_samples_split': 14, 'n_estimators': 18}",0.1550069377822978,0.18759540239230088,0.20120039378872745,0.17921104949251843,0.2610405490933446,0.18112461322197693,0.17051797734362184,0.15495865214650373,0.14547018870422002,0.15931118087718765,0.17954205553184846,0.031679994200749836,34,0.5412109127565661,0.5444699432178264,0.5484562862968838,0.5493056147796301,0.5477400134752963,0.5550112554020252,0.5484507743617058,0.5515692082404233,0.5553113288948843,0.5411174818894817,0.5482642819314724,0.004719742686563828
61,5.729963850975037,0.17145917899824645,0.02106173038482666,0.011839611645687158,True,1600,sqrt,3,18,15,"{'bootstrap': True, 'max_depth': 1600, 'max_features': 'sqrt', 'min_samples_leaf': 3, 'min_samples_split': 18, 'n_estimators': 15}",0.1688101683226786,0.17251119196729559,0.1936808300897368,0.1717198719343509,0.22243159992752315,0.1920779449103166,0.21603274046201293,0.16675072791684165,0.11999434684560129,0.17043758122437547,0.17944399001794267,0.027469702212702903,35,0.6646948113880563,0.6593163460919033,0.6702844233627319,0.6622284653624704,0.669154228746356,0.6662530060368435,0.6672427232640381,0.6669670035597759,0.6752534508316446,0.657829863270365,0.6659224321914186,0.00493726088847961
6,3.3462335586547853,0.11087800198408035,0.010924077033996582,0.0012341902550372882,True,400,sqrt,3,18,12,"{'bootstrap': True, 'max_depth': 400, 'max_features': 'sqrt', 'min_samples_leaf': 3, 'min_samples_split': 18, 'n_estimators': 12}",0.16427825493069037,0.16003378840217186,0.19387074883042166,0.15310683534860603,0.2369186391117083,0.1937765119501701,0.15586410960196007,0.19104626512033906,0.15052289592832502,0.19405501663435765,0.17934630003643573,0.02599505941385703,36,0.678918473721114,0.6488507672725863,0.6562989867196762,0.6663770425386242,0.6512233972234471,0.6612401191292762,0.6599509516154695,0.6715039138066212,0.6556047459852518,0.6634802982055593,0.6613448696217626,0.008722564359245734
67,5.281450271606445,0.47331885135528967,0.019350123405456544,0.0061271696656104175,True,1600,sqrt,6,14,15,"{'bootstrap': True, 'max_depth': 1600, 'max_features': 'sqrt', 'min_samples_leaf': 6, 'min_samples_split': 14, 'n_estimators': 15}",0.19363131373086806,0.23292937046496254,0.16966829424074104,0.15123317824803628,0.21926953946111216,0.18395423491989238,0.16532423043907307,0.179836701651382,0.11178135700070468,0.1854766140002091,0.17931143998709054,0.03220746654038794,37,0.6458718538810162,0.6430842978713718,0.6365149190022854,0.6507130139877781,0.6470701487133523,0.6357832751771171,0.6361465761920614,0.6507428403838191,0.6397685441129597,0.632547239126455,0.6418242708448216,0.0062549888932929305
54,3.191161799430847,0.06891343722142422,0.012719082832336425,0.002281794297901091,True,1600,sqrt,3,10,12,"{'bootstrap': True, 'max_depth': 1600, 'max_features': 'sqrt', 'min_samples_leaf': 3, 'min_samples_split': 10, 'n_estimators': 12}",0.1487576754253862,0.20734999044525126,0.19093184424390497,0.21775800648108234,0.22207131131083857,0.17711347873183192,0.16903071890021393,0.18100500588122648,0.11474212300176256,0.16248736218285564,0.17912272326712597,0.031187382264994862,38,0.7865463202392213,0.7750771124077608,0.7596026932599428,0.7766644912110228,0.7722853482438639,0.7753903318541158,0.7764331136568176,0.7764252386785286,0.7705281417738803,0.7678015095344654,0.7736754300859621,0.006626075631863756
16,3.590074396133423,0.13813586844277606,0.013254022598266602,0.002019358784724997,True,400,sqrt,6,18,15,"{'bootstrap': True, 'max_depth': 400, 'max_features': 'sqrt', 'min_samples_leaf': 6, 'min_samples_split': 18, 'n_estimators': 15}",0.1720355873348539,0.17836032392794265,0.19518095843210082,0.1672950221881606,0.2284592619435889,0.18023796581506324,0.16358087569362212,0.19826022745253968,0.13201666968653747,0.17079250262701295,0.17862149956944517,0.024035825673205787,39,0.5939175917141584,0.592893652840845,0.5935522199897856,0.6097731000159186,0.5912795114505542,0.6003587908439965,0.6002929897993221,0.6056129634943809,0.584231358607618,0.5901606243197935,0.5962072803076373,0.007307299115236104
46,4.995306849479675,0.4073646641580436,0.015781807899475097,0.004539263115124775,True,800,sqrt,9,10,15,"{'bootstrap': True, 'max_depth': 800, 'max_features': 'sqrt', 'min_samples_leaf': 9, 'min_samples_split': 10, 'n_estimators': 15}",0.15645149978754214,0.1742103037989975,0.17814396190296022,0.17643141375116855,0.23514505741727343,0.17469870745341498,0.15967179438180767,0.1920779449103166,0.14018166514548047,0.19358366975746744,0.1780581585000676,0.024422742973240926,40,0.5533386959650011,0.5340376926911805,0.5446503000217788,0.5478724737056692,0.5334847783244874,0.5464907829575659,0.5539171099292213,0.5604350688365567,0.5508512382094308,0.5505095958240354,0.5475587736464927,0.008060879602896644
44,5.273642253875733,0.6945340935627,0.020940589904785156,0.010933196323260558,True,800,sqrt,6,18,18,"{'bootstrap': True, 'max_depth': 800, 'max_features': 'sqrt', 'min_samples_leaf': 6, 'min_samples_split': 18, 'n_estimators': 18}",0.1417590617902158,0.18446916910319955,0.22551856821819483,0.1684700184530633,0.22983190501642514,0.17688961657828495,0.18626562783112888,0.17688961657828495,0.12070120866666112,0.16759545839244738,0.17783661507259133,0.03138914097090409,41,0.5945163416262538,0.5846844821954444,0.6019575877139545,0.5953618432502861,0.5929959267649568,0.5800541374360438,0.5995100169576353,0.6008831315415226,0.6004208725532394,0.5845238008960181,0.5934908140935354,0.007442375852111128
12,3.959059453010559,0.5297014953553891,0.012493157386779785,0.003978365172233862,True,400,sqrt,6,14,12,"{'bootstrap': True, 'max_depth': 400, 'max_features': 'sqrt', 'min_samples_leaf': 6, 'min_samples_split': 14, 'n_estimators': 12}",0.11399107577543788,0.15967179438180767,0.2012395337383025,0.2073666596608087,0.26534687300694815,0.18595732328084935,0.1339354885204158,0.21617791215410243,0.13282655311537728,0.15931118087718765,0.17757819181478177,0.04395128090328877,42,0.6499723307071985,0.633932956026509,0.6455453127742343,0.6542156220575143,0.6383545490503464,0.6287479841337744,0.6476985178073135,0.6543183527312215,0.6392525537475535,0.6386974260315043,0.6430735605067169,0.00818826117537836
78,3.3340880155563353,0.7155561785110224,0.011807537078857422,0.0028942928973327954,True,1600,sqrt,9,18,12,"{'bootstrap': True, 'max_depth': 1600, 'max_features': 'sqrt', 'min_samples_leaf': 9, 'min_samples_split': 18, 'n_estimators': 12}",0.17149130313187433,0.22112224015474113,0.17051797734362184,0.1373265734513054,0.2284592619435889,0.1567890083015343,0.17939402989180087,0.16614263357742876,0.13645409708401846,0.20279570462897034,0.177048911701151,0.030136434929430977,43,0.5428430282102409,0.5377608657822027,0.5435549314404067,0.5556842744039064,0.5552628653305022,0.5440849669315013,0.5394573615767321,0.5482633272508136,0.5504405949541028,0.5402439915991963,0.5457596207479606,0.0060603863119957704
47,5.251093244552612,0.5274578090471855,0.02792789936065674,0.018664200025441963,True,800,sqrt,9,10,18,"{'bootstrap': True, 'max_depth': 800, 'max_features': 'sqrt', 'min_samples_leaf': 9, 'min_samples_split': 10, 'n_estimators': 18}",0.15070674488003977,0.16551552640576928,0.20428884062605113,0.11649988283182455,0.2594047828344569,0.2012395337383025,0.19976625778717272,0.15967528688954358,0.14923359350404553,0.16004961208914992,0.176636274059158,0.03805415246627923,44,0.5589972162708355,0.5413261885126353,0.5514542313657798,0.5535669273354888,0.5334499128443435,0.556805657594095,0.5560856951931357,0.5477435708499483,0.5609245098765758,0.5413821440792443,0.5501736053922082,0.008524571266975941
37,5.25173237323761,0.17660390046991245,0.01456911563873291,0.00381754983707889,True,800,sqrt,6,10,15,"{'bootstrap': True, 'max_depth': 800, 'max_features': 'sqrt', 'min_samples_leaf': 6, 'min_samples_split': 10, 'n_estimators': 15}",0.14741211037826962,0.16905389545351202,0.22268105305765307,0.1227379368627104,0.24077673054217774,0.171987736898488,0.15432462475778563,0.17276696814848902,0.16469538867574096,0.19976625778717272,0.17661831927364177,0.033559619710677974,45,0.6699130004356777,0.6672529079439491,0.6683671342543416,0.6725200674682934,0.653433016352065,0.6697703940636135,0.6571786415771586,0.6695483733130971,0.6643238462010886,0.6616668643635675,0.6653974245972851,0.005877948680724351
28,6.054837870597839,0.11891764439407493,0.016481590270996094,0.007144372324829276,True,800,sqrt,3,10,15,"{'bootstrap': True, 'max_depth': 800, 'max_features': 'sqrt', 'min_samples_leaf': 3, 'min_samples_split': 10, 'n_estimators': 15}",0.11932430578690556,0.15535421513351289,0.16501220636024128,0.1658315118940158,0.28100530287819925,0.166449002897459,0.19995937548685316,0.1984396752430323,0.13804433170260322,0.1698966447064193,0.17592787607530438,0.04187629920588383,46,0.7763515044693441,0.7864323015398167,0.7805811798733671,0.7861325801123011,0.778432246818876,0.7769219848956921,0.7757992204326564,0.7807446657892658,0.7785947413748926,0.7726827762396662,0.7792673201545878,0.0041582899435853365
58,4.609036374092102,0.24408788905948672,0.015432906150817872,0.006382644947058065,True,1600,sqrt,3,14,15,"{'bootstrap': True, 'max_depth': 1600, 'max_features': 'sqrt', 'min_samples_leaf': 3, 'min_samples_split': 14, 'n_estimators': 15}",0.17282106269251318,0.20734184217805351,0.18921475110342267,0.19819856653978396,0.26332510540799103,0.16675072791684165,0.16501220636024128,0.1435961520515765,0.13839167757356785,0.11188930126892904,0.17565395007165818,0.040080032988061697,47,0.7262064485298845,0.7197879652896824,0.7173787945443157,0.7116385067491184,0.7023282184705272,0.7172445116467376,0.7158852339802535,0.7192464205617153,0.7158852339802535,0.7192111512811019,0.716481248503359,0.00588618271974982
53,4.282582211494446,0.5181164871841502,0.015488529205322265,0.0022164911548944264,True,800,sqrt,9,18,18,"{'bootstrap': True, 'max_depth': 800, 'max_features': 'sqrt', 'min_samples_leaf': 9, 'min_samples_split': 18, 'n_estimators': 18}",0.14360138537210054,0.1459407322278773,0.2073926387981171,0.1717198719343509,0.19033290852009588,0.18759540239230088,0.17225147875268565,0.17643141375116855,0.15351906188507136,0.20585476645278922,0.1754618377219256,0.021691842637836058,48,0.5530545024909664,0.544519065118374,0.5503325067139329,0.5488578596282332,0.5446065031253309,0.5497911816990093,0.5492129895592504,0.545549946028338,0.5520971432352022,0.5498844353175321,0.5487906132916168,0.0028306652969341847
70,4.310177373886108,1.572244721093756,0.015133929252624512,0.009115297639005556,True,1600,sqrt,6,18,15,"{'bootstrap': True, 'max_depth': 1600, 'max_features': 'sqrt', 'min_samples_leaf': 6, 'min_samples_split': 18, 'n_estimators': 15}",0.15070674488003977,0.15967528688954358,0.2028221373164789,0.18908384448082882,0.23176364213973255,0.20436299407371283,0.18169825744755086,0.13942436668838376,0.12002851568362594,0.17371608002191474,0.17532654235313153,0.031959946776251615,49,0.5882056926804721,0.5948003246767195,0.5990655844169646,0.606596021154243,0.589595826086703,0.59621420901457,0.5890722546821792,0.5884589296891675,0.5930115674448542,0.5805142784495987,0.5925534688295471,0.00678039213623085
10,4.343722867965698,0.6334304999384971,0.01719052791595459,0.0056408300655500935,True,400,sqrt,6,10,15,"{'bootstrap': True, 'max_depth': 400, 'max_features': 'sqrt', 'min_samples_leaf': 6, 'min_samples_split': 10, 'n_estimators': 15}",0.15972384885656177,0.17396508282988932,0.20279570462897034,0.16437366606468573,0.23448692395965465,0.15859827472446908,0.1732670621559509,0.17942286689561515,0.12612679042159014,0.179836701651382,0.17525865448970968,0.027131544264263407,50,0.6696435609645943,0.6765432416689927,0.6791365306440009,0.6711390149145794,0.6641816346107481,0.6534875570907861,0.6716766201775062,0.6658337725144929,0.6672955243592044,0.6620265198229782,0.6680963976767883,0.006993216837753291
72,5.155753660202026,0.37283634078839434,0.016111135482788086,0.008248587166250532,True,1600,sqrt,9,10,12,"{'bootstrap': True, 'max_depth': 1600, 'max_features': 'sqrt', 'min_samples_leaf': 9, 'min_samples_split': 10, 'n_estimators': 12}",0.17617464987829623,0.19196776227147438,0.15822935478574962,0.17518633902950087,0.2243859544102499,0.1621549797668661,0.1589615701744459,0.18745122618147858,0.16038681382762232,0.15495865214650373,0.17498580966206284,0.02049810818092286,51,0.541557501332407,0.5451098588918558,0.5448438805562799,0.5367171611340043,0.5513793966682831,0.5465351160743921,0.5382678653293578,0.5447957995264601,0.5366783034960678,0.5337767047826131,0.5419661587791721,0.005216132091806175
68,8.260819721221925,1.451355335536442,0.030547690391540528,0.019878467773172575,True,1600,sqrt,6,14,18,"{'bootstrap': True, 'max_depth': 1600, 'max_features': 'sqrt', 'min_samples_leaf': 6, 'min_samples_split': 14, 'n_estimators': 18}",0.1611747703532299,0.18169825744755086,0.18611265514121456,0.15035409325020332,0.22983190501642514,0.16404692373238916,0.16789129667422675,0.1403069328706531,0.19093184424390497,0.17371608002191474,0.17460557869358542,0.02366692956555108,52,0.6360607833205207,0.6526779720793221,0.6477671489017506,0.6594845712889987,0.643608880235917,0.6593570477347841,0.6292115561668067,0.6549112975318383,0.6399903990612099,0.6428751504510808,0.646594480677223,0.00957119104777764
65,6.388412976264954,0.7340560412533815,0.022944426536560057,0.008045455105845757,True,1600,sqrt,6,10,18,"{'bootstrap': True, 'max_depth': 1600, 'max_features': 'sqrt', 'min_samples_leaf': 6, 'min_samples_split': 10, 'n_estimators': 18}",0.1720355873348539,0.17836032392794265,0.17089054830885597,0.1520850435068134,0.21341729584660407,0.1567890083015343,0.17276696814848902,0.18595732328084935,0.15351906188507136,0.18611265514121456,0.17419323743661952,0.017529557505592853,53,0.6699774636247705,0.6785420563179307,0.6566735427593178,0.6716462928119145,0.6587179945428312,0.6751263182019684,0.6775954464349982,0.6682170886600076,0.6707296123718529,0.6702273966688257,0.6697453212394417,0.00683841920491265
80,4.30574107170105,0.5987273245799299,0.01312570571899414,0.0024074575363060026,True,1600,sqrt,9,18,18,"{'bootstrap': True, 'max_depth': 1600, 'max_features': 'sqrt', 'min_samples_leaf': 9, 'min_samples_split': 18, 'n_estimators': 18}",0.18417357956074987,0.1459407322278773,0.14788322695406497,0.16755901082957125,0.2724107954320939,0.17144778641291747,0.1658315118940158,0.13839167757356785,0.13449379876286105,0.2104077997638648,0.17385468124632306,0.03940223388601207,54,0.5559808829853023,0.5477435708499483,0.5444262360755062,0.5532161945113292,0.5404740675728175,0.5546113668617214,0.5497161014162417,0.5631557450337539,0.5443448096683849,0.536636027214032,0.5490305002189038,0.007540644216569513
48,2.6581084728240967,0.0921543539087952,0.01098461151123047,0.0017184423661208063,True,800,sqrt,9,14,12,"{'bootstrap': True, 'max_depth': 800, 'max_features': 'sqrt', 'min_samples_leaf': 9, 'min_samples_split': 14, 'n_estimators': 12}",0.15356797961741564,0.18908384448082882,0.17542454699742893,0.1702391687417788,0.30103852290134736,0.15612731775080035,0.1567890083015343,0.14978395145200862,0.13420981891938122,0.15065656472554545,0.1736907281838259,0.04486442861561279,55,0.5381211750651639,0.5292541386029189,0.5438627303350138,0.5474659154398009,0.5353990231755665,0.5465348886122177,0.5460003100357134,0.5396004495494626,0.5528779087734104,0.5406467064535994,0.5419763246042868,0.006456790158390786
13,5.259483337402344,0.06948633186523819,0.019677948951721192,0.007537890819763763,True,400,sqrt,6,14,15,"{'bootstrap': True, 'max_depth': 400, 'max_features': 'sqrt', 'min_samples_leaf': 6, 'min_samples_split': 14, 'n_estimators': 15}",0.15437781491657943,0.1939635732181495,0.20284816930672578,0.15310683534860603,0.2180225408794806,0.151502621191003,0.1864162946919169,0.19826022745253968,0.1567890083015343,0.11936843951681042,0.17346427750153393,0.029183554458676843,56,0.6433727319587319,0.644413915201929,0.6353691126542697,0.6388709875539829,0.633610353202899,0.6434503636080605,0.640653487061102,0.6472692391023607,0.6502785388258978,0.6365725149227375,0.6413861244091972,0.005077025095918404
17,6.403668093681335,1.4742923138537114,0.02745356559753418,0.012693551245138135,True,400,sqrt,6,18,18,"{'bootstrap': True, 'max_depth': 400, 'max_features': 'sqrt', 'min_samples_leaf': 6, 'min_samples_split': 18, 'n_estimators': 18}",0.15605809249396085,0.18150997469486485,0.15079711910984872,0.17144778641291747,0.25979953517142806,0.1604143559694463,0.14355526245165706,0.1637150432738005,0.14870200722189952,0.19045641191190466,0.1726444508979995,0.03223963068961219,57,0.6015691783965588,0.5860864590006065,0.5952177568518887,0.6011185475688041,0.5748236593670695,0.6046310719054819,0.6026433315841768,0.6012689770924968,0.5979854044161474,0.5954340117315492,0.596077839791478,0.008689855227669907
19,5.745729112625122,0.290082790403498,0.01827068328857422,0.005308410795046802,True,400,sqrt,9,10,15,"{'bootstrap': True, 'max_depth': 400, 'max_features': 'sqrt', 'min_samples_leaf': 9, 'min_samples_split': 10, 'n_estimators': 15}",0.17671040165369933,0.1923985278191822,0.1857995772506459,0.15521151468396954,0.2389456106966099,0.18430018690743244,0.1366695267586049,0.19196776227147438,0.1288941618671826,0.13251038070939003,0.17234105693521382,0.03256719056296106,58,0.5563025681341175,0.542340283925365,0.5448788140051417,0.5522888727852838,0.5454145080846955,0.5434101576421959,0.5495966950121844,0.5580382573216399,0.5433758080548028,0.5464460441374841,0.548209200910291,0.005324744139777893
8,7.0660279273986815,0.1952789111733571,0.021471548080444335,0.008008464494095528,True,400,sqrt,3,18,18,"{'bootstrap': True, 'max_depth': 400, 'max_features': 'sqrt', 'min_samples_leaf': 3, 'min_samples_split': 18, 'n_estimators': 18}",0.1450501062243833,0.1826236587605583,0.2164039379114575,0.15640384682867814,0.1999121815338828,0.1469024898200244,0.15859827472446908,0.19690282694321193,0.14781609805165796,0.17251119196729559,0.17231064026560386,0.024180761969833302,59,0.6713164516259484,0.6702502710345223,0.6748781587916541,0.6814831171018472,0.6728396408768036,0.6652251444929602,0.6610938260253367,0.6675291144106928,0.6710648107188115,0.666316836789024,0.6701997371867601,0.005366960700415856
66,2.8513145208358766,0.22124325915914522,0.011313056945800782,0.002831332192883043,True,1600,sqrt,6,14,12,"{'bootstrap': True, 'max_depth': 1600, 'max_features': 'sqrt', 'min_samples_leaf': 6, 'min_samples_split': 14, 'n_estimators': 12}",0.19548552128544094,0.16818264178293174,0.1998156392014796,0.16292145187752316,0.24750104805974849,0.13505038687165483,0.17678046429744243,0.19069775917680565,0.11042548685376596,0.13535209793868352,0.17222280369029883,0.03740834073318143,60,0.6536676268590914,0.6423094518393191,0.6212121313941217,0.6420234205142109,0.6223887742460659,0.6347620445707141,0.6377778568094619,0.6393880093218529,0.6298229743936471,0.6357678083800072,0.6359120098328492,0.009200469508153734
73,5.387473177909851,0.4532053885124633,0.016948294639587403,0.0071112274763390215,True,1600,sqrt,9,10,15,"{'bootstrap': True, 'max_depth': 1600, 'max_features': 'sqrt', 'min_samples_leaf': 9, 'min_samples_split': 10, 'n_estimators': 15}",0.15437781491657943,0.171987736898488,0.1857995772506459,0.14355526245165706,0.2119810004854339,0.15079711910984872,0.17225147875268565,0.17814396190296022,0.13927794369483026,0.20886440953837315,0.17170247320834717,0.024134162071248813,61,0.541572405633478,0.5606598985122986,0.5323019237676829,0.5539660007738593,0.527696272401061,0.5597089407227056,0.5388111847484826,0.5402679254932146,0.5369904546244628,0.5418705619551538,0.5433845568632398,0.010596823383029877
60,5.95534451007843,0.6898597326563122,0.014711117744445801,0.005117979205399567,True,1600,sqrt,3,18,12,"{'bootstrap': True, 'max_depth': 1600, 'max_features': 'sqrt', 'min_samples_leaf': 3, 'min_samples_split': 18, 'n_estimators': 12}",0.19276501528765377,0.15612731775080035,0.1520850435068134,0.18626562783112888,0.25861350089555746,0.1936808300897368,0.15612731775080035,0.13338523943707414,0.1152678576831454,0.1698966447064193,0.1714228651552445,0.03770571251641434,62,0.6667739370652823,0.654859848913366,0.6575155375459425,0.653617472496645,0.6633377562093652,0.6564269127898041,0.6573664186737322,0.6574109970321604,0.6645326111868153,0.6557613862250362,0.6587602878138149,0.004241513776086338
1,6.2322896957397464,0.6535491767315222,0.015731239318847658,0.004218466040549308,True,400,sqrt,3,10,15,"{'bootstrap': True, 'max_depth': 400, 'max_features': 'sqrt', 'min_samples_leaf': 3, 'min_samples_split': 10, 'n_estimators': 15}",0.175945077674603,0.22100870452598897,0.2073666596608087,0.13965698358598877,0.17733395374210803,0.19387074883042166,0.1718496858576679,0.1575417484423125,0.11591847706556524,0.15065656472554545,0.17111518304935253,0.030037293556465502,63,0.7831288707876387,0.7867809796638698,0.7726024724481093,0.791298190772199,0.7837660056351482,0.7912473204012109,0.7816873991869775,0.778510216523424,0.7703593402404458,0.7746810120557619,0.7814061807714785,0.006966752051120895
35,6.693896722793579,0.3684603578317709,0.020962333679199217,0.006208551650287953,True,800,sqrt,3,18,18,"{'bootstrap': True, 'max_depth': 800, 'max_features': 'sqrt', 'min_samples_leaf': 3, 'min_samples_split': 18, 'n_estimators': 18}",0.15155705157922317,0.17878320838013628,0.18921475110342267,0.19218644129687712,0.19675994824664234,0.18626562783112888,0.186564707468855,0.12422547792336869,0.13786327203370408,0.16551552640576928,0.1708923096265088,0.023819863788404807,64,0.6792453867737454,0.6735695793383573,0.6664412657625589,0.6847725074101271,0.6612673745806794,0.6728755713523747,0.668023547118876,0.673335170364974,0.6745377789233489,0.6657403202448354,0.6719808501869877,0.006543444482963768
14,6.395744943618775,0.20699094380149882,0.030454182624816896,0.012521483389496995,True,400,sqrt,6,14,18,"{'bootstrap': True, 'max_depth': 400, 'max_features': 'sqrt', 'min_samples_leaf': 6, 'min_samples_split': 14, 'n_estimators': 18}",0.1644224972007695,0.18206635658668313,0.1684700184530633,0.16292145187752316,0.21508131192979352,0.1537341956386924,0.1618175105185642,0.17106284254603665,0.151502621191003,0.171987736898488,0.17030626124705123,0.017143881053565582,65,0.6510431111153614,0.6494203383669254,0.6563601071262031,0.6540295171845054,0.6415995202303678,0.6357884816528241,0.6339802220839346,0.651657565390622,0.6493892588488619,0.6433529367088506,0.6466621058708457,0.007233044064410381
42,4.058832025527954,0.13872893519825738,0.018458127975463867,0.009640860438189732,True,800,sqrt,6,18,12,"{'bootstrap': True, 'max_depth': 800, 'max_features': 'sqrt', 'min_samples_leaf': 6, 'min_samples_split': 18, 'n_estimators': 12}",0.14412743374225967,0.21488064977002042,0.2365107747893893,0.1469024898200244,0.24077632926371906,0.1547182474535469,0.1347590254312645,0.16147483676298013,0.09593222862910233,0.17276696814848902,0.1702831511721664,0.0443737387389066,66,0.5818037210250073,0.5940211592481285,0.5868960387813659,0.5931836449190634,0.5979854044161474,0.6065078491532401,0.5924165480813376,0.6065907467509445,0.5849674281980863,0.5816481479956631,0.5926020688568985,0.008647888864772045
22,5.49967393875122,0.34960691340976247,0.01443464756011963,0.004164434174080602,True,400,sqrt,9,14,15,"{'bootstrap': True, 'max_depth': 400, 'max_features': 'sqrt', 'min_samples_leaf': 9, 'min_samples_split': 14, 'n_estimators': 15}",0.2044325896802781,0.18463557010696896,0.16077338659778828,0.18412856299151426,0.23001127545802758,0.12422547792336869,0.17251119196729559,0.16818264178293174,0.13365210967000507,0.1387513132222722,0.17013270318162813,0.031126254192509556,67,0.5501509606816803,0.5420638803127256,0.5369121395900285,0.5593288947667439,0.5476072923645554,0.5455966096418234,0.554588953286745,0.5490672688427647,0.5435121822027293,0.5558091543913268,0.5484637336081123,0.006485410078763392
56,8.288422966003418,0.9686141087294854,0.02411661148071289,0.0076739534119620745,True,1600,sqrt,3,10,18,"{'bootstrap': True, 'max_depth': 1600, 'max_features': 'sqrt', 'min_samples_leaf': 3, 'min_samples_split': 10, 'n_estimators': 18}",0.16680521587573138,0.1445241211495567,0.21648158591952738,0.16292145187752316,0.18003886898555188,0.16248736218285564,0.19115899003672132,0.19518095843210082,0.10967641664853456,0.17106284254603665,0.17003356571078235,0.027835975218256266,68,0.7833449597910586,0.7821028575722062,0.7852594895840315,0.7949636428698302,0.774123013564396,0.7922617495212585,0.7880265323902205,0.7910062711371921,0.7818618904221868,0.7891392540049699,0.786208966085735,0.0058233693271993025
26,5.484971642494202,0.5167746251910497,0.020023632049560546,0.006603436879124065,True,400,sqrt,9,18,18,"{'bootstrap': True, 'max_depth': 400, 'max_features': 'sqrt', 'min_samples_leaf': 9, 'min_samples_split': 18, 'n_estimators': 18}",0.16263134227994103,0.16147483676298013,0.1761969082995647,0.16224132945271175,0.24586243695215448,0.1687642300253276,0.19057801427845644,0.1537341956386924,0.11386190326961243,0.16404692373238916,0.169938723934136,0.03139507448894863,69,0.5538354261678354,0.5579086777294016,0.5531676972266806,0.5577949186575908,0.5499407678058419,0.5614003678325549,0.542328923949817,0.5484618287182368,0.5452852699311397,0.5444318342110295,0.5514555712230128,0.0060932937543497915
9,4.283675026893616,0.16786288402115185,0.017506623268127443,0.006569568309373559,True,400,sqrt,6,10,12,"{'bootstrap': True, 'max_depth': 400, 'max_features': 'sqrt', 'min_samples_leaf': 6, 'min_samples_split': 10, 'n_estimators': 12}",0.1483160071382037,0.17445182843738627,0.17565913019624135,0.17643141375116855,0.22707089359582555,0.16675072791684165,0.14592254058241705,0.14546349393969338,0.1459407322278773,0.17711347873183192,0.16831068900165755,0.023693166582816744,70,0.653250991283781,0.6547828850786511,0.6571689404211241,0.6772751796885657,0.6683802831612251,0.6575621512753156,0.6633738800341794,0.664656940519526,0.6609413827907454,0.663534647780947,0.662092728203406,0.006767875407249227
15,3.3041975498199463,0.5257408213663829,0.011470770835876465,0.0019696525185766795,True,400,sqrt,6,18,12,"{'bootstrap': True, 'max_depth': 400, 'max_features': 'sqrt', 'min_samples_leaf': 6, 'min_samples_split': 18, 'n_estimators': 12}",0.14551831173281193,0.17733395374210803,0.17371608002191474,0.11727187217537327,0.22691313023331516,0.19986427486142222,0.14042609837655062,0.18815065778186213,0.12612679042159014,0.180817517213686,0.16761239276554687,0.032812793000019054,71,0.5911031758215557,0.5900023983713454,0.5980899891791996,0.5978792821086149,0.5895480094084629,0.5876186073822074,0.5854470099195065,0.5846756018525896,0.5868791280162644,0.5786078074477458,0.5889851009507492,0.005593960734551965
41,7.312752509117127,1.1003338097194522,0.03155827522277832,0.024898813067201212,True,800,sqrt,6,14,18,"{'bootstrap': True, 'max_depth': 800, 'max_features': 'sqrt', 'min_samples_leaf': 6, 'min_samples_split': 14, 'n_estimators': 18}",0.16587971809570778,0.13505038687165483,0.19668685945371345,0.14018166514548047,0.26020691171457555,0.16003378840217186,0.1936808300897368,0.13168308043537935,0.13144857974025126,0.15495865214650373,0.16698097364535253,0.03837405972195898,72,0.6492223254118406,0.6552481352960318,0.6514107577930782,0.6452153214542055,0.6352270185630828,0.6404783393802826,0.6381762631912974,0.6673911913870153,0.6480997463790031,0.6357339216900249,0.6466203020545863,0.009471519159088441
76,5.274200224876404,0.6257435388144853,0.019071674346923827,0.00611013443186359,True,1600,sqrt,9,14,15,"{'bootstrap': True, 'max_depth': 1600, 'max_features': 'sqrt', 'min_samples_leaf': 9, 'min_samples_split': 14, 'n_estimators': 15}",0.19688444995964005,0.16224132945271175,0.18595732328084935,0.17792421746293263,0.21977712881689648,0.16292145187752316,0.15123317824803628,0.1658315118940158,0.11241181744989914,0.13109788445095383,0.16663005029132769,0.029519382079905544,73,0.5402805430487716,0.5467594800629717,0.5378005107851952,0.5484965282623211,0.5398864429382697,0.5421904652282123,0.5361023724019351,0.5390143956377087,0.548838122971147,0.5432213988372301,0.5422590260173763,0.004257109501370917
69,4.3063818454742435,0.2557931887355505,0.012862420082092286,0.0027624862707059075,True,1600,sqrt,6,18,12,"{'bootstrap': True, 'max_depth': 1600, 'max_features': 'sqrt', 'min_samples_leaf': 6, 'min_samples_split': 18, 'n_estimators': 12}",0.09899972679044,0.19534853869666036,0.15535421513351289,0.18298673052955694,0.19534853869666036,0.169339119299993,0.17565913019624135,0.15612731775080035,0.16704791344667702,0.16789129667422675,0.16640574998111682,0.026117201035283973,74,0.5898529196699474,0.5863921943186601,0.5951111540692928,0.6101982736972899,0.5933700683243024,0.5833607774978556,0.5959247890359105,0.5986242119852823,0.578933682935628,0.5831342088018553,0.5914902280336025,0.008714605615766225
59,9.647562265396118,1.1801228744146743,0.046006298065185545,0.04729753576851136,True,1600,sqrt,3,14,18,"{'bootstrap': True, 'max_depth': 1600, 'max_features': 'sqrt', 'min_samples_leaf': 3, 'min_samples_split': 14, 'n_estimators': 18}",0.18373825797510024,0.17518633902950087,0.1672950221881606,0.1702391687417788,0.26020691171457555,0.15856562130937357,0.19260431552715818,0.16358087569362212,0.06514297410363146,0.12002851568362594,0.16566000782859303,0.047271148424130924,75,0.7236452247113228,0.7147155541837272,0.7344505323040897,0.7213149819240665,0.7137953828779537,0.7272376025220816,0.7252595559133928,0.7286628492205574,0.716967442291947,0.7026736986937525,0.720872282464289,0.008643705786691568
79,3.184513068199158,0.08365423731768774,0.012687063217163086,0.0015806102005806845,True,1600,sqrt,9,18,15,"{'bootstrap': True, 'max_depth': 1600, 'max_features': 'sqrt', 'min_samples_leaf': 9, 'min_samples_split': 18, 'n_estimators': 15}",0.14694956037720985,0.16112683716733223,0.18853946937163324,0.16966829424074104,0.20894594510584075,0.13168308043537935,0.13109788445095383,0.20890454980422724,0.12142199238501816,0.18280659990149417,0.16511320798746928,0.03041469182993391,76,0.5558305302971349,0.5487198506384707,0.5547636780080365,0.5467577901656933,0.5285834957981004,0.5435469539833229,0.535697248921028,0.556130064394478,0.5500883744849937,0.5413821440792443,0.5461500130770502,0.008586876669604834
50,5.6656577587127686,0.08995772823654528,0.01963357925415039,0.009255611074282025,True,800,sqrt,9,14,18,"{'bootstrap': True, 'max_depth': 800, 'max_features': 'sqrt', 'min_samples_leaf': 9, 'min_samples_split': 14, 'n_estimators': 18}",0.17000012497864947,0.17251119196729559,0.18395423491989238,0.15894133790594267,0.24236425166922437,0.15601264045236019,0.13699235024511092,0.15856562130937357,0.11794954202153307,0.14933729217646208,0.16466321527157887,0.03134726684833696,77,0.5545082956240568,0.5610568014124597,0.5451024363162806,0.5573563012622313,0.5451428270466854,0.5412843480484407,0.5391357029477438,0.5512507661150177,0.5434530318514199,0.5333008152305214,0.5471591325854857,0.008251371139354606
20,6.040433096885681,0.7649154149743975,0.02166726589202881,0.01115216738282722,True,400,sqrt,9,10,18,"{'bootstrap': True, 'max_depth': 400, 'max_features': 'sqrt', 'min_samples_leaf': 9, 'min_samples_split': 10, 'n_estimators': 18}",0.1779695763634932,0.12563555226865908,0.21946793203239945,0.17268044499006496,0.18377713827388675,0.10814258738034732,0.15310683534860603,0.16258403842700286,0.1522627420682453,0.19033290852009588,0.164596868867714,0.03045982003901801,78,0.553757854612973,0.5470720675410211,0.5359672704042568,0.5468933777228923,0.5514542313657798,0.5491279463320151,0.5402507860123273,0.5529797224342156,0.5540919952941452,0.5411174818894817,0.5472712733609109,0.005977023590769545
11,4.368344044685363,0.10912193517921173,0.015583539009094238,0.0026910200979169043,True,400,sqrt,6,10,18,"{'bootstrap': True, 'max_depth': 400, 'max_features': 'sqrt', 'min_samples_leaf': 6, 'min_samples_split': 10, 'n_estimators': 18}",0.15113515884912077,0.17898987884529094,0.22397214820671796,0.0896522689483017,0.2012780723833728,0.18003886898555188,0.1520850435068134,0.15967528688954358,0.130075868478439,0.17079250262701295,0.1637686658503731,0.03538041489180294,79,0.6742619183015828,0.6814850281324255,0.6679830220073231,0.6792460931523058,0.6723795754805613,0.6768919360378273,0.6706966293537493,0.6738202472408795,0.6735861832682111,0.6703503444885544,0.6740700977463421,0.003939485955264338
40,6.125974416732788,1.223939631367497,0.024977397918701173,0.014451898487607872,True,800,sqrt,6,14,15,"{'bootstrap': True, 'max_depth': 800, 'max_features': 'sqrt', 'min_samples_leaf': 6, 'min_samples_split': 14, 'n_estimators': 15}",0.16995195096678184,0.18626562783112888,0.17106284254603665,0.1567890083015343,0.2104077997638648,0.12626944819650798,0.1477522453659469,0.17814396190296022,0.10618312844954747,0.17518633902950087,0.1628017128731962,0.02850865016710374,80,0.6533330266822159,0.6508738093981091,0.6388170668609376,0.6372850024998692,0.6323573658435477,0.6317589058488664,0.6393613826810218,0.6469373293047416,0.6492575105249814,0.6506831315421691,0.643066453118646,0.0076513997841632375
74,4.386472630500793,0.826441576220338,0.0198392391204834,0.007662427328415963,True,1600,sqrt,9,10,18,"{'bootstrap': True, 'max_depth': 1600, 'max_features': 'sqrt', 'min_samples_leaf': 9, 'min_samples_split': 10, 'n_estimators': 18}",0.16967327111845676,0.1567890083015343,0.17051797734362184,0.17942286689561515,0.23019339627435242,0.15931118087718765,0.12070120866666112,0.15574372436290163,0.10967641664853456,0.1556152457397354,0.1607650246961014,0.03102758770479496,81,0.5633684432701893,0.5303266434128395,0.5569356895181856,0.5498844353175321,0.538588188233171,0.5534889647155365,0.5499779095488583,0.5602628400990823,0.5553113288948843,0.5270447707275075,0.5485189213737788,0.01181024514245718
