<?xml version="1.0" encoding="UTF-8" standalone="no"?>
<!-- Created with Inkscape (http://www.inkscape.org/) -->

<svg
   xmlns:dc="http://purl.org/dc/elements/1.1/"
   xmlns:cc="http://creativecommons.org/ns#"
   xmlns:rdf="http://www.w3.org/1999/02/22-rdf-syntax-ns#"
   xmlns:svg="http://www.w3.org/2000/svg"
   xmlns="http://www.w3.org/2000/svg"
   xmlns:sodipodi="http://sodipodi.sourceforge.net/DTD/sodipodi-0.dtd"
   xmlns:inkscape="http://www.inkscape.org/namespaces/inkscape"
   width="600"
   height="600"
   id="svg2"
   version="1.1"
   inkscape:version="0.48.5 r10040"
   sodipodi:docname="ev_producer.svg">
  <defs
     id="defs4">
    <linearGradient
       id="linearGradient3768">
      <stop
         style="stop-color:#0f7391;stop-opacity:1;"
         offset="0"
         id="stop3770" />
      <stop
         style="stop-color:#085166;stop-opacity:1;"
         offset="1"
         id="stop3772" />
    </linearGradient>
  </defs>
  <sodipodi:namedview
     id="base"
     pagecolor="#ffffff"
     bordercolor="#666666"
     borderopacity="1.0"
     inkscape:pageopacity="0.0"
     inkscape:pageshadow="2"
     inkscape:zoom="1.325"
     inkscape:cx="214.935"
     inkscape:cy="330.18868"
     inkscape:document-units="px"
     inkscape:current-layer="layer1-9"
     showgrid="false"
     units="px"
     inkscape:snap-bbox="true"
     inkscape:window-width="1920"
     inkscape:window-height="1005"
     inkscape:window-x="-9"
     inkscape:window-y="-9"
     inkscape:window-maximized="1"
     inkscape:snap-bbox-midpoints="true">
    <inkscape:grid
       type="xygrid"
       id="grid2985"
       empspacing="5"
       visible="true"
       enabled="true"
       snapvisiblegridlinesonly="true"
       spacingx="1px"
       spacingy="1px" />
  </sodipodi:namedview>
  <metadata
     id="metadata7">
    <rdf:RDF>
      <cc:Work
         rdf:about="">
        <dc:format>image/svg+xml</dc:format>
        <dc:type
           rdf:resource="http://purl.org/dc/dcmitype/StillImage" />
        <dc:title />
      </cc:Work>
    </rdf:RDF>
  </metadata>
  <g
     inkscape:label="Layer 1"
     inkscape:groupmode="layer"
     id="layer1"
     transform="translate(0,-452.3616)">
    <g
       id="g3903-0"
       transform="translate(-344.99999,4.9999784)" />
    <g
       id="g3782"
       transform="translate(0.08188905,0)"
       style="stroke:#ffffff;stroke-width:16;stroke-miterlimit:4;stroke-opacity:1;stroke-dasharray:none">
      <path
         style="fill:none;stroke:#ffffff;stroke-width:16;stroke-linecap:butt;stroke-linejoin:miter;stroke-miterlimit:4;stroke-opacity:1;stroke-dasharray:none"
         d="M 299.91811,195 C 236.48904,246.54864 143.74278,318.94026 79.918111,370 L 130,330 l 0,190 340,0 c 0,-63.33333 0,-126.66667 0,-190 l 49.91811,40 c -65.99066,-52.52353 -153.22039,-123.4843 -220,-175 z"
         transform="translate(0,452.3616)"
         id="path3777"
         inkscape:connector-curvature="0"
         sodipodi:nodetypes="cccccccc" />
    </g>
    <g
       id="g3841"
       style="stroke-width:5;stroke-miterlimit:4;stroke-dasharray:none;stroke:#ffffff;stroke-opacity:1">
      <path
         sodipodi:nodetypes="sssssssssss"
         inkscape:connector-curvature="0"
         id="path4343"
         transform="translate(0,452.3616)"
         d="m 300,302.5 c -31.75637,0 -57.5,25.74363 -57.5,57.5 0,26.65589 17.5,40 27.5,50 5,5 12.5,10 12.5,15 0,10 0,30 0,30 0,9.695 7.805,17.5 17.5,17.5 9.695,0 17.5,-7.805 17.5,-17.5 0,0 0,-20 0,-30 0,-5 7.5,-10 12.5,-15 10,-10 27.5,-23.34411 27.5,-50 0,-31.75637 -25.74363,-57.5 -57.5,-57.5 z"
         style="fill:none;stroke:#ffffff;stroke-width:5;stroke-miterlimit:4;stroke-opacity:1;stroke-dasharray:none" />
      <path
         transform="translate(0,452.3616)"
         inkscape:connector-curvature="0"
         id="path3790"
         d="m 285,430 30,0"
         style="fill:none;stroke:#ffffff;stroke-width:5;stroke-linecap:butt;stroke-linejoin:miter;stroke-opacity:1;stroke-miterlimit:4;stroke-dasharray:none" />
      <path
         inkscape:connector-curvature="0"
         id="path3790-3"
         d="m 285,891.3616 30,0"
         style="fill:none;stroke:#ffffff;stroke-width:5;stroke-linecap:butt;stroke-linejoin:miter;stroke-opacity:1;stroke-miterlimit:4;stroke-dasharray:none" />
      <path
         inkscape:connector-curvature="0"
         id="path3790-2"
         d="m 285,900.3616 30,0"
         style="fill:none;stroke:#ffffff;stroke-width:5;stroke-linecap:butt;stroke-linejoin:miter;stroke-opacity:1;stroke-miterlimit:4;stroke-dasharray:none" />
      <path
         inkscape:connector-curvature="0"
         id="path3790-8"
         d="m 285,909.3616 30,0"
         style="fill:none;stroke:#ffffff;stroke-width:5;stroke-linecap:butt;stroke-linejoin:miter;stroke-opacity:1;stroke-miterlimit:4;stroke-dasharray:none" />
      <path
         sodipodi:nodetypes="ccccccccccc"
         transform="translate(0,452.3616)"
         inkscape:connector-curvature="0"
         id="path3839"
         d="m 292,417 -5,-17 -12,-20 9,5 9,-5 7,5 7,-5 9,5 9,-5 -12,20 -5,17"
         style="fill:none;stroke:#ffffff;stroke-width:5;stroke-linecap:butt;stroke-linejoin:round;stroke-miterlimit:4;stroke-opacity:1;stroke-dasharray:none" />
    </g>
    <g
       transform="matrix(1.0035492,0,0,1.0035492,-0.28910532,-3.4506943)"
       id="layer1-9"
       inkscape:label="Layer 1">
      <rect
         y="454.8616"
         x="2.5"
         height="596.45673"
         width="596.45667"
         id="rect2998"
         style="fill:#913a91;fill-opacity:1;stroke:#913a91;stroke-width:5;stroke-linecap:butt;stroke-linejoin:miter;stroke-miterlimit:4;stroke-opacity:1;stroke-dasharray:none;stroke-dashoffset:0"
         ry="98.228333"
         rx="98.228333" />
      <g
         transform="translate(-344.99999,4.9999784)"
         id="g3903-0-1" />
      <path
         inkscape:connector-curvature="0"
         style="fill:#ffffff;fill-opacity:1;stroke:none"
         d="m 152.82811,888.02036 c -20.70909,-0.17905 -37.64764,16.46136 -37.82667,37.17046 -0.17905,20.70909 16.46136,37.64763 37.17046,37.82667 20.70909,0.17905 37.64763,-16.46136 37.82667,-37.17046 0.17905,-20.70909 -16.46136,-37.64764 -37.17046,-37.82667 z m -1.26558,3.77329 c 5.85446,-0.16168 11.70008,1.20964 17.06186,4.07796 0,0 -3.00978,7.70544 -6.09352,10.31212 -3.08374,2.60668 -7.63296,5.3246 -8.53092,7.33565 -0.89798,2.01105 -0.46873,7.6169 -0.46873,7.6169 -1.11132,-0.24773 -2.04924,-0.11903 -3.02334,0.35154 -0.91485,-8.7305 -3.26077,-20.6779 -4.78106,-29.01451 1.937,-0.39374 3.88422,-0.62577 5.83571,-0.67966 z m -22.28821,9.28088 c 0,0 6.3954,5.23792 7.92158,8.97623 1.52616,3.73831 2.70064,8.90695 4.33577,10.38242 1.63515,1.47548 7.12473,2.78895 7.12473,2.78895 -0.57901,0.98038 -0.75588,1.92806 -0.60935,2.99988 -8.58593,-1.82778 -20.68644,-3.27578 -29.08483,-4.40607 0.89637,-7.85547 4.46568,-15.12407 10.3121,-20.74141 z m 52.59175,7.80441 c 3.89215,6.88207 5.27168,14.84629 3.8436,22.82725 0,0 -8.26285,-0.47416 -11.69487,-2.60147 -3.43201,-2.12729 -7.41889,-5.62657 -9.609,-5.85916 -2.19012,-0.23255 -7.40597,1.9218 -7.40597,1.9218 -0.10777,-1.13346 -0.51702,-2.00794 -1.26557,-2.78895 8.02051,-3.56795 18.67301,-9.47745 26.13181,-13.49947 z m -25.40529,18.74928 c 5.87182,6.5254 14.79882,14.82021 20.92889,20.67109 -5.3425,5.82834 -12.49882,9.60244 -20.53046,10.71052 0,0 -2.11102,-8.00781 -1.14839,-11.92923 0.96263,-3.92141 3.05705,-8.79011 2.60147,-10.94489 -0.45562,-2.15479 -4.10141,-6.44507 -4.10141,-6.44507 1.04468,-0.4528 1.73844,-1.10916 2.2499,-2.06242 z m -7.35908,0.84372 c 0.75346,0.85363 1.60711,1.30808 2.67177,1.49994 -4.39152,7.60087 -9.5246,18.65781 -13.19481,26.29587 -7.19401,-3.27996 -12.98705,-8.92201 -16.52281,-16.21813 0,0 6.96481,-4.46136 10.99178,-4.75763 4.02695,-0.29627 9.29414,0.18513 11.20268,-0.91404 1.90855,-1.09916 4.85139,-5.90601 4.85139,-5.90601 z"
         id="path3787-5-4" />
      <path
         inkscape:connector-curvature="0"
         style="fill:#ffffff;fill-opacity:1;stroke:none"
         d="m 457.8281,888.02036 c -20.70909,-0.17905 -37.64764,16.46136 -37.82667,37.17046 -0.17905,20.70909 16.46136,37.64763 37.17046,37.82667 20.70909,0.17905 37.64763,-16.46136 37.82667,-37.17046 0.17905,-20.70909 -16.46136,-37.64764 -37.17046,-37.82667 z m -1.26558,3.77329 c 5.85446,-0.16168 11.70008,1.20964 17.06186,4.07796 0,0 -3.00978,7.70544 -6.09352,10.31212 -3.08374,2.60668 -7.63296,5.3246 -8.53092,7.33565 -0.89798,2.01105 -0.46873,7.6169 -0.46873,7.6169 -1.11132,-0.24773 -2.04924,-0.11903 -3.02334,0.35154 -0.91485,-8.7305 -3.26077,-20.6779 -4.78106,-29.01451 1.937,-0.39374 3.88422,-0.62577 5.83571,-0.67966 z m -22.28821,9.28088 c 0,0 6.3954,5.23792 7.92158,8.97623 1.52616,3.73831 2.70064,8.90695 4.33577,10.38242 1.63515,1.47548 7.12473,2.78895 7.12473,2.78895 -0.57901,0.98038 -0.75588,1.92806 -0.60935,2.99988 -8.58593,-1.82778 -20.68644,-3.27578 -29.08483,-4.40607 0.89637,-7.85547 4.46568,-15.12407 10.3121,-20.74141 z m 52.59175,7.80441 c 3.89215,6.88207 5.27168,14.84629 3.8436,22.82725 0,0 -8.26285,-0.47416 -11.69487,-2.60147 -3.43201,-2.12729 -7.41889,-5.62657 -9.609,-5.85916 -2.19012,-0.23255 -7.40597,1.9218 -7.40597,1.9218 -0.10777,-1.13346 -0.51702,-2.00794 -1.26557,-2.78895 8.02051,-3.56795 18.67301,-9.47745 26.13181,-13.49947 z m -25.40529,18.74928 c 5.87182,6.5254 14.79882,14.82021 20.92889,20.67109 -5.3425,5.82834 -12.49882,9.60244 -20.53046,10.71052 0,0 -2.11102,-8.00781 -1.14839,-11.92923 0.96263,-3.92141 3.05705,-8.79011 2.60147,-10.94489 -0.45562,-2.15479 -4.10141,-6.44507 -4.10141,-6.44507 1.04468,-0.4528 1.73844,-1.10916 2.2499,-2.06242 z m -7.35908,0.84372 c 0.75346,0.85363 1.60711,1.30808 2.67177,1.49994 -4.39152,7.60087 -9.5246,18.65781 -13.19481,26.29587 -7.19401,-3.27996 -12.98705,-8.92201 -16.52281,-16.21813 0,0 6.96481,-4.46136 10.99178,-4.75763 4.02695,-0.29627 9.29414,0.18513 11.20268,-0.91404 1.90855,-1.09916 4.85139,-5.90601 4.85139,-5.90601 z"
         id="path3787-5-4-7" />
      <path
         sodipodi:nodetypes="sccscscccscsscsssccccssscccscsccscscssccccssccscc"
         inkscape:connector-curvature="0"
         id="path4102"
         d="m 328.59375,820.33142 c -14.42266,-0.0698 -28.19636,1.05939 -40.8125,3.84375 -24.82723,5.73288 -59.79079,19.69422 -87.375,31.4375 -45.64696,-2.10762 -130.776785,32.26069 -133.1875,35.90625 -2.410715,3.64556 -3.32479,3.89887 -3.375,5.28125 -0.04984,4.10354 0.884833,8.50837 1,12.4375 0.115167,3.92913 0.451916,12.762 1.25,13.4375 0.798084,0.67545 0.676436,0.20854 1.53125,0.65625 l 0.125,6.65625 c -0.940046,0.35855 -2.15925,1.06638 -2.15625,2.25 0.003,1.18362 1.434912,1.59356 2.40625,1.875 0,0 0.137827,1.12684 1.5,2.65625 1.362172,1.52941 21.76596,7.95063 42.46875,10.3125 1.44443,0.16479 2.80645,0.29411 4.15625,0.40625 C 112.24275,941.07474 110,933.5626 110,925.51892 c 0,-23.4721 19.0279,-42.5 42.5,-42.5 23.4721,0 42.5,19.0279 42.5,42.5 0,7.5146 -1.95297,14.56248 -5.375,20.6875 1.20038,-0.007 2.37462,-0.0269 3.65625,-0.0312 51.00211,-0.17606 173.34874,1.61859 224.6875,0.90625 1.01104,-0.014 1.93647,-0.0439 2.875,-0.0625 C 417.13372,940.70917 415,933.36781 415,925.51892 c 0,-23.4721 19.0279,-42.5 42.5,-42.5 23.4721,0 42.5,19.0279 42.5,42.5 0,6.89293 -1.64994,13.39918 -4.5625,19.15625 1.84749,-0.10652 4.25,-0.25 4.25,-0.25 7.37963,0.26063 10.92485,-2.72358 13.375,-6.21875 7.60118,-1.36417 13.40107,-1.51065 17.875,-8.90625 4.47393,-7.3956 9.82078,-16.22823 10.40625,-22.65625 -1.90691,-4.07184 -5.35021,-11.91406 -2.3125,-20.0625 1.85427,-4.97394 1.7077,-4.61629 1.625,-6.53125 0.0279,-2.69096 -5.37251,-4.83308 -5.8125,-9.53125 0.37057,-2.03705 1.60393,-9.05451 0.84375,-10.46875 -0.76018,-1.41424 -7.83761,-4.04125 -13.59375,-4.03125 -0.37485,-0.81608 -2.86839,-2.43519 -4.3125,-2.9375 -6.15016,-2.13923 -33.8125,-6.4375 -33.8125,-6.4375 -44.15332,-10.47759 -103.86551,-26.06308 -155.375,-26.3125 z m -0.0937,10.5625 c 25.80889,0.12194 52.77636,5.11299 74.21875,11.09375 l -8.46875,25.9375 c -53.87135,0.42469 -111.50536,1.59355 -160.32699,5.16818 l -15.07917,-11.70913 c 35.34856,-19.09734 68.68952,-28.64859 98.68741,-30.2403 3.62049,-0.1921 7.28177,-0.26742 10.96875,-0.25 z m 81.75,12.90625 c 11.52734,3.17964 19.38789,6.0211 24.9375,9.3125 0,0 -3.43196,7.18369 -6.1875,8.1875 -8.88539,3.23683 -16.04354,5.54887 -27.0625,6.4375 z"
         style="fill:#ffffff;fill-opacity:1;stroke:none" />
    </g>
  </g>
</svg>
