{
    "creation_time": "2014-01-01T00:04:00",

    "sim_model": "PyPower.Branch",

    "type": ["Component", "PowerTransmitter", "Branch"],
    "category": "Grid",
    "tooltip": "Branch",

    "icon": "branch.svg",
    "drawing_mode": "line",

    "docking_ports": {
        "0": {
            "out": ["Bus"]
        },
        "1": {
            "out": ["Bus"]
        }
    },

    "on_sim_init": "maverig.data.components.utils.simInit:on_sim_init_powertransmitter",
    "on_set_param": null,

    "published_params": ["btype", "l", "online"],
    "published_attrs": ["P_from", "Q_from", "P_to", "Q_to",
        "I_real", "I_imag", "S_max", "I_max", "length", "R_per_km", "X_per_km", "C_per_km", "online"],

    "params": {
        "fbus": {},
        "tbus": {},
        "btype": {
            "caption": "branch type",
            "datatype": "string",
            "accepted_values": ["NA2XS2Y_120", "NA2XS2Y_185", "AL/ST_70/12/20",
                "NAYY_35", "NAYY_50", "NAYY_70", "NAYY_95", "NAYY_120", "NAYY_150", "NAYY_185", "NAYY_240"],
            "default_value": "NA2XS2Y_120"
        },
        "l": {
            "caption": "length in km",
            "datatype": "float",
            "default_value": 0.1
        },
        "online": {
            "caption": "online mode",
            "datatype": "bool",
            "default_value": true
        }
    },

    "attrs": {
        "P_from": {
            "caption": "Active Power at \"from\" side",
            "unit": "W",
            "static": false
        },
        "Q_from": {
            "caption": "Reactive Power at \"from\" side",
            "unit": "VAr",
            "static": false
        },
        "P_to": {
            "caption": "Active Power at \"to\" side",
            "unit": "W",
            "static": false
        },
        "Q_to": {
            "caption": "Reactive Power at \"to\" side",
            "unit": "VAr",
            "static": false
        },
        "I_real": {
            "caption": "Branch current (real part)",
            "unit": "A",
            "static": false
        },
        "I_imag": {
            "caption": "Branch current (imaginary part)",
            "unit": "A",
            "static": false
        },
        "S_max": {
            "caption": "Maximum apparent power",
            "unit": "VA",
            "static": true
        },
        "I_max": {
            "caption": "Maximum current",
            "unit": "A",
            "static": true
        },
        "length": {
            "caption": "Length",
            "unit": "km",
            "static": true
        },
        "R_per_km": {
            "caption": "Resistance per unit length",
            "unit": "\u2126/km",
            "static": true
        },
        "X_per_km": {
            "caption": "Reactance per unit length",
            "unit": "\u2126/km",
            "static": true
        },
        "C_per_km": {
            "caption": "Capacity per unit length",
            "unit": "F/km",
            "static": true
        },
        "online": {
            "caption": "online mode",
            "static": true
        }
    }
}