<?xml version="1.0" encoding="UTF-8" standalone="no"?>
<!-- Created with Inkscape (http://www.inkscape.org/) -->

<svg
   xmlns:dc="http://purl.org/dc/elements/1.1/"
   xmlns:cc="http://creativecommons.org/ns#"
   xmlns:rdf="http://www.w3.org/1999/02/22-rdf-syntax-ns#"
   xmlns:svg="http://www.w3.org/2000/svg"
   xmlns="http://www.w3.org/2000/svg"
   xmlns:sodipodi="http://sodipodi.sourceforge.net/DTD/sodipodi-0.dtd"
   xmlns:inkscape="http://www.inkscape.org/namespaces/inkscape"
   width="600"
   height="600"
   id="svg2"
   version="1.1"
   inkscape:version="0.48.4 r9939"
   sodipodi:docname="wecs.svg">
  <defs
     id="defs4">
    <linearGradient
       id="linearGradient3768">
      <stop
         style="stop-color:#4f910f;stop-opacity:1;"
         offset="0"
         id="stop3770" />
      <stop
         style="stop-color:#366608;stop-opacity:1;"
         offset="1"
         id="stop3772" />
    </linearGradient>
  </defs>
  <sodipodi:namedview
     id="base"
     pagecolor="#ffffff"
     bordercolor="#666666"
     borderopacity="1.0"
     inkscape:pageopacity="0.0"
     inkscape:pageshadow="2"
     inkscape:zoom="1.325"
     inkscape:cx="300"
     inkscape:cy="300"
     inkscape:document-units="px"
     inkscape:current-layer="layer1"
     showgrid="false"
     units="px"
     inkscape:snap-bbox="true"
     inkscape:window-width="1680"
     inkscape:window-height="1001"
     inkscape:window-x="0"
     inkscape:window-y="26"
     inkscape:window-maximized="1"
     inkscape:snap-bbox-midpoints="false">
    <inkscape:grid
       type="xygrid"
       id="grid2985"
       empspacing="5"
       visible="true"
       enabled="true"
       snapvisiblegridlinesonly="true"
       spacingx="1px"
       spacingy="1px" />
  </sodipodi:namedview>
  <metadata
     id="metadata7">
    <rdf:RDF>
      <cc:Work
         rdf:about="">
        <dc:format>image/svg+xml</dc:format>
        <dc:type
           rdf:resource="http://purl.org/dc/dcmitype/StillImage" />
        <dc:title />
      </cc:Work>
    </rdf:RDF>
  </metadata>
  <g
     inkscape:label="Layer 1"
     inkscape:groupmode="layer"
     id="layer1"
     transform="translate(0,-452.3616)">
    <rect
       style="fill:#5e8227;fill-opacity:1;stroke:#5e8227;stroke-width:5;stroke-linecap:butt;stroke-linejoin:miter;stroke-miterlimit:4;stroke-opacity:1;stroke-dasharray:none;stroke-dashoffset:0"
       id="rect2998"
       width="596.45667"
       height="596.45673"
       x="2.0216701"
       y="454.8616"
       ry="98.228333"
       rx="98.228333" />
    <g
       id="g3903-0"
       transform="translate(-344.99999,24.999978)" />
    <path
       style="fill:#ffffff;fill-opacity:1;stroke:none"
       d="m 295,682.3616 -20,300 c 0,5 10,10 25,10 15,0 25,-5 25,-10 l -20,-300 z"
       id="path3778"
       inkscape:connector-curvature="0"
       sodipodi:nodetypes="cczccc" />
    <path
       sodipodi:type="arc"
       style="fill:#ffffff;fill-opacity:1;stroke:none"
       id="path3772"
       sodipodi:cx="270"
       sodipodi:cy="210"
       sodipodi:rx="20"
       sodipodi:ry="20"
       d="m 290,210 c 0,11.04569 -8.95431,20 -20,20 -11.04569,0 -20,-8.95431 -20,-20 0,-11.04569 8.95431,-20 20,-20 11.04569,0 20,8.95431 20,20 z"
       transform="translate(30,472.3616)" />
    <path
       style="fill:#ffffff;fill-opacity:1;stroke:none"
       d="m 487.13265,715.37314 c -5.79228,4.05579 -74.72882,-8.09958 -141.34605,-4.61459 -17.95967,-13.32105 -31.86355,-20.84981 -46.63566,-23.45453 l 1.73648,-9.84808 c 78.78462,13.89186 132.94905,23.44251 186.24523,37.9172 z"
       id="rect3774"
       inkscape:connector-curvature="0"
       sodipodi:nodetypes="ccccc" />
    <path
       style="fill:#ffffff;fill-opacity:1;stroke:none"
       d="m 177.84333,827.97058 c -0.61629,-7.04416 44.37884,-60.66727 74.66937,-120.10197 20.5162,-8.89301 33.98823,-17.16974 43.63005,-28.66041 l 7.66045,6.42788 c -51.42301,61.28355 -86.77633,103.416 -125.95987,142.3345 z"
       id="rect3774-50"
       inkscape:connector-curvature="0"
       sodipodi:nodetypes="ccccc" />
    <path
       style="fill:#ffffff;fill-opacity:1;stroke:none"
       d="m 235.01582,503.83633 c 6.40857,2.98836 30.34998,68.76684 66.67668,124.71656 -2.55653,22.21405 -2.12469,38.01954 3.00561,52.11493 l -9.39693,3.4202 c -27.36161,-75.1754 -46.17272,-126.8585 -60.28536,-180.25169 z"
       id="rect3774-5"
       inkscape:connector-curvature="0"
       sodipodi:nodetypes="ccccc" />
  </g>
</svg>
