{
    "creation_time": "2014-01-02T00:01:00",

    "sim_model": "CSV.PV",

    "type": ["Component", "CSV", "PV"],
    "category": "Producers",
    "tooltip": "Photovoltaic",

    "icon": "pv.svg",
    "drawing_mode": "icon",

    "docking_ports": {
        "0": {},
        "1": {
            "out": ["PQBus"]
        }
    },

    "on_sim_init": null,
    "on_set_param": null,

    "published_params": ["datafile"],
    "published_attrs": ["kw_peak", "P"],

    "params": {
        "sim_start": {},
        "datafile": {
            "caption": "CSV data file",
            "datatype": "file (*.csv)",
            "default_value": "maverig/tests/data/pv_10kw.small.csv"
        }
    },

    "attrs": {
        "kw_peak": {
            "caption": "Nominal Power",
            "unit": "kWp",
            "static": true
        },
        "P": {
            "caption": "Active Power",
            "unit": "W",
            "static": false
        }
    }
}