{
    "creation_time": "2014-01-02T00:02:00",

    "sim_model": "CSV.WECS",

    "type": ["Component", "CSV", "WECS"],
    "category": "Producers",
    "tooltip": "Wind Energy Conversion System",

    "icon": "wecs.svg",
    "drawing_mode": "icon",

    "docking_ports": {
        "0": {},
        "1": {
            "out": ["PQBus"]
        }
    },

    "on_sim_init": null,
    "on_set_param": null,

    "published_params": ["datafile"],
    "published_attrs": ["P_max", "P"],

    "params": {
        "sim_start": {},
        "datafile": {
            "caption": "CSV data file",
            "datatype": "file (*.csv)",
            "default_value": "maverig/tests/data/wecs_10kw.small.csv"
        }
    },

    "attrs": {
        "P_max": {
            "caption": "Nominal Power",
            "unit": "kW",
            "static": true
        },
        "P": {
            "caption": "Active Power",
            "unit": "W",
            "static": false
        }
    }
}