{
    "creation_time": "2014-01-02T00:03:00",

    "sim_model": "CSV.CHP",

    "type": ["Component", "CSV", "CHP"],
    "category": "Producers",
    "tooltip": "Combined Heat and Power",

    "icon": "chp.svg",
    "drawing_mode": "icon",

    "docking_ports": {
        "0": {},
        "1": {
            "out": ["PQBus"]
        }
    },

    "on_sim_init": null,
    "on_set_param": null,

    "published_params": ["datafile"],
    "published_attrs": ["model", "P_max", "P"],

    "params": {
        "sim_start": {},
        "datafile": {
            "caption": "CSV data file",
            "datatype": "file (*.csv)",
            "default_value": "maverig/tests/data/chp.small.csv"
        }
    },

    "attrs": {
        "model": {
            "caption": "CHP Model",
            "static": true
        },
        "P_max": {
            "caption": "Nominal Power",
            "unit": "kW",
            "static": true
        },
        "P": {
            "caption": "Active Power",
            "unit": "W",
            "static": false
        }
    }
}