{
    "name": "PyPower",
    "starter": "python",
    "address": "mosaik_pypower.mosaik:PyPower",
    "params": {
        "step_size": 900
    },
    "on_sim_init_parents": "maverig.data.components.utils.simInit:on_sim_init_parents_pypower"
}