<?xml version="1.0" encoding="UTF-8" standalone="no"?>
<!-- Created with Inkscape (http://www.inkscape.org/) -->

<svg
   xmlns:dc="http://purl.org/dc/elements/1.1/"
   xmlns:cc="http://creativecommons.org/ns#"
   xmlns:rdf="http://www.w3.org/1999/02/22-rdf-syntax-ns#"
   xmlns:svg="http://www.w3.org/2000/svg"
   xmlns="http://www.w3.org/2000/svg"
   xmlns:sodipodi="http://sodipodi.sourceforge.net/DTD/sodipodi-0.dtd"
   xmlns:inkscape="http://www.inkscape.org/namespaces/inkscape"
   width="600"
   height="600"
   id="svg2"
   version="1.1"
   inkscape:version="0.48.4 r9939"
   sodipodi:docname="pv.svg">
  <defs
     id="defs4">
    <linearGradient
       id="linearGradient3768">
      <stop
         style="stop-color:#4f910f;stop-opacity:1;"
         offset="0"
         id="stop3770" />
      <stop
         style="stop-color:#366608;stop-opacity:1;"
         offset="1"
         id="stop3772" />
    </linearGradient>
  </defs>
  <sodipodi:namedview
     id="base"
     pagecolor="#ffffff"
     bordercolor="#666666"
     borderopacity="1.0"
     inkscape:pageopacity="0.0"
     inkscape:pageshadow="2"
     inkscape:zoom="1.325"
     inkscape:cx="300"
     inkscape:cy="300"
     inkscape:document-units="px"
     inkscape:current-layer="layer1"
     showgrid="false"
     units="px"
     inkscape:snap-bbox="true"
     inkscape:window-width="1680"
     inkscape:window-height="1001"
     inkscape:window-x="0"
     inkscape:window-y="26"
     inkscape:window-maximized="1"
     inkscape:snap-bbox-midpoints="false">
    <inkscape:grid
       type="xygrid"
       id="grid2985"
       empspacing="5"
       visible="true"
       enabled="true"
       snapvisiblegridlinesonly="true"
       spacingx="1px"
       spacingy="1px" />
  </sodipodi:namedview>
  <metadata
     id="metadata7">
    <rdf:RDF>
      <cc:Work
         rdf:about="">
        <dc:format>image/svg+xml</dc:format>
        <dc:type
           rdf:resource="http://purl.org/dc/dcmitype/StillImage" />
        <dc:title />
      </cc:Work>
    </rdf:RDF>
  </metadata>
  <g
     inkscape:label="Layer 1"
     inkscape:groupmode="layer"
     id="layer1"
     transform="translate(0,-452.3616)">
    <rect
       style="fill:#5e8227;fill-opacity:1;stroke:#5e8227;stroke-width:5;stroke-linecap:butt;stroke-linejoin:miter;stroke-miterlimit:4;stroke-opacity:1;stroke-dasharray:none;stroke-dashoffset:0"
       id="rect2998"
       width="596.45667"
       height="596.45673"
       x="2.0216701"
       y="454.8616"
       ry="98.228333"
       rx="98.228333" />
    <g
       id="g3903-0"
       transform="translate(-344.99999,4.9999784)" />
    <path
       style="fill:#ffffff;fill-opacity:1;stroke:none"
       d="m 259.75,862.3616 -29.75,81 c 17.74999,5.73761 38.11034,9 59.75,9 21.63966,0 42.00001,-3.26239 59.75,-9 l -29.75,-81 -60,0 z"
       id="path3778"
       inkscape:connector-curvature="0" />
    <path
       style="fill:#ffffff;fill-opacity:1;stroke:none"
       d="m 157.75,637.3616 -124.999997,220 404.999997,25 125,-220 -405,-25 z m 5.28125,5.53125 122.53125,8.0625 -35.5,62.46875 -121.59375,-7.71875 34.5625,-62.8125 z M 290,651.2366 l 124.3125,8.1875 -34.75,62.1875 L 254.53125,713.70535 290,651.2366 z m 128.75,8.46875 123.15625,8.09375 -35.5625,61.84375 -122.3125,-7.75 34.71875,-62.1875 z m -292.375,49.875 121.5,7.6875 -34.6875,61.03125 -120.437497,-7.625 33.624997,-61.09375 z m 125.96875,7.96875 125.09375,7.90625 -34.09375,61.0625 -125.6875,-7.9375 34.6875,-61.03125 z m 129.53125,8.1875 122.28125,7.75 -35.09375,61 -121.28125,-7.6875 34.09375,-61.0625 z M 90.625003,774.51785 211,782.14285 172.53125,849.8616 53.562503,841.9241 90.625003,774.51785 z M 215.46875,782.4241 341.1875,790.39285 303.15625,858.5491 177,850.14285 215.46875,782.4241 z m 130.1875,8.25 121.1875,7.65625 -39.375,68.5 -119.875,-8 38.0625,-68.15625 z"
       id="path3803"
       inkscape:connector-curvature="0" />
  </g>
</svg>
