{
    "creation_time": "2014-01-04T00:01:00",

    "sim_model": "CSV.EV",

    "type": ["Component", "CSV", "EV"],
    "category": "Prosumers",
    "tooltip": "Electric Vehicle",

    "icon": "ev+battery.svg",
    "drawing_mode": "icon",

    "docking_ports": {
        "0": {},
        "1": {
            "out": ["PQBus"]
        }
    },

    "on_sim_init": null,
    "on_set_param": null,

    "published_params": ["datafile"],
    "published_attrs": ["model", "P_crg", "battery_capacity", "P", "SoC", "plugged_in"],

    "params": {
        "sim_start": {},
        "datafile": {
            "caption": "CSV data file",
            "datatype": "file (*.csv)",
            "default_value": "maverig/tests/data/ev.small.csv"
        }
    },

    "attrs": {
        "model": {
            "caption": "Car Model",
            "static": true
        },
        "P_crg": {
            "caption": "Nominal Charger Power",
            "unit": "kW",
            "static": true
        },
        "battery_capacity": {
            "caption": "Battery Capacity",
            "unit": "kWh",
            "static": true
        },
        "consumption": {
            "caption": "Consumption",
            "unit": "kWh/100km",
            "static": true
        },
        "P": {
            "caption": "Active Power",
            "unit": "W",
            "static": false
        },
        "SoC": {
            "caption": "State of Charge",
            "unit": "%",
            "static": false
        },
        "distance": {
            "caption": "Total Distance",
            "unit": "km",
            "static": false
        },
        "speed": {
            "caption": "Current Speed",
            "unit": "km/h",
            "static": false
        },
        "plugged_in": {
            "caption": "Plugged In",
            "unit": "",
            "static": false
        }
    }
}
