<?xml version="1.0" encoding="UTF-8" standalone="no"?>
<!-- Created with Inkscape (http://www.inkscape.org/) -->

<svg
   xmlns:dc="http://purl.org/dc/elements/1.1/"
   xmlns:cc="http://creativecommons.org/ns#"
   xmlns:rdf="http://www.w3.org/1999/02/22-rdf-syntax-ns#"
   xmlns:svg="http://www.w3.org/2000/svg"
   xmlns="http://www.w3.org/2000/svg"
   xmlns:sodipodi="http://sodipodi.sourceforge.net/DTD/sodipodi-0.dtd"
   xmlns:inkscape="http://www.inkscape.org/namespaces/inkscape"
   width="130.39713mm"
   height="130.39713mm"
   viewBox="0 0 462.03706 462.03706"
   id="svg12040"
   version="1.1"
   inkscape:version="0.91 r13725"
   sodipodi:docname="wind-turbine.svg">
  <defs
     id="defs12042">
    <pattern
       y="0"
       x="0"
       height="6"
       width="6"
       patternUnits="userSpaceOnUse"
       id="EMFhbasepattern" />
  </defs>
  <sodipodi:namedview
     id="base"
     pagecolor="#ffffff"
     bordercolor="#666666"
     borderopacity="1.0"
     inkscape:pageopacity="0.0"
     inkscape:pageshadow="2"
     inkscape:zoom="0.35"
     inkscape:cx="-111.12432"
     inkscape:cy="222.4471"
     inkscape:document-units="px"
     inkscape:current-layer="layer1"
     showgrid="false"
     fit-margin-top="0"
     fit-margin-left="0"
     fit-margin-right="0"
     fit-margin-bottom="0"
     inkscape:window-width="1680"
     inkscape:window-height="1028"
     inkscape:window-x="1912"
     inkscape:window-y="-8"
     inkscape:window-maximized="1" />
  <metadata
     id="metadata12045">
    <rdf:RDF>
      <cc:Work
         rdf:about="">
        <dc:format>image/svg+xml</dc:format>
        <dc:type
           rdf:resource="http://purl.org/dc/dcmitype/StillImage" />
        <dc:title></dc:title>
      </cc:Work>
    </rdf:RDF>
  </metadata>
  <g
     inkscape:label="Ebene 1"
     inkscape:groupmode="layer"
     id="layer1"
     transform="translate(-257.5529,-292.77224)">
    <g
       id="g12638"
       transform="matrix(3.5433071,0,0,3.5433071,257.1775,292.39684)">
      <path
         inkscape:connector-curvature="0"
         id="path12593"
         d="m 0.23307915,21.930614 c 0,-11.9823653 9.71516955,-21.69753485 21.69753485,-21.69753485 l 86.758526,0 c 11.98231,0 21.6868,9.71516955 21.6868,21.69753485 l 0,86.758526 c 0,11.98231 -9.70449,21.6868 -21.6868,21.6868 l -86.758526,0 c -11.9823653,0 -21.69753485,-9.70449 -21.69753485,-21.6868 z"
         style="fill:#5e8227;fill-opacity:1;fill-rule:evenodd;stroke:none" />
      <path
         inkscape:connector-curvature="0"
         id="path12595"
         d="m 0.23307915,21.930614 c 0,-11.9823653 9.71516955,-21.69753485 21.69753485,-21.69753485 l 86.758526,0 c 11.98231,0 21.6868,9.71516955 21.6868,21.69753485 l 0,86.758526 c 0,11.98231 -9.70449,21.6868 -21.6868,21.6868 l -86.758526,0 c -11.9823653,0 -21.69753485,-9.70449 -21.69753485,-21.6868 z"
         style="fill:none;stroke:#5e8227;stroke-width:0.25426814px;stroke-linecap:butt;stroke-linejoin:round;stroke-miterlimit:4;stroke-dasharray:none;stroke-opacity:1" />
      <path
         inkscape:connector-curvature="0"
         id="path12597"
         d="m 60.918513,111.60252 3.835118,-63.227938 2.759851,0 3.830038,63.227938 z"
         style="fill:#ffffff;fill-opacity:1;fill-rule:evenodd;stroke:none" />
      <path
         inkscape:connector-curvature="0"
         id="path12599"
         d="m 60.918513,111.60252 3.835118,-63.227938 2.759851,0 3.830038,63.227938 z"
         style="fill:none;stroke:#ffffff;stroke-width:0.25426814px;stroke-linecap:butt;stroke-linejoin:miter;stroke-miterlimit:8;stroke-dasharray:none;stroke-opacity:1" />
      <path
         inkscape:connector-curvature="0"
         id="path12601"
         d="m 60.833564,111.81447 c 0,-1.42494 2.346678,-2.58516 5.233812,-2.58516 2.892213,0 5.233528,1.16022 5.233528,2.58516 0,1.4303 -2.341315,2.58487 -5.233528,2.58487 -2.887134,0 -5.233812,-1.15457 -5.233812,-2.58487 z"
         style="fill:#ffffff;fill-opacity:1;fill-rule:evenodd;stroke:none" />
      <path
         inkscape:connector-curvature="0"
         id="path12603"
         d="m 60.833564,111.81447 c 0,-1.42494 2.346678,-2.58516 5.233812,-2.58516 2.892213,0 5.233528,1.16022 5.233528,2.58516 0,1.4303 -2.341315,2.58487 -5.233528,2.58487 -2.887134,0 -5.233812,-1.15457 -5.233812,-2.58487"
         style="fill:none;stroke:#ffffff;stroke-width:0.25426814px;stroke-linecap:butt;stroke-linejoin:round;stroke-miterlimit:10;stroke-dasharray:none;stroke-opacity:1" />
      <path
         inkscape:connector-curvature="0"
         id="path12605"
         d="m 61.522187,43.426944 c 0.609317,-2.558626 3.178386,-4.137095 5.737013,-3.522697 2.558627,0.609035 4.137096,3.178386 3.52806,5.737013 -0.61468,2.558344 -3.183749,4.137096 -5.742376,3.527778 -2.558626,-0.614398 -4.137095,-3.183467 -3.522697,-5.742094 z"
         style="fill:#ffffff;fill-opacity:1;fill-rule:evenodd;stroke:none" />
      <path
         inkscape:connector-curvature="0"
         id="path12607"
         d="m 61.522187,43.426944 c 0.609317,-2.558626 3.178386,-4.137095 5.737013,-3.522697 2.558627,0.609035 4.137096,3.178386 3.52806,5.737013 -0.61468,2.558344 -3.183749,4.137096 -5.742376,3.527778 -2.558626,-0.614398 -4.137095,-3.183467 -3.522697,-5.742094"
         style="fill:none;stroke:#ffffff;stroke-width:0.26486266px;stroke-linecap:butt;stroke-linejoin:round;stroke-miterlimit:10;stroke-dasharray:none;stroke-opacity:1" />
      <path
         inkscape:connector-curvature="0"
         id="path12609"
         d="M 63.657198,36.41852 68.069742,34.924718 54.122038,8.2160251 Z"
         style="fill:#ffffff;fill-opacity:1;fill-rule:evenodd;stroke:none" />
      <path
         inkscape:connector-curvature="0"
         id="path12611"
         d="M 63.657198,36.41852 68.069742,34.924718 54.122038,8.2160251 Z"
         style="fill:none;stroke:#ffffff;stroke-width:0.26486266px;stroke-linecap:butt;stroke-linejoin:miter;stroke-miterlimit:8;stroke-dasharray:none;stroke-opacity:1" />
      <path
         inkscape:connector-curvature="0"
         id="path12613"
         d="m 63.598778,36.391991 4.417906,-1.48844 -1.636888,9.72058 z"
         style="fill:#ffffff;fill-opacity:1;fill-rule:evenodd;stroke:none" />
      <path
         inkscape:connector-curvature="0"
         id="path12615"
         d="m 63.598778,36.391991 4.417906,-1.48844 -1.636888,9.72058 z"
         style="fill:none;stroke:#ffffff;stroke-width:0.26486266px;stroke-linecap:butt;stroke-linejoin:miter;stroke-miterlimit:8;stroke-dasharray:none;stroke-opacity:1" />
      <path
         inkscape:connector-curvature="0"
         id="path12617"
         d="m 74.828964,46.351049 -0.921737,4.566073 30.099003,1.334911 z"
         style="fill:#ffffff;fill-opacity:1;fill-rule:evenodd;stroke:none" />
      <path
         inkscape:connector-curvature="0"
         id="path12619"
         d="m 74.828964,46.351049 -0.921737,4.566073 30.099003,1.334911 z"
         style="fill:none;stroke:#ffffff;stroke-width:0.26486266px;stroke-linecap:butt;stroke-linejoin:miter;stroke-miterlimit:8;stroke-dasharray:none;stroke-opacity:1" />
      <path
         inkscape:connector-curvature="0"
         id="path12621"
         d="m 74.87666,46.308716 -0.9271,4.571435 -7.585569,-6.293273 z"
         style="fill:#ffffff;fill-opacity:1;fill-rule:evenodd;stroke:none" />
      <path
         inkscape:connector-curvature="0"
         id="path12623"
         d="m 74.87666,46.308716 -0.9271,4.571435 -7.585569,-6.293273 z"
         style="fill:none;stroke:#ffffff;stroke-width:0.26486266px;stroke-linecap:butt;stroke-linejoin:miter;stroke-miterlimit:8;stroke-dasharray:none;stroke-opacity:1" />
      <path
         inkscape:connector-curvature="0"
         id="path12625"
         d="M 60.240333,50.895956 56.744164,47.81296 40.534449,73.213242 Z"
         style="fill:#ffffff;fill-opacity:1;fill-rule:evenodd;stroke:none" />
      <path
         inkscape:connector-curvature="0"
         id="path12627"
         d="M 60.240333,50.895956 56.744164,47.81296 40.534449,73.213242 Z"
         style="fill:none;stroke:#ffffff;stroke-width:0.26486266px;stroke-linecap:butt;stroke-linejoin:miter;stroke-miterlimit:8;stroke-dasharray:none;stroke-opacity:1" />
      <path
         inkscape:connector-curvature="0"
         id="path12629"
         d="M 60.245696,50.954376 56.754889,47.87138 65.998513,44.444073 Z"
         style="fill:#ffffff;fill-opacity:1;fill-rule:evenodd;stroke:none" />
      <path
         inkscape:connector-curvature="0"
         id="path12631"
         d="M 60.245696,50.954376 56.754889,47.87138 65.998513,44.444073 Z"
         style="fill:none;stroke:#ffffff;stroke-width:0.26486266px;stroke-linecap:butt;stroke-linejoin:miter;stroke-miterlimit:8;stroke-dasharray:none;stroke-opacity:1" />
    </g>
  </g>
</svg>
