HWT
Date,T_in,F_in,F_out
01.01.2016 00:00,55,0.05,-0.05
01.01.2016 00:15,60,0.15,-0.15
01.01.2016 00:30,65,0.45,-0.45
01.01.2016 00:45,55,0.6,-0.6
01.01.2016 01:00,40,0.5,-0.5
01.01.2016 01:15,53,0.25,-0.25
01.01.2016 01:30,48,0.15,-0.15
01.01.2016 01:45,43,0.35,-0.35
