v {xschem version=3.4.4 file_version=1.2
}
G {}
K {type=subcircuit
format="@spiceprefix@name @pinlist @symname"
spiceprefix=X
template="name=dut_model_1
spiceprefix=X
"}
V {}
S {}
E {}
L 4 0 -10 0 0 {}
L 4 -60 -60 -50 -60 {}
L 4 -60 -40 -50 -40 {}
L 4 -50 -10 50 -10 {}
L 4 -50 -90 -50 -10 {}
L 4 -50 -90 50 -90 {}
L 4 50 -90 50 -10 {}
L 4 50 -50 60 -50 {}
L 4 0 -100 0 -90 {}
B 5 -2.5 -102.5 2.5 -97.5 {name=VDD
dir=inout}
B 5 -2.5 -2.5 2.5 2.5 {name=VSS
dir=inout}
B 5 57.5 -52.5 62.5 -47.5 {name=vout
dir=out}
B 5 -62.5 -62.5 -57.5 -57.5 {name=vin
dir=in}
B 5 -62.5 -42.5 -57.5 -37.5 {name=ibias
dir=in}
T {VDD} 6.25 -86.25 1 0 0.2 0.2 {layer=7}
T {vin} -46.25 -66.25 0 0 0.2 0.2 {layer=7}
T {VSS} 6.25 -35 1 0 0.2 0.2 {layer=7}
T {vout} 22.5 -56.25 0 0 0.2 0.2 {layer=7}
T {@name} -60 -110 0 0 0.2 0.2 {}
T {@symname} 20 -110 0 0 0.2 0.2 {}
T {ibias} -46.25 -46.25 0 0 0.2 0.2 {layer=7}
