v {xschem version=3.1.0 file_version=1.2
}
G {}
K {type=subcircuit
format="@spiceprefix@name @pinlist @symname"
spiceprefix=X
template="name=dmux_2to1_1
spiceprefix=X
"
}
V {}
S {}
E {}
L 4 25 -102.5 25 -92.5 {}
L 4 100 -92.5 100 -37.5 {}
L 4 0 -65 20 -65 {}
L 4 100 -77.5 120 -77.5 {}
L 4 100 -52.5 120 -52.5 {}
L 4 25 -37.5 25 -27.5 {}
L 4 20 -90 20 -70 {}
L 4 20 -70 20 -40 {}
L 4 100 -110 100 -90 {}
L 4 100 -40 100 -20 {}
L 4 20 -40 100 -20 {}
L 4 20 -90 100 -110 {}
L 4 25 -92.5 25 -91.25 {}
L 4 57.5 -117.5 57.5 -100 {}
L 4 57.5 -100 57.5 -99.375 {}
L 4 25 -38.75 25 -37.5 {}
L 4 47.5 -33.125 47.5 -12.5 {}
L 4 67.5 -28.125 67.5 -12.5 {}
B 5 22.5 -105 27.5 -100 {name=VDD
dir=inout}
B 5 -2.5 -67.5 2.5 -62.5 {name=IN
dir=inout}
B 5 117.5 -80 122.5 -75 {name=OUTA
dir=inout}
B 5 117.5 -55 122.5 -50 {name=OUTB
dir=inout}
B 5 22.5 -30 27.5 -25 {name=VSS
dir=inout}
B 5 55 -120 60 -115 {name=CNT
dir=inout}
B 5 45 -15 50 -10 {name=EN
dir=inout}
B 5 65 -15 70 -10 {name=ENB
dir=inout}
T {@name} 26.875 -81.25 0 0 0.2 0.2 {}
T {VDD} -2.5 -108.125 0 0 0.2 0.2 {layer=7}
T {IN} 0 -80 0 0 0.2 0.2 {layer=7}
T {@symname} 26.875 -61.25 0 0 0.2 0.2 {}
T {OUTA} 115 -92.5 0 0 0.2 0.2 {layer=7}
T {OUTB} 115 -67.5 0 0 0.2 0.2 {layer=7}
T {VSS} -2.5 -32.5 0 0 0.2 0.2 {layer=7}
T {CNT} 82.5 -111.25 2 0 0.2 0.2 {layer=7}
T {EN} 42.5 -6.25 2 0 0.2 0.2 {layer=7}
T {ENB} 92.5 -6.25 2 0 0.2 0.2 {layer=7}
