v {xschem version=3.4.4 file_version=1.2
}
G {}
K {type=subcircuit
format="@spiceprefix@name @pinlist @symname"
spiceprefix=X
template="name=mux_sw1
spiceprefix=X
"
}
V {}
S {}
E {}
L 4 60 -120 60 -110 {}
L 4 50 -90 50 -40 {}
L 4 130 -70 150 -70 {}
L 4 30 -80 50 -80 {}
L 4 30 -50 50 -50 {}
L 4 130 -90 130 -70 {}
L 4 130 -70 130 -40 {}
L 4 50 -110 50 -90 {}
L 4 50 -40 50 -20 {}
L 4 50 -20 130 -40 {}
L 4 50 -110 130 -90 {}
L 4 90 -120 90 -100 {}
L 4 60 -20 60 -10 {}
L 4 60 -22.5 60 -20 {}
L 4 60 -110 60 -107.5 {}
B 5 57.5 -122.5 62.5 -117.5 {name=VDD
dir=inout}
B 5 147.5 -72.5 152.5 -67.5 {name=OUT
dir=inout}
B 5 27.5 -82.5 32.5 -77.5 {name=A
dir=inout}
B 5 27.5 -52.5 32.5 -47.5 {name=B
dir=inout}
B 5 87.5 -122.5 92.5 -117.5 {name=CNT
dir=inout}
B 5 57.5 -12.5 62.5 -7.5 {name=VSS
dir=inout}
T {@name} 100 -80 0 1 0.2 0.2 {}
T {VDD} 55 -130 0 1 0.2 0.2 {layer=7}
T {OUT} 160 -85 0 1 0.2 0.2 {layer=7}
T {@symname} 120 -60 0 1 0.2 0.2 {}
T {A} 45 -95 0 1 0.2 0.2 {layer=7}
T {B} 45 -65 0 1 0.2 0.2 {layer=7}
T {CNT} 95 -115 2 1 0.2 0.2 {layer=7}
T {VSS} 50 -10 0 1 0.2 0.2 {layer=7}
