v {xschem version=3.4.4 file_version=1.2
}
G {}
K {type=subcircuit
format="@spiceprefix@name @pinlist @symname"
spiceprefix=X
template="name=cmfb1
spiceprefix=X
"
}
V {}
S {}
E {}
L 4 60 -210 220 -130 {}
L 4 60 -40 220 -130 {}
L 4 60 -210 60 -40 {}
L 4 220 -130 260 -130 {}
L 4 20 -180 60 -180 {}
L 4 20 -140 60 -140 {}
L 4 20 -70 60 -70 {}
L 4 20 -110 60 -110 {}
L 4 80 -50 80 -20 {}
L 4 80 -230 80 -200 {}
L 4 140 -230 140 -170 {}
L 4 150 -90 150 -20 {}
L 4 70 -180 90 -180 {}
L 4 80 -190 80 -170 {}
L 4 70 -110 90 -110 {}
L 4 80 -110 80 -100 {}
L 4 70 -140 90 -140 {}
L 4 70 -70 90 -70 {}
L 4 80 -240 80 -230 {}
L 4 140 -240 140 -230 {}
L 4 180 -100 180 -20 {}
L 4 180 -107.5 180 -100 {}
L 4 130 -79.375 130 -20 {}
L 4 109.375 -67.5 109.375 -19.375 {}
L 4 170 -238.75 170 -155 {}
L 4 190 -238.75 190 -145 {}
L 4 110 -238.75 110 -185 {}
L 4 200 -118.75 200 -20 {}
L 4 80 -120 80 -110 {}
B 5 137.5 -242.5 142.5 -237.5 {name=vs1
dir=inout}
B 5 17.5 -182.5 22.5 -177.5 {name=vip1
dir=inout}
B 5 17.5 -142.5 22.5 -137.5 {name=vin1
dir=inout}
B 5 107.5 -22.5 112.5 -17.5 {name=VSS
dir=inout}
B 5 17.5 -72.5 22.5 -67.5 {name=vin2
dir=inout}
B 5 257.5 -132.5 262.5 -127.5 {name=vout
dir=inout}
B 5 127.5 -22.5 132.5 -17.5 {name=vsip1
dir=inout}
B 5 17.5 -112.5 22.5 -107.5 {name=vip2
dir=inout}
B 5 167.5 -242.5 172.5 -237.5 {name=vs2
dir=inout}
B 5 77.5 -242.5 82.5 -237.5 {name=vbias
dir=inout}
B 5 107.5 -242.5 112.5 -237.5 {name=AVDD
dir=inout}
B 5 147.5 -22.5 152.5 -17.5 {name=vsin1
dir=inout}
B 5 177.5 -22.5 182.5 -17.5 {name=vsip2
dir=inout}
B 5 197.5 -22.5 202.5 -17.5 {name=vsin2
dir=inout}
B 5 77.5 -22.5 82.5 -17.5 {name=en
dir=inout}
B 5 187.5 -242.5 192.5 -237.5 {name=vdiode
dir=inout}
T {@name} 130 -140 0 1 0.2 0.2 {}
T {vs1} 140 -210 1 1 0.2 0.2 {layer=7}
T {@symname} 160 -120 0 1 0.2 0.2 {}
T {vip1} 40 -190 0 1 0.2 0.2 {layer=7}
T {vin1} 40 -160 0 1 0.2 0.2 {layer=7}
T {VSS} 110 -20 1 1 0.2 0.2 {layer=7}
T {vin2} 40 -80 0 1 0.2 0.2 {layer=7}
T {vout} 250 -140 0 1 0.2 0.2 {layer=7}
T {vsip1} 130 -20 1 1 0.2 0.2 {layer=7}
T {vip2} 40 -120 0 1 0.2 0.2 {layer=7}
T {vs2} 170 -210 1 1 0.2 0.2 {layer=7}
T {vbias} 80 -200 1 1 0.2 0.2 {layer=7}
T {AVDD} 110 -200 1 1 0.2 0.2 {layer=7}
T {vdiode} 190 -200 1 1 0.2 0.2 {layer=7}
T {vsin1} 150 -20 1 1 0.2 0.2 {layer=7}
T {vsip2} 180 -20 1 1 0.2 0.2 {layer=7}
T {vsin2} 200 -20 1 1 0.2 0.2 {layer=7}
T {en} 80 -20 1 1 0.2 0.2 {layer=7}
