v {xschem version=3.4.4 file_version=1.2
}
G {}
K {type=subcircuit
format="@spiceprefix@name @pinlist @symname w=@w l=@l nf=@nf"
spiceprefix=X
template="name=M1 w=100n l=18n nf=4 spiceprefix=X"}
V {}
S {}
E {}
L 4 7.5 -22.5 7.5 22.5 {}
L 4 20 -30 20 -17.5 {}
L 4 20 17.5 20 30 {}
L 4 2.5 -15 2.5 15 {}
L 4 7.5 17.5 20 17.5 {}
L 4 12.5 -17.5 20 -17.5 {}
L 4 -20 0 -7.5 0 {}
B 5 17.5 27.5 22.5 32.5 {name=D dir=inout}
B 5 -22.5 -2.5 -17.5 2.5 {name=G dir=inout}
B 5 17.5 -32.5 22.5 -27.5 {name=S dir=inout}
B 5 19.921875 -0.078125 20.078125 0.078125 {name=B dir=inout}
A 4 -2.5 0 5 180 360 {}
P 4 4 12.5 -20 7.5 -17.5 12.5 -15 12.5 -20 {fill=true}
P 5 4 15 -2.5 20 0 15 2.5 15 -2.5 {fill=true}
T {@name} 5 -30 0 1 0.2 0.2 {}
T {D} 22.5 17.5 0 0 0.15 0.15 {layer=7}
T {S} 22.5 -17.5 2 1 0.15 0.15 {layer=7}
T {B} 20 -10 0 0 0.15 0.15 {layer=7}
T {G} -10 -10 0 1 0.15 0.15 {layer=7}
T {@symname} 30 -8.75 2 1 0.2 0.2 {}
T {l=@l} 31.25 10 0 0 0.2 0.2 { layer=13}
T {w=@w} 31.25 0 0 0 0.2 0.2 { layer=13}
T {nf=@nf} 31.25 20 0 0 0.2 0.2 { layer=13}
