[
  {
    "observations": [
      {
        "time": 0,
        "event": "",
        "variables": [
          "close"
        ]
      },
      {
        "time": 2,
        "event": "",
        "variables": [
          "close"
        ]
      },
      {
        "time": 4,
        "event": "pushed?",
        "variables": [
          "close"
        ]
      },
      {
        "time": 6,
        "event": "",
        "variables": [
          "close"
        ]
      },
      {
        "time": 8,
        "event": "",
        "variables": [
          "close"
        ]
      },
      {
        "time": 10,
        "event": "",
        "variables": [
          "unknown"
        ]
      },
      {
        "time": 12,
        "event": "",
        "variables": [
          "unknown"
        ]
      },
      {
        "time": 14,
        "event": "",
        "variables": [
          "unknown"
        ]
      },
      {
        "time": 16,
        "event": "",
        "variables": [
          "open"
        ]
      },
      {
        "time": 18,
        "event": "",
        "variables": [
          "open"
        ]
      },
      {
        "time": 20,
        "event": "",
        "variables": [
          "open"
        ]
      },
      {
        "time": 22,
        "event": "",
        "variables": [
          "unknown"
        ]
      },
      {
        "time": 24,
        "event": "",
        "variables": [
          "unknown"
        ]
      },
      {
        "time": 26,
        "event": "",
        "variables": [
          "unknown"
        ]
      },
      {
        "time": 28,
        "event": "",
        "variables": [
          "close"
        ]
      },
      {
        "time": 30,
        "event": "",
        "variables": [
          "close"
        ]
      },
      {
        "time": 32,
        "event": "",
        "variables": [
          "close"
        ]
      },
      {
        "time": 34,
        "event": "",
        "variables": [
          "close"
        ]
      },
      {
        "time": 36,
        "event": "",
        "variables": [
          "close"
        ]
      },
      {
        "time": 38,
        "event": "",
        "variables": [
          "close"
        ]
      },
      {
        "time": 40,
        "event": "",
        "variables": [
          "close"
        ]
      },
      {
        "time": 42,
        "event": "pushed?",
        "variables": [
          "close"
        ]
      },
      {
        "time": 44,
        "event": "",
        "variables": [
          "unknown"
        ]
      },
      {
        "time": 46,
        "event": "",
        "variables": [
          "unknown"
        ]
      },
      {
        "time": 48,
        "event": "",
        "variables": [
          "unknown"
        ]
      },
      {
        "time": 50,
        "event": "",
        "variables": [
          "open"
        ]
      }
    ]
  },
  {
    "observations": [
      {
        "time": 0,
        "event": "pushed?",
        "variables": [
          "close"
        ]
      },
      {
        "time": 2,
        "event": "",
        "variables": [
          "close"
        ]
      },
      {
        "time": 4,
        "event": "",
        "variables": [
          "unknown"
        ]
      },
      {
        "time": 6,
        "event": "",
        "variables": [
          "unknown"
        ]
      },
      {
        "time": 8,
        "event": "",
        "variables": [
          "unknown"
        ]
      },
      {
        "time": 10,
        "event": "",
        "variables": [
          "open"
        ]
      },
      {
        "time": 12,
        "event": "",
        "variables": [
          "open"
        ]
      },
      {
        "time": 14,
        "event": "",
        "variables": [
          "open"
        ]
      },
      {
        "time": 16,
        "event": "",
        "variables": [
          "unknown"
        ]
      },
      {
        "time": 18,
        "event": "",
        "variables": [
          "unknown"
        ]
      },
      {
        "time": 20,
        "event": "",
        "variables": [
          "unknown"
        ]
      },
      {
        "time": 22,
        "event": "",
        "variables": [
          "close"
        ]
      },
      {
        "time": 24,
        "event": "",
        "variables": [
          "close"
        ]
      },
      {
        "time": 26,
        "event": "",
        "variables": [
          "close"
        ]
      },
      {
        "time": 28,
        "event": "",
        "variables": [
          "close"
        ]
      },
      {
        "time": 30,
        "event": "",
        "variables": [
          "close"
        ]
      },
      {
        "time": 32,
        "event": "pushed?",
        "variables": [
          "close"
        ]
      },
      {
        "time": 34,
        "event": "",
        "variables": [
          "close"
        ]
      },
      {
        "time": 36,
        "event": "",
        "variables": [
          "unknown"
        ]
      },
      {
        "time": 38,
        "event": "",
        "variables": [
          "unknown"
        ]
      },
      {
        "time": 40,
        "event": "",
        "variables": [
          "unknown"
        ]
      },
      {
        "time": 42,
        "event": "",
        "variables": [
          "open"
        ]
      },
      {
        "time": 44,
        "event": "",
        "variables": [
          "open"
        ]
      },
      {
        "time": 46,
        "event": "",
        "variables": [
          "open"
        ]
      },
      {
        "time": 48,
        "event": "",
        "variables": [
          "open"
        ]
      },
      {
        "time": 50,
        "event": "",
        "variables": [
          "unknown"
        ]
      }
    ]
  },
    {
    "observations": [
      {
        "time": 0,
        "event": "",
        "variables": [
          "close"
        ]
      },
      {
        "time": 2,
        "event": "pushed?",
        "variables": [
          "close"
        ]
      },
      {
        "time": 4,
        "event": "",
        "variables": [
          "close"
        ]
      },
      {
        "time": 6,
        "event": "",
        "variables": [
          "unknown"
        ]
      },
      {
        "time": 8,
        "event": "",
        "variables": [
          "unknown"
        ]
      },
      {
        "time": 10,
        "event": "",
        "variables": [
          "unknown"
        ]
      },
      {
        "time": 12,
        "event": "",
        "variables": [
          "open"
        ]
      },
      {
        "time": 14,
        "event": "",
        "variables": [
          "open"
        ]
      },
      {
        "time": 16,
        "event": "",
        "variables": [
          "open"
        ]
      },
      {
        "time": 18,
        "event": "",
        "variables": [
          "open"
        ]
      },
      {
        "time": 20,
        "event": "",
        "variables": [
          "unknown"
        ]
      },
      {
        "time": 22,
        "event": "",
        "variables": [
          "unknown"
        ]
      },
      {
        "time": 24,
        "event": "",
        "variables": [
          "unknown"
        ]
      },
      {
        "time": 26,
        "event": "",
        "variables": [
          "close"
        ]
      },
      {
        "time": 28,
        "event": "",
        "variables": [
          "close"
        ]
      },
      {
        "time": 30,
        "event": "",
        "variables": [
          "close"
        ]
      },
      {
        "time": 32,
        "event": "pushed?",
        "variables": [
          "close"
        ]
      },
      {
        "time": 34,
        "event": "",
        "variables": [
          "unknown"
        ]
      },
      {
        "time": 36,
        "event": "",
        "variables": [
          "unknown"
        ]
      },
      {
        "time": 38,
        "event": "",
        "variables": [
          "unknown"
        ]
      },
      {
        "time": 40,
        "event": "",
        "variables": [
          "open"
        ]
      },
      {
        "time": 42,
        "event": "",
        "variables": [
          "open"
        ]
      },
      {
        "time": 44,
        "event": "",
        "variables": [
          "unknown"
        ]
      },
      {
        "time": 46,
        "event": "",
        "variables": [
          "unknown"
        ]
      },
      {
        "time": 48,
        "event": "",
        "variables": [
          "unknown"
        ]
      },
      {
        "time": 50,
        "event": "",
        "variables": [
          "close"
        ]
      }
    ]
  }
]