[
	{	
		"algorithm": "MD5" ,
		"password": "asdqwen21nassdfw",
		"hash": "NGQ2NTRmNjcyZTQ1MWU0Mzk3MGNlMDI1Njg3ZGJhNWY="
	},
	{	
		"algorithm": "MD5" ,
		"password": "sdfnwjzxfer",
		"hash": "NGQ2NTRmNjcyZTQ1MWU0Mzk3MGNlMDI1Njg3ZGJhNWY="
	}
]