[
	{	
		"algorithm": "SHA-512" ,
		"password": "osF6O9+AS3",
		"hash": "YTFjZWNmNDVlZTM4NjJkNzRkY2MyMGM4ZWJjNTE1NDIxNzU1Njg5YzcwM2IyMTI4MzgzYmI5ZTU4ZTcyOWRhNzkwNWRmNTRkNjIxNjFlOWFkNGM3MmMzNjdkNzc0ZGRjODMzZTJkM2JlNTU1ZWU1ZGZlNjZjY2E2MTM0NDIwYWY="
	}
]