ply
format ascii 1.0
comment Exported from MorphoGraphX 2.0 131a97d-dirty
comment Cell Graph: each vertex is a cell, each edge a wall
element vertex 502
property int label
property float x
property float y
property float z
element edge 3282
property uint source
property uint target
end_header
486 50.6319 76.9948 -1.93094 
494 56.8713 84.7649 -12.9126 
495 55.3357 80.5325 -7.74684 
487 48.3946 72.483 3.31874 
344 55.8218 64.9117 5.3433 
332 52.9576 60.9237 9.88887 
488 44.3059 68.75 8.80305 
520 32.5357 83.0008 -0.636878 
392 30.2556 75.75 8.44373 
261 17.2257 10.5043 44.8231 
397 33.5541 66.7431 15.3569 
464 -89.317 -58.211 18.9329 
465 -87.3253 -63.0908 23.6056 
82 -91.2255 -70.9846 12.4975 
467 -87.4413 -73.3221 22.2882 
84 -87.4168 -83.6591 15.4956 
83 -89.6301 -83.897 5.25451 
66 -91.4352 15.9753 -15.4596 
70 -93.2557 8.8718 -15.4052 
74 -93.0504 -12.0745 -6.88973 
76 -96.2193 -22.5184 -11.0329 
77 -94.9479 -31.05 -5.22564 
78 -92.8335 -34.944 2.03739 
79 -93.0137 -45.4109 5.20006 
81 -93.4734 -62.9677 6.19423 
80 -92.317 -53.6739 10.4209 
452 -92.4473 -22.1377 -1.19411 
331 46.0263 56.3703 16.7125 
502 -95.2149 3.63062 -16.3182 
72 -91.35 2.20298 -10.1207 
330 52.3386 51.9046 15.7992 
258 29.942 7.50836 41.3608 
136 -57.0854 -55.0581 38.6147 
460 -88.9956 -45.6195 16.012 
453 -87.7166 -24.4879 9.71539 
347 51.3716 39.6846 22.4013 
540 81.9579 85.4156 -30.6129 
541 81.1766 89.3667 -36.4284 
135 -46.7324 -62.1512 37.5443 
329 44.6355 47.5655 22.3187 
30 81.0956 54.7018 3.00228 
134 -52.0392 -64.5298 39.3756 
126 -55.7426 -72.2022 40.7911 
470 -60.0247 -80.8185 41.0501 
118 -49.1305 -84.2547 39.1863 
22 83.7136 7.03063 8.80085 
24 85.3411 -4.76047 7.77794 
19 82.2417 -16.7725 7.08197 
356 46.5128 35.6843 26.694 
18 82.503 -34.2216 0.619986 
114 -52.547 -99.4309 34.2676 
115 -59.028 -94.0714 37.478 
91 -51.7181 -109.734 21.6172 
117 -60.4793 -106.367 25.7208 
458 -88.3388 -32.7414 11.9016 
450 -89.2895 -11.1988 0.683793 
33 77.0086 75.5722 -14.1599 
29 78.1139 49.0184 5.40335 
537 79.8913 24.6302 9.79157 
25 77.8837 18.2759 11.1191 
23 82.2405 2.05489 9.37589 
235 78.3687 8.34607 11.5322 
234 76.8937 -1.76926 12.9309 
233 80.7727 -6.94327 10.059 
193 75.5204 -26.3045 7.91408 
192 77.6253 -32.6314 3.53015 
17 78.2976 -40.6417 -0.897797 
349 53.4883 32.4412 23.891 
543 -57.2309 53.5214 3.96407 
542 -52.9342 53.7594 6.74673 
410 -63.6781 48.675 1.53531 
447 -87.5322 13.5992 -10.0128 
35 71.7338 91.0441 -30.2808 
34 71.392 85.5782 -22.7128 
32 78.8853 67.34 -6.22615 
31 78.8844 62.1977 -1.67281 
341 72.1114 64.6364 -2.09436 
340 72.7856 58.8303 1.7979 
339 69.3063 53.0927 5.99487 
28 74.26 44.6363 7.55387 
27 73.0469 38.0963 9.85628 
236 72.9828 10.1409 14.9906 
231 76.8744 -13.6971 11.4021 
15 73.2402 -59.0988 -12.6336 
352 51.7745 24.9662 27.0868 
257 19.4456 1.32398 44.6 
260 19.4976 18.3577 42.9615 
85 -78.5843 -92.6128 24.5324 
86 -82.1166 -95.3437 11.5992 
493 71.3845 72.6365 -8.6678 
492 66.8115 81.8331 -15.4674 
338 66.2227 45.7825 10.6866 
350 67.4629 31.4168 14.8445 
351 69.5391 24.6783 15.141 
238 66.3994 4.62839 20.1464 
237 70.281 -2.88127 17.3363 
230 68.8045 -13.0575 16.8511 
232 72.9349 -17.9716 12.9173 
190 69.7313 -37.1975 6.44813 
191 73.3601 -40.3842 1.87279 
188 70.7213 -45.0962 0.42828 
186 70.1595 -51.8525 -4.81554 
468 -83.3413 -79.6078 27.4418 
37 60.8018 96.0561 -28.7745 
36 63.7718 99.1188 -35.1705 
491 64.3052 77.3316 -9.58707 
343 66.1042 69.0506 -3.22333 
342 64.5865 62.706 2.28339 
244 62.3053 19.6407 21.2572 
240 69.5702 19.409 16.1649 
239 65.8036 12.4801 19.9873 
194 67.3997 -23.6552 14.7127 
195 66.7433 -31.456 11.9058 
189 67.0906 -46.7174 1.90283 
181 64.6654 -58.194 -6.62856 
14 66.1818 -64.5288 -14.7272 
462 -83.111 -54.2639 28.1151 
461 -86.7696 -48.5022 21.1534 
490 58.9474 74.6798 -4.3319 
489 57.7679 69.7674 0.401557 
337 59.8944 55.4915 9.42655 
345 60.9463 41.9419 15.4021 
243 56.541 17.7277 25.6912 
241 60.5644 6.36885 24.2327 
229 62.4758 -5.52691 22.2954 
228 61.6948 -15.7294 20.9226 
199 60.1839 -28.1634 18.1844 
197 57.0444 -40.7775 14.4811 
196 62.8173 -39.4803 10.6057 
185 61.7467 -50.694 3.27334 
184 54.524 -57.2126 3.4283 
183 57.8952 -58.9689 -1.39851 
353 44.4823 25.9576 31.1725 
473 -79.9055 -44.9785 28.4059 
459 -88.9678 -38.4183 12.8443 
39 52.9477 102.645 -32.3861 
38 61.1223 90.0442 -21.2923 
346 55.3008 42.0228 19.0275 
348 59.3611 30.4358 20.6728 
242 55.6001 4.40595 27.5527 
249 54.0936 -7.70957 27.477 
227 53.7151 -18.8833 25.4779 
198 54.9105 -31.5111 20.6556 
201 52.7538 -48.6151 12.41 
182 59.1523 -64.166 -8.74901 
12 56.0497 -71.7398 -16.2843 
13 60.9569 -69.9809 -17.7798 
245 48.2478 12.7547 31.6052 
304 -49.8353 25.585 24.6903 
451 -88.2987 -16.2367 5.24098 
444 -83.7412 3.8319 1.53079 
248 50.0678 -0.690869 30.9314 
250 46.7944 -10.2135 31.6808 
226 50.484 -26.2281 25.5031 
206 45.2993 -34.9023 25.4801 
200 49.2855 -41.2316 19.839 
203 49.3176 -57.1987 7.70575 
179 49.8598 -64.2801 -0.683828 
11 50.4371 -75.0103 -15.9096 
416 -52.8464 42.3522 14.285 
514 30.9937 -81.966 -7.49008 
445 -80.1191 9.79773 2.9866 
388 7.66597 85.1859 0.615735 
420 -62.6247 37.6593 7.86394 
496 52.0505 91.5807 -18.2033 
246 40.5875 9.88129 36.2098 
247 44.1291 -1.90314 34.3133 
225 44.2548 -18.62 31.6257 
224 42.6969 -26.1502 30.4175 
204 41.4085 -47.9493 20.6254 
202 45.1983 -54.4519 13.2514 
177 42.4931 -63.4288 6.37211 
533 51.9261 -69.31 -8.93384 
518 41.9751 -76.8515 -10.1461 
519 45.9616 -76.9725 -14.6509 
417 -55.9494 33.9009 16.1179 
415 -46.5157 38.8182 20.7752 
513 31.2812 -86.0027 -14.7505 
46 29.6733 97.8143 -16.7903 
442 -77.8913 -3.07579 13.5018 
51 6.17389 89.4055 -4.93593 
498 40.6014 93.8184 -16.0042 
41 43.9386 98.2106 -22.3532 
521 34.2796 89.1402 -8.42424 
484 41.357 79.5561 -0.00481706 
483 38.2225 75.4139 5.63169 
354 38.2514 25.6275 34.533 
253 34.9237 -1.60577 39.1072 
252 38.0459 -10.1347 36.6631 
222 34.6881 -30.8034 33.2155 
205 37.0643 -42.5832 26.649 
532 46.3317 -69.3723 -3.7703 
517 39.0083 -74.4996 -3.82983 
45 24.6441 91.8233 -9.24348 
44 25.6794 95.1282 -13.1257 
50 -1.06129 93.2837 -9.35926 
47 34.2501 99.5975 -20.0522 
327 33.3623 37.295 32.6163 
251 32.8247 -19.7097 37.4426 
303 -58.4481 26.295 17.5961 
389 20.6527 88.7726 -4.93664 
334 35.388 55.9312 22.1333 
326 27.1389 36.429 35.2734 
325 27.704 26.578 38.542 
223 29.5119 -37.2439 33.0758 
73 -95.3088 -8.41207 -12.9171 
393 22.8617 72.4583 13.8767 
396 21.3654 60.9273 23.6938 
395 26.6083 64.092 20.0563 
391 23.0776 78.4737 7.43787 
390 19.8499 83.9577 1.32535 
336 26.5156 47.0835 30.2941 
259 31.6367 17.7438 39.4586 
255 24.0353 -15.9893 41.6389 
170 23.3934 -61.8956 19.3286 
168 25.5017 -69.3657 11.539 
164 24.4659 -79.8976 0.820499 
335 25.7529 53.3235 27.2972 
299 -53.2678 18.5171 25.0903 
323 15.5366 26.2102 41.7394 
256 17.4825 -7.19878 44.7979 
173 19.7579 -50.2524 29.4245 
169 17.7477 -67.4436 17.1447 
163 18.5789 -74.5102 10.3114 
511 19.192 -91.0944 -10.3604 
512 25.1676 -90.0564 -15.3312 
463 -80.0923 -59.9765 32.1436 
358 10.9624 47.3905 33.2925 
505 17.3319 31.6401 39.5488 
268 13.0259 -17.2659 44.3085 
221 19.3172 -28.6693 39.8234 
220 19.1123 -38.7384 35.8863 
215 11.9885 -46.7098 33.5863 
172 12.6906 -57.3764 26.9641 
162 14.2959 -78.7664 8.41871 
165 18.8657 -81.9229 2.33851 
510 12.8343 -94.6273 -8.74642 
302 -61.6768 19.1435 18.2271 
207 30.0249 -48.3303 26.365 
52 15.3081 95.0533 -11.4691 
367 6.84022 67.0006 20.5898 
506 19.4877 38.6606 36.2561 
262 6.18636 9.13898 46.4914 
266 0.469186 -1.25272 46.8293 
276 7.4402 -24.1994 43.4437 
219 7.94892 -35.1095 39.6876 
214 6.10668 -49.4605 33.2639 
161 7.49076 -76.6781 13.3313 
102 11.2725 -83.4576 5.13555 
385 0.790055 75.7944 11.7068 
366 9.57591 60.8125 25.3413 
360 -0.0203696 45.8384 34.7717 
357 7.03608 38.09 38.4367 
322 5.30303 28.2811 42.4225 
267 7.48906 -5.50447 46.6303 
269 3.81789 -13.7242 45.9512 
216 1.83284 -40.8342 37.9903 
157 1.9246 -62.4456 25.8607 
160 9.98922 -71.7373 16.4692 
301 -61.4343 11.0164 22.0951 
167 28.5706 -72.0935 6.94469 
530 19.9125 -86.1279 -3.93832 
384 -2.86141 78.4276 7.95293 
368 3.49812 71.1326 16.8334 
369 -5.34309 69.1888 17.4051 
364 -4.83829 59.6454 25.533 
365 -0.894011 54.1822 29.7336 
321 -2.9324 31.8962 41.2023 
320 -6.07449 22.8798 43.777 
265 -5.70565 5.4793 46.7869 
275 0.408175 -20.9789 44.5121 
159 0.972174 -71.7097 19.2575 
105 2.75987 -90.5967 5.0153 
531 24.3936 -85.5335 -7.0527 
382 -5.81294 84.5202 -0.257728 
383 -5.29161 81.5131 3.71739 
523 -11.4394 11.147 45.5199 
274 -9.44081 -22.3323 43.8353 
218 -0.357158 -31.537 41.5112 
217 -4.53841 -38.7111 39.0453 
213 -2.92805 -47.25 35.4902 
212 -2.20613 -54.3954 31.5105 
153 -5.44965 -73.7708 20.1698 
152 -7.74764 -80.1257 18.1481 
103 1.45088 -80.0389 13.4623 
106 -1.86064 -87.2722 10.787 
99 -2.17936 -100.444 -1.35128 
49 -10.419 92.7861 -9.92785 
399 -6.71654 89.1278 -5.8745 
380 -13.7256 75.2592 9.00518 
319 -12.3903 34.5322 38.8822 
271 -12.8501 -1.69799 46.0531 
272 -5.89138 -11.8692 45.981 
273 -12.7999 -10.8138 45.5675 
210 -12.797 -40.8193 38.0606 
156 -10.8719 -58.093 29.8383 
155 -8.37775 -65.5618 25.4652 
154 -12.0138 -71.7454 23.5589 
107 -9.65325 -86.7056 16.2885 
98 -4.0267 -94.7119 6.97417 
97 -7.9911 -99.7494 5.77945 
398 -13.3323 86.4345 -4.28223 
48 -16.983 90.1731 -8.6237 
379 -16.567 79.996 2.44034 
363 -16.1856 50.5143 29.1161 
318 -17.7013 40.5103 34.5316 
317 -18.1343 27.0915 40.3182 
504 -18.0986 19.2276 42.7471 
280 -11.5257 -32.1272 41.0505 
211 -14.1252 -47.0505 35.4814 
149 -16.83 -63.8185 27.7722 
150 -20.3159 -70.8951 26.6718 
151 -17.357 -78.2095 23.8385 
110 -19.6466 -85.9499 23.4184 
108 -11.4351 -91.9707 15.0761 
96 -13.9034 -98.2789 13.0008 
436 -60.2927 -10.1341 29.352 
166 31.9107 -75.9202 0.243919 
437 -60.5402 -16.8605 30.7813 
370 -13.2114 65.6541 18.7035 
377 -20.685 69.9347 12.153 
376 -24.8715 62.4222 17.2273 
371 -17.1268 58.426 23.4453 
315 -26.0565 44.8026 29.0985 
316 -25.8238 30.4872 36.3879 
308 -25.6614 11.7408 42.1995 
270 -21.3197 -1.05244 44.547 
277 -19.5056 -15.7354 43.9242 
281 -21.4081 -32.3965 39.9755 
209 -23.4496 -38.5066 38.0724 
208 -24.6263 -45.3662 35.4305 
147 -20.2973 -54.7956 31.7525 
109 -20.1877 -93.5481 21.2582 
94 -21.7354 -102.441 15.933 
479 -64.1197 -23.0589 30.8639 
290 -56.1929 -24.0009 33.7885 
515 35.8315 -82.0203 -12.3584 
378 -25.0794 72.7718 7.19273 
372 -24.2614 53.7141 24.1217 
311 -28.2345 -7.11332 43.0354 
278 -31.0361 -16.4249 41.2152 
283 -34.5602 -21.7053 39.6466 
279 -20.704 -26.347 41.7437 
148 -22.5135 -62.3174 29.3975 
122 -25.9975 -78.0582 28.1551 
121 -27.5958 -87.9011 28.1645 
289 -57.0397 -30.3116 34.7133 
476 -63.5074 -33.3642 33.6398 
401 -22.787 84.0435 -4.36284 
53 -30.9024 86.8209 -8.55257 
403 -30.4527 78.3636 -1.36262 
314 -33.6091 46.7804 24.204 
312 -30.6361 35.572 31.9421 
306 -36.1996 24.9975 33.43 
309 -33.5658 4.53581 40.3603 
282 -31.9721 -31.4832 38.731 
123 -31.1297 -78.4753 31.1043 
111 -28.6837 -100.383 23.44 
93 -32.2227 -108.413 17.072 
139 -62.6334 -49.874 37.6216 
141 -51.4016 -48.1703 36.9738 
359 15.4964 54.4161 28.9842 
56 -34.9073 80.0388 -4.75718 
373 -32.9995 53.6001 20.0512 
313 -36.7273 37.9618 27.4913 
503 -28.4089 19.3988 39.315 
298 -38.1941 12.9054 36.3415 
310 -38.1415 -4.93496 39.4472 
286 -35.1589 -37.5096 37.0348 
145 -38.6475 -51.1861 34.8433 
130 -36.8766 -66.2016 34.0153 
131 -30.1372 -69.8974 30.8887 
124 -38.2997 -77.9125 35.0788 
120 -33.1801 -88.6245 31.4801 
112 -37.1376 -100.889 28.0749 
55 -41.8939 78.7233 -6.19007 
405 -36.942 71.4522 2.10292 
374 -36.9011 56.057 15.9992 
414 -42.4986 46.5653 18.997 
418 -45.4221 31.5993 25.0531 
297 -44.0014 14.5945 32.5911 
284 -40.8369 -26.259 37.6865 
285 -41.6747 -34.2654 36.6779 
142 -43.8628 -42.2404 36.2459 
143 -33.7153 -46.1335 35.3027 
508 -41.7265 -55.1537 35.3238 
125 -44.285 -72.9943 37.601 
119 -41.7636 -89.5868 35.7396 
42 50.118 99.1351 -26.3748 
475 -68.341 -42.2016 34.4285 
394 17.7147 69.4562 17.7346 
57 -48.4902 70.9804 -3.5029 
58 -43.467 69.6093 0.112853 
406 -40.7749 61.0161 9.3763 
413 -47.4631 51.3731 12.4366 
305 -42.9921 23.1091 30.3421 
293 -44.3835 -11.1229 36.9886 
292 -47.0318 -19.3133 36.2579 
288 -51.0806 -35.4445 35.9496 
507 -45.5325 -56.9348 36.5423 
92 -42.2081 -112.184 14.9166 
137 -68.4309 -63.2164 38.443 
407 -46.0511 62.3968 4.8855 
61 -53.1231 61.6829 0.92929 
296 -46.4036 4.88377 33.8599 
295 -48.7461 -1.36599 33.8871 
294 -51.335 -9.45541 33.7691 
291 -52.8914 -17.3561 33.9986 
140 -57.8337 -42.8143 36.3525 
113 -44.518 -101.777 30.9964 
528 -53.6211 -113.774 9.43094 
386 11.4225 75.3048 12.5134 
60 -60.1291 57.9006 -0.900342 
300 -51.8601 12.4661 28.4033 
434 -59.535 4.53565 25.838 
435 -57.597 -2.85372 29.2048 
287 -49.4278 -27.4125 35.6673 
127 -66.4179 -71.5224 40.4343 
387 11.4406 80.7405 6.26956 
412 -56.5178 45.0456 9.65748 
59 -69.7383 49.343 -3.32445 
422 -67.6902 31.9701 5.43232 
432 -65.7204 13.5831 17.359 
440 -66.9023 -3.56768 23.5081 
477 -71.3774 -29.842 29.3487 
138 -69.3882 -56.5957 37.6969 
471 -61.14 -86.6335 40.0714 
426 -73.8423 32.2684 -1.46753 
424 -70.9911 23.207 6.70464 
431 -72.5039 12.3477 11.015 
438 -68.9316 -14.4023 25.7673 
478 -72.0296 -21.8842 26.2676 
474 -73.3757 -38.1155 30.9811 
128 -73.6856 -81.953 35.9785 
129 -70.2928 -90.3017 35.6764 
526 -62.961 -109.883 15.1057 
527 -65.8964 -110.328 4.85119 
62 -77.2697 39.842 -6.75963 
430 -76.8932 16.467 3.46488 
441 -71.583 -1.58454 19.0001 
456 -78.4506 -33.5265 25.6257 
472 -72.9851 -50.0706 34.7032 
469 -77.8524 -73.6961 34.8444 
524 -72.092 -104.029 16.6543 
525 -75.058 -104.194 4.44032 
480 -77.2695 -17.3248 20.1876 
449 -83.1238 -12.4115 11.4474 
454 -83.111 -25.9215 17.333 
457 -84.0114 -36.9312 20.8043 
466 -81.7638 -68.6247 31.3957 
481 -76.7335 -10.452 18.0471 
116 -67.1478 -100.022 29.8744 
67 -86.4615 21.4284 -11.7366 
446 -85.2661 10.8032 -5.203 
75 -88.7721 -0.57299 -4.23307 
448 -84.2937 -2.73224 4.77824 
95 -16.221 -104.191 9.03746 
497 43.3383 89.5115 -11.8576 
146 -26.5987 -54.7592 32.3578 
175 31.7306 -61.2967 15.3922 
174 25.7087 -54.1458 24.4995 
485 45.9397 83.4967 -6.22286 
443 -76.7371 3.16602 11.3243 
429 -81.2066 18.4162 -3.577 
64 -83.0383 28.7118 -10.2611 
455 -78.581 -25.0997 22.1642 
65 -80.293 25.9905 -6.28275 
425 -74.9649 26.0946 0.37774 
63 -81.0916 34.5728 -9.361 
427 -72.1309 36.6199 -1.52461 
439 -69.1252 -9.10337 23.8468 
254 29.8009 -6.77851 40.9032 
428 -72.2313 40.9737 -2.85273 
433 -69.6289 7.58602 16.5305 
423 -66.3324 21.0337 12.902 
421 -63.7477 29.6137 10.9822 
411 -62.767 44.7152 4.14628 
509 5.81833 -95.4282 -2.69463 
333 43.1847 63.3963 13.57 
178 37.4622 -67.8882 5.17371 
529 -47.5878 -115.707 2.72543 
176 37.9787 -57.7707 14.9711 
534 -31.5626 -58.7841 32.1708 
375 -31.2474 64.3761 12.2649 
404 -33.2942 69.7693 5.79431 
402 -26.519 77.4188 1.40349 
535 -30.1133 -63.2233 31.2211 
54 -23.7453 89.1529 -8.92357 
328 37.8669 44.566 27.2623 
361 -4.9493 40.6627 37.1627 
362 -9.46524 49.2388 31.6208 
101 11.445 -88.8646 -0.30853 
104 3.92927 -84.063 9.35273 
158 7.80904 -66.1583 21.6919 
171 13.1562 -62.0565 23.4617 
263 5.43826 17.9072 45.1569 
40 36.2456 102.877 -24.1045 
355 40.699 34.9445 30.211 
516 40.012 -83.2998 -19.6411 
187 70.5781 -56.3324 -9.13144 
16 75.519 -48.9648 -5.29144 
536 75.3199 29.2115 10.7991 
486 487
486 489
486 490
486 495
486 485
486 484
486 487
494 495
494 491
494 492
494 38
494 496
494 485
494 495
495 494
495 485
495 486
495 490
495 491
495 494
487 344
487 489
487 486
487 484
487 483
487 488
487 344
344 487
344 488
344 332
344 337
344 342
344 489
344 487
332 331
332 330
332 337
332 344
332 488
332 333
332 331
488 344
488 487
488 483
488 397
488 333
488 332
488 344
520 521
520 389
520 390
520 391
520 392
520 483
520 484
520 485
520 521
392 391
392 393
392 397
392 483
392 520
392 391
261 258
261 260
261 263
261 262
261 257
261 258
397 393
397 395
397 334
397 333
397 488
397 483
397 392
397 393
464 82
464 465
464 462
464 461
464 80
464 81
464 82
465 82
465 467
465 466
465 463
465 462
465 464
465 82
82 465
82 464
82 81
82 83
82 84
82 467
82 465
467 84
467 468
467 466
467 465
467 82
467 84
84 83
84 86
84 85
84 468
84 467
84 82
84 83
83 86
83 84
83 82
66 70
66 447
66 67
66 70
70 66
70 502
70 72
70 447
70 66
74 452
74 450
74 75
74 73
74 76
74 452
76 74
76 77
76 452
76 74
77 78
77 452
77 76
78 453
78 452
78 77
78 79
78 459
78 458
78 453
79 80
79 460
79 459
79 78
81 82
81 464
81 80
80 81
80 464
80 461
80 460
80 79
80 81
452 74
452 76
452 77
452 78
452 453
452 451
452 450
452 74
331 332
331 333
331 334
331 329
331 330
331 332
502 72
502 70
72 447
72 70
72 502
72 73
72 75
72 446
72 447
330 337
330 332
330 331
330 329
330 346
330 345
330 337
258 261
258 257
258 253
258 246
258 259
258 260
258 261
136 507
136 141
136 139
136 138
136 137
136 134
136 135
460 80
460 461
460 457
460 459
460 79
460 80
453 78
453 458
453 454
453 449
453 451
453 452
453 78
347 356
347 349
347 346
347 329
347 356
540 541
540 35
540 34
540 541
541 35
541 540
135 507
135 136
135 134
135 125
135 130
135 507
329 328
329 356
329 347
329 346
329 330
329 331
329 334
329 328
30 31
30 340
30 29
134 135
134 136
134 137
134 126
134 125
134 135
126 125
126 134
126 137
126 127
126 470
126 118
126 125
470 118
470 126
470 127
470 128
470 471
470 118
118 126
118 470
118 471
118 115
118 114
118 119
118 124
118 125
118 126
22 25
22 235
22 23
22 24
24 23
24 233
24 19
24 22
24 23
19 24
19 233
19 231
19 193
356 347
356 329
356 328
356 355
356 353
356 352
356 349
356 347
18 17
18 192
18 17
114 91
114 113
114 119
114 118
114 115
114 116
114 117
114 91
115 118
115 471
115 129
115 116
115 114
115 118
91 92
91 113
91 114
91 117
91 526
91 528
91 92
117 91
117 114
117 116
117 524
117 526
117 91
458 459
458 457
458 454
458 453
458 78
458 459
450 452
450 451
450 449
450 448
450 75
450 74
450 452
33 34
33 492
33 493
33 32
29 339
29 28
29 30
29 340
29 339
537 536
537 25
25 537
25 536
25 351
25 240
25 236
25 235
25 22
25 537
23 22
23 235
23 234
23 233
23 24
23 22
235 234
235 23
235 22
235 25
235 236
234 23
234 235
234 236
234 237
234 231
234 233
234 23
233 24
233 23
233 234
233 231
233 19
233 24
193 19
193 231
193 232
193 194
193 195
193 190
193 192
193 19
192 193
192 190
192 191
192 17
192 18
192 193
17 192
17 191
17 16
17 18
349 347
349 356
349 352
349 348
349 346
349 347
543 61
543 60
543 410
543 411
543 542
543 61
542 543
542 411
542 412
542 413
542 406
542 407
542 61
542 543
410 59
410 428
410 411
410 543
410 60
410 59
447 72
447 446
447 429
447 67
447 66
447 70
447 72
35 37
35 38
35 34
35 540
35 541
35 36
34 540
34 35
34 38
34 492
34 33
32 33
32 493
32 341
32 31
31 32
31 341
31 340
31 30
31 32
341 32
341 493
341 343
341 342
341 340
341 31
341 32
340 341
340 342
340 339
340 29
340 30
340 31
339 29
339 340
339 342
339 337
339 338
339 28
339 29
28 338
28 27
28 29
28 339
28 338
27 338
27 350
27 536
27 28
27 338
236 240
236 239
236 238
236 237
236 234
236 235
236 25
236 240
231 232
231 193
231 19
231 233
231 234
231 237
231 230
231 232
15 16
15 187
15 14
352 353
352 245
352 243
352 348
352 349
352 356
352 353
257 258
257 261
257 262
257 266
257 267
257 256
257 254
257 253
257 258
260 261
260 258
260 259
260 325
260 323
260 263
260 261
85 86
85 524
85 116
85 129
85 128
85 468
85 84
85 86
86 85
86 84
86 83
86 525
86 524
86 85
493 492
493 491
493 343
493 341
493 32
493 33
493 492
492 493
492 33
492 34
492 38
492 494
492 491
492 493
338 27
338 28
338 339
338 337
338 345
338 350
338 27
350 338
350 345
350 348
350 244
350 351
350 536
350 27
351 244
351 240
351 25
351 536
351 350
238 239
238 241
238 229
238 237
238 236
238 239
237 238
237 229
237 230
237 231
237 234
237 236
237 238
230 231
230 237
230 229
230 228
230 194
230 232
230 231
232 231
232 230
232 194
232 193
232 231
190 195
190 196
190 189
190 188
190 191
190 192
190 193
190 195
191 17
191 192
191 190
191 188
191 16
188 189
188 186
188 16
188 191
188 190
188 189
186 189
186 181
186 187
186 16
186 188
186 189
468 469
468 466
468 467
468 84
468 85
468 128
468 469
37 38
37 35
37 36
37 39
37 42
37 496
37 38
36 39
36 37
36 35
36 39
491 490
491 343
491 493
491 492
491 494
491 495
343 493
343 491
343 490
343 489
343 342
343 341
343 493
342 343
342 489
342 344
342 337
342 339
342 340
342 341
342 343
244 350
244 348
244 243
244 241
244 239
244 240
244 351
240 236
240 25
240 351
240 244
240 239
240 236
239 236
239 240
239 244
239 241
239 238
239 236
194 228
194 199
194 195
194 193
194 232
194 230
194 228
195 190
195 193
195 194
195 199
195 196
195 190
189 186
189 188
189 190
189 196
189 185
189 181
189 186
181 186
181 189
181 185
181 183
181 182
181 14
181 187
181 186
14 181
14 182
14 13
14 15
14 187
14 181
462 463
462 472
462 473
462 461
462 464
462 465
462 463
461 464
461 462
461 473
461 457
461 460
461 80
461 464
490 495
490 486
490 489
490 343
490 491
489 344
489 342
489 343
489 490
489 486
489 487
489 344
337 339
337 342
337 344
337 332
337 330
337 345
337 338
337 339
345 338
345 337
345 330
345 346
345 348
345 350
345 338
243 242
243 241
243 244
243 348
243 352
243 245
243 242
241 242
241 229
241 238
241 239
241 244
241 243
241 242
229 238
229 241
229 242
229 249
229 228
229 230
229 237
229 238
228 230
228 229
228 249
228 227
228 199
228 194
228 230
199 228
199 227
199 198
199 197
199 196
199 195
199 194
199 228
197 196
197 199
197 198
197 200
197 201
197 185
197 196
196 195
196 199
196 197
196 185
196 189
196 190
196 195
185 184
185 183
185 181
185 189
185 196
185 197
185 201
185 184
184 185
184 201
184 203
184 179
184 183
183 184
183 179
183 182
183 181
183 185
183 184
353 352
353 356
353 355
353 354
353 245
353 352
473 457
473 461
473 462
473 472
473 475
473 474
473 456
473 457
459 79
459 460
459 457
459 458
459 78
459 79
39 37
39 36
39 42
39 37
38 34
38 35
38 37
38 496
38 494
38 492
38 34
346 347
346 349
346 348
346 345
346 330
346 329
346 347
348 349
348 352
348 243
348 244
348 350
348 345
348 346
348 349
242 241
242 243
242 245
242 248
242 249
242 229
242 241
249 229
249 242
249 248
249 250
249 227
249 228
249 229
227 228
227 249
227 250
227 225
227 226
227 198
227 199
227 228
198 197
198 199
198 227
198 226
198 206
198 200
198 197
201 197
201 200
201 204
201 202
201 203
201 184
201 185
201 197
182 183
182 179
182 533
182 12
182 13
182 14
182 181
182 183
12 13
12 182
12 533
12 11
12 13
13 14
13 182
13 12
245 352
245 353
245 354
245 246
245 247
245 248
245 242
245 243
245 352
304 305
304 418
304 417
304 303
304 299
304 305
451 450
451 452
451 453
451 449
451 450
444 445
444 446
444 75
444 448
444 443
444 445
248 247
248 250
248 249
248 242
248 245
248 247
250 249
250 248
250 247
250 252
250 225
250 227
250 249
226 198
226 227
226 225
226 224
226 206
206 226
206 224
206 222
206 205
206 204
206 200
206 198
200 197
200 198
200 206
200 204
200 201
200 197
203 202
203 177
203 179
203 184
203 201
203 202
179 184
179 203
179 177
179 532
179 533
179 182
179 183
179 184
11 533
11 519
11 12
11 533
416 414
416 413
416 412
416 420
416 417
416 415
416 414
514 515
514 517
514 166
514 164
514 531
514 513
514 515
445 444
445 443
445 431
445 430
445 429
445 446
445 444
388 51
388 382
388 383
388 384
388 387
388 390
388 389
388 51
420 417
420 416
420 412
420 411
420 427
420 422
420 421
420 417
496 497
496 485
496 494
496 38
496 37
496 42
496 41
496 498
496 497
246 259
246 258
246 253
246 247
246 245
246 354
246 259
247 248
247 245
247 246
247 253
247 252
247 250
247 248
225 224
225 226
225 227
225 250
225 252
225 251
225 224
224 206
224 226
224 225
224 251
224 222
224 206
204 200
204 206
204 205
204 207
204 176
204 202
204 201
204 200
202 203
202 201
202 204
202 176
202 177
202 203
177 179
177 203
177 202
177 176
177 178
177 532
177 179
533 179
533 532
533 519
533 11
533 12
533 182
533 179
518 517
518 515
518 516
518 519
518 532
518 517
519 11
519 533
519 532
519 518
519 516
519 11
417 420
417 421
417 303
417 304
417 418
417 415
417 416
417 420
415 414
415 416
415 417
415 418
415 313
415 414
513 516
513 515
513 514
513 531
513 512
46 44
46 521
46 498
46 47
442 481
442 441
442 443
442 448
442 449
442 481
51 389
51 52
51 50
51 399
51 382
51 388
51 389
498 497
498 496
498 41
498 47
498 46
498 521
498 497
41 42
41 40
41 47
41 498
41 496
41 42
521 520
521 485
521 497
521 498
521 46
521 44
521 45
521 389
521 520
484 483
484 487
484 486
484 485
484 520
484 483
483 484
483 520
483 392
483 397
483 488
483 487
483 484
354 327
354 325
354 259
354 246
354 245
354 353
354 355
354 327
253 247
253 246
253 258
253 257
253 254
253 252
253 247
252 254
252 251
252 225
252 250
252 247
252 253
252 254
222 221
222 223
222 205
222 206
222 224
222 251
222 221
205 204
205 206
205 222
205 223
205 207
205 204
532 533
532 179
532 177
532 178
532 517
532 518
532 519
532 533
517 518
517 532
517 178
517 166
517 514
517 515
517 518
45 389
45 521
45 44
45 52
45 389
44 46
44 52
44 45
44 521
44 46
50 51
50 49
50 399
50 51
47 46
47 498
47 41
47 40
47 46
327 328
327 336
327 326
327 325
327 354
327 355
327 328
251 224
251 225
251 252
251 254
251 255
251 221
251 222
251 224
303 417
303 421
303 423
303 302
303 299
303 304
303 417
389 520
389 521
389 45
389 52
389 51
389 388
389 390
389 520
334 333
334 397
334 395
334 396
334 335
334 336
334 328
334 329
334 331
326 327
326 336
326 506
326 505
326 325
326 327
325 259
325 354
325 327
325 326
325 505
325 323
325 260
325 259
223 207
223 205
223 222
223 221
223 220
223 207
73 74
73 75
73 72
73 74
393 397
393 392
393 391
393 386
393 394
393 395
393 397
396 395
396 394
396 366
396 359
396 335
396 334
396 395
395 397
395 393
395 394
395 396
395 334
391 387
391 386
391 393
391 392
391 520
391 390
391 387
390 389
390 388
390 387
390 391
390 520
390 389
336 506
336 326
336 327
336 328
336 334
336 335
336 359
336 358
336 506
259 246
259 354
259 325
259 260
259 258
259 246
255 251
255 254
255 256
255 268
255 221
255 251
170 169
170 168
170 175
170 174
170 173
170 172
170 171
170 169
168 169
168 163
168 167
168 175
168 170
168 169
164 163
164 165
164 530
164 531
164 514
164 166
164 167
164 163
335 396
335 359
335 336
335 334
299 305
299 304
299 303
299 302
299 301
299 300
299 297
299 305
323 505
323 322
323 263
323 260
323 325
323 505
256 267
256 268
256 255
256 254
256 257
256 267
173 220
173 215
173 172
173 170
173 174
173 207
173 220
169 170
169 171
169 158
169 160
169 163
169 168
169 170
163 164
163 167
163 168
163 169
163 160
163 162
163 165
163 164
511 531
511 530
511 101
511 510
511 512
511 531
512 511
512 513
512 531
512 511
463 462
463 465
463 466
463 137
463 138
463 472
463 462
358 359
358 366
358 365
358 360
358 357
358 506
358 336
358 359
505 325
505 326
505 506
505 357
505 322
505 323
505 325
268 221
268 255
268 256
268 267
268 269
268 276
268 221
221 222
221 251
221 255
221 268
221 276
221 219
221 220
221 223
221 222
220 173
220 207
220 223
220 221
220 219
220 215
220 173
215 173
215 220
215 219
215 216
215 214
215 172
215 173
172 173
172 215
172 214
172 212
172 157
172 171
172 170
172 173
162 165
162 163
162 160
162 161
162 102
162 165
165 164
165 163
165 162
165 102
165 530
165 164
510 511
510 101
510 509
510 511
302 299
302 303
302 423
302 432
302 301
302 299
207 205
207 223
207 220
207 173
207 174
207 175
207 176
207 204
207 205
52 51
52 389
52 45
52 44
367 368
367 369
367 364
367 366
367 394
367 386
367 368
506 357
506 505
506 326
506 336
506 358
506 357
262 265
262 266
262 257
262 261
262 263
262 523
262 265
266 267
266 257
266 262
266 265
266 271
266 272
266 269
266 267
276 275
276 218
276 219
276 221
276 268
276 269
276 275
219 216
219 215
219 220
219 221
219 276
219 218
219 216
214 216
214 213
214 212
214 172
214 215
214 216
161 159
161 103
161 102
161 162
161 160
161 159
102 165
102 162
102 161
102 103
102 104
102 101
102 530
385 386
385 387
385 384
385 369
385 368
385 386
366 365
366 358
366 359
366 396
366 394
366 367
366 364
366 365
360 357
360 358
360 365
360 362
360 361
360 357
357 358
357 360
357 361
357 321
357 322
357 505
357 506
357 358
322 320
322 263
322 323
322 505
322 357
322 321
322 320
267 257
267 266
267 269
267 268
267 256
267 257
269 268
269 267
269 266
269 272
269 275
269 276
269 268
216 215
216 219
216 218
216 217
216 213
216 214
216 215
157 172
157 212
157 156
157 155
157 159
157 158
157 171
157 172
160 169
160 158
160 159
160 161
160 162
160 163
160 169
301 300
301 299
301 302
301 432
301 433
301 434
301 300
167 164
167 166
167 178
167 175
167 168
167 163
167 164
530 102
530 101
530 511
530 531
530 164
530 165
530 102
384 385
384 387
384 388
384 383
384 380
384 369
384 385
368 369
368 367
368 386
368 385
368 369
369 385
369 384
369 380
369 370
369 364
369 367
369 368
364 365
364 366
364 367
364 369
364 370
364 371
364 363
364 362
364 365
365 366
365 364
365 362
365 360
365 358
365 366
321 322
321 357
321 361
321 319
321 320
321 322
320 322
320 321
320 319
320 317
320 504
320 523
320 263
320 322
265 262
265 523
265 271
265 266
265 262
275 274
275 218
275 276
275 269
275 272
275 274
159 161
159 160
159 158
159 157
159 155
159 153
159 103
159 161
105 104
105 106
105 98
105 99
105 509
105 101
105 104
531 511
531 512
531 513
531 514
531 164
531 530
531 511
382 399
382 398
382 379
382 383
382 388
382 51
382 399
383 388
383 382
383 379
383 380
383 384
383 388
523 265
523 262
523 263
523 320
523 504
523 308
523 270
523 271
523 265
274 275
274 272
274 273
274 277
274 279
274 280
274 218
274 275
218 274
218 280
218 217
218 216
218 219
218 276
218 275
217 216
217 218
217 280
217 210
217 213
217 216
213 210
213 211
213 212
213 214
213 216
213 217
212 157
212 172
212 214
212 213
212 211
212 156
212 157
153 159
153 155
153 154
153 152
153 103
153 159
152 107
152 106
152 103
152 153
152 154
152 151
152 107
103 159
103 153
103 152
103 106
103 104
103 102
103 161
103 159
106 105
106 104
106 103
106 152
106 107
106 98
106 105
99 509
99 105
99 98
99 97
49 48
49 398
49 399
49 50
399 50
399 49
399 398
399 382
399 51
399 50
380 379
380 378
380 377
380 370
380 369
380 384
380 383
380 379
319 318
319 316
319 317
319 320
319 321
319 361
319 318
271 265
271 523
271 270
271 273
271 272
271 266
271 265
272 269
272 266
272 271
272 273
272 274
272 275
273 270
273 277
273 274
273 272
273 271
273 270
210 217
210 280
210 281
210 209
210 211
210 213
156 157
156 212
156 211
156 208
156 147
156 149
156 155
156 157
155 156
155 149
155 154
155 153
155 159
155 157
155 156
154 155
154 149
154 150
154 151
154 152
154 153
107 106
107 152
107 151
107 110
107 108
107 98
107 106
98 108
98 97
98 99
98 105
98 106
98 107
98 108
97 96
97 95
97 99
97 98
97 108
97 96
398 399
398 49
398 48
398 401
398 379
398 382
398 399
48 401
48 398
48 49
48 54
48 401
379 383
379 382
379 398
379 401
379 402
379 378
379 380
379 383
363 371
363 372
363 315
363 318
363 362
363 364
363 371
318 361
318 362
318 363
318 315
318 312
318 316
318 319
317 319
317 316
317 503
317 504
317 320
317 319
504 320
504 317
504 503
504 308
504 523
504 320
280 218
280 274
280 279
280 281
280 210
280 217
280 218
211 213
211 210
211 209
211 208
211 156
211 212
211 213
149 155
149 156
149 147
149 148
149 150
149 154
149 155
150 154
150 149
150 148
150 535
150 131
150 122
150 151
150 154
151 150
151 122
151 110
151 107
151 152
151 154
151 150
110 109
110 108
110 107
110 151
110 122
110 121
110 109
108 107
108 110
108 109
108 96
108 97
108 98
108 107
96 97
96 108
96 109
96 94
96 95
96 97
436 291
436 294
436 435
436 440
436 439
436 438
436 437
436 291
166 517
166 178
166 167
166 164
166 514
166 517
437 479
437 290
437 291
437 436
437 438
437 479
370 369
370 380
370 377
370 376
370 371
370 364
370 369
377 378
377 375
377 376
377 370
377 380
377 378
376 371
376 370
376 377
376 375
376 374
376 373
376 372
376 371
371 370
371 376
371 372
371 363
371 364
371 370
315 318
315 363
315 372
315 314
315 313
315 312
316 317
316 319
316 318
316 312
316 306
316 503
316 317
308 523
308 504
308 503
308 298
308 309
308 270
308 523
270 277
270 273
270 271
270 523
270 308
270 309
270 311
270 277
277 274
277 273
277 270
277 311
277 278
277 279
277 274
281 209
281 210
281 280
281 279
281 283
281 282
281 209
209 210
209 281
209 282
209 208
209 211
209 210
208 147
208 156
208 211
208 209
208 282
208 286
208 143
208 146
208 147
147 208
147 146
147 148
147 149
147 156
147 208
109 110
109 121
109 111
109 94
109 96
109 108
109 110
94 96
94 109
94 111
94 93
94 95
94 96
479 437
479 438
479 478
479 477
479 476
479 289
479 290
479 437
290 437
290 479
290 289
290 287
290 291
290 437
515 514
515 513
515 516
515 518
515 517
515 514
378 379
378 402
378 404
378 375
378 377
378 380
378 379
372 371
372 376
372 373
372 314
372 315
372 363
372 371
311 270
311 309
311 310
311 278
311 277
311 270
278 279
278 277
278 311
278 310
278 293
278 283
278 279
283 293
283 292
283 284
283 282
283 281
283 279
283 278
283 293
279 277
279 278
279 283
279 281
279 280
279 274
279 277
148 149
148 147
148 146
148 534
148 535
148 150
148 149
122 150
122 131
122 123
122 121
122 110
122 151
122 150
121 109
121 110
121 122
121 123
121 120
121 111
121 109
289 479
289 476
289 288
289 287
289 290
289 479
476 479
476 477
476 474
476 475
476 140
476 288
476 289
476 479
401 53
401 56
401 403
401 402
401 379
401 398
401 48
401 54
401 53
53 401
53 54
53 56
53 401
403 56
403 405
403 402
403 401
403 56
314 372
314 373
314 414
314 313
314 315
314 372
312 315
312 313
312 306
312 316
312 318
306 305
306 297
306 298
306 503
306 316
306 312
306 313
306 418
306 305
309 270
309 308
309 298
309 296
309 310
309 311
309 270
282 209
282 281
282 283
282 284
282 286
282 208
282 209
123 122
123 131
123 124
123 120
123 121
123 122
111 112
111 93
111 94
111 109
111 121
111 120
111 112
93 92
93 94
93 111
93 112
93 92
139 472
139 138
139 136
139 141
139 140
139 475
139 472
141 142
141 140
141 139
141 136
141 507
141 508
141 145
141 142
359 358
359 336
359 335
359 396
359 366
359 358
56 58
56 405
56 403
56 401
56 53
56 55
56 57
56 58
373 372
373 376
373 374
373 414
373 314
373 372
313 315
313 314
313 414
313 415
313 418
313 306
313 312
313 315
503 504
503 317
503 316
503 306
503 298
503 308
503 504
298 296
298 309
298 308
298 503
298 306
298 297
298 296
310 309
310 296
310 295
310 293
310 278
310 311
310 309
286 285
286 143
286 208
286 282
286 284
286 285
145 143
145 142
145 141
145 508
145 534
145 146
145 143
130 125
130 124
130 131
130 535
130 508
130 507
130 135
130 125
131 535
131 130
131 124
131 123
131 122
131 150
131 535
124 125
124 118
124 119
124 120
124 123
124 131
124 130
124 125
120 123
120 124
120 119
120 112
120 111
120 121
120 123
112 111
112 120
112 119
112 113
112 92
112 93
112 111
55 56
55 57
55 56
405 404
405 402
405 403
405 56
405 58
405 406
405 404
374 413
374 414
374 373
374 376
374 375
374 406
374 413
414 415
414 313
414 314
414 373
414 374
414 413
414 416
414 415
418 415
418 417
418 304
418 305
418 306
418 313
418 415
297 299
297 300
297 296
297 298
297 306
297 305
297 299
284 292
284 287
284 285
284 286
284 282
284 283
284 292
285 286
285 284
285 287
285 288
285 142
285 143
285 286
142 145
142 143
142 285
142 288
142 140
142 141
143 146
143 208
143 286
143 285
143 142
143 145
143 146
508 141
508 507
508 130
508 535
508 534
508 145
508 141
125 130
125 135
125 134
125 126
125 118
125 124
125 130
119 124
119 118
119 114
119 113
119 112
119 120
119 124
42 41
42 496
42 37
42 39
42 41
475 472
475 139
475 140
475 476
475 474
475 473
475 472
394 396
394 395
394 393
394 386
394 367
394 366
394 396
57 58
57 56
57 55
57 61
57 58
58 56
58 57
58 61
58 407
58 406
58 405
58 56
406 58
406 407
406 542
406 413
406 374
406 375
406 404
406 405
406 58
413 414
413 374
413 406
413 542
413 412
413 416
413 414
305 306
305 418
305 304
305 299
305 297
305 306
293 283
293 278
293 310
293 295
293 294
293 292
293 283
292 284
292 283
292 293
292 294
292 291
292 287
292 284
288 287
288 289
288 476
288 140
288 142
288 285
288 287
507 135
507 130
507 508
507 141
507 136
507 135
92 93
92 112
92 113
92 91
92 528
92 529
92 93
137 127
137 126
137 134
137 136
137 138
137 463
137 466
137 469
137 127
407 406
407 58
407 61
407 542
407 406
61 58
61 57
61 60
61 543
61 542
61 407
61 58
296 298
296 297
296 300
296 434
296 295
296 310
296 309
296 298
295 296
295 434
295 435
295 294
295 293
295 310
295 296
294 295
294 435
294 436
294 291
294 292
294 293
294 295
291 294
291 436
291 437
291 290
291 287
291 292
291 294
140 142
140 288
140 476
140 475
140 139
140 141
140 142
113 112
113 119
113 114
113 91
113 92
113 112
528 91
528 526
528 527
528 529
528 92
528 91
386 385
386 368
386 367
386 394
386 393
386 391
386 387
386 385
60 59
60 410
60 543
60 61
300 297
300 299
300 301
300 434
300 296
300 297
434 296
434 300
434 301
434 433
434 441
434 440
434 435
434 295
434 296
435 434
435 440
435 436
435 294
435 295
435 434
287 288
287 285
287 284
287 292
287 291
287 290
287 289
287 288
127 137
127 469
127 128
127 470
127 126
127 137
387 391
387 390
387 388
387 384
387 385
387 386
387 391
412 416
412 413
412 542
412 411
412 420
412 416
59 410
59 60
59 62
59 428
59 410
422 420
422 427
422 426
422 425
422 424
422 421
422 420
432 301
432 302
432 423
432 431
432 433
432 301
440 441
440 439
440 436
440 435
440 434
440 441
477 476
477 479
477 478
477 455
477 456
477 474
477 476
138 139
138 472
138 463
138 137
138 136
138 139
471 118
471 470
471 128
471 129
471 115
471 118
426 427
426 64
426 65
426 425
426 422
424 425
424 430
424 431
424 423
424 421
424 422
424 425
431 433
431 432
431 423
431 424
431 430
431 445
431 443
431 433
438 437
438 436
438 439
438 481
438 480
438 478
438 479
438 437
478 455
478 477
478 479
478 438
478 480
478 455
474 473
474 475
474 476
474 477
474 456
474 473
128 470
128 127
128 469
128 468
128 85
128 129
128 471
128 470
129 115
129 471
129 128
129 85
129 116
129 115
526 117
526 524
526 527
526 528
526 91
526 117
527 528
527 526
527 524
527 525
62 63
62 427
62 428
62 59
62 63
430 445
430 431
430 424
430 425
430 429
430 445
441 440
441 434
441 433
441 443
441 442
441 481
441 439
441 440
456 474
456 477
456 455
456 454
456 457
456 473
456 474
472 475
472 473
472 462
472 463
472 138
472 139
469 128
469 127
469 137
469 466
469 468
469 128
524 86
524 525
524 527
524 526
524 117
524 116
524 85
524 86
525 527
525 524
525 86
480 478
480 438
480 481
480 449
480 454
480 455
480 478
449 451
449 453
449 454
449 480
449 481
449 442
449 448
449 450
449 451
454 456
454 455
454 480
454 449
454 453
454 458
454 457
454 456
457 461
457 473
457 456
457 454
457 458
457 459
457 460
457 461
466 467
466 468
466 469
466 137
466 463
466 465
466 467
481 442
481 449
481 480
481 438
481 439
481 441
481 442
116 115
116 129
116 85
116 524
116 117
116 114
116 115
67 66
67 447
67 429
67 65
67 64
67 66
446 75
446 444
446 445
446 429
446 447
446 72
446 75
75 448
75 444
75 446
75 72
75 73
75 74
75 450
75 448
448 75
448 450
448 449
448 442
448 443
448 444
448 75
95 94
95 97
95 96
95 94
497 498
497 521
497 485
497 496
497 498
146 147
146 208
146 143
146 145
146 534
146 148
146 147
175 176
175 207
175 174
175 170
175 168
175 167
175 178
175 176
174 207
174 173
174 170
174 175
174 207
485 497
485 521
485 520
485 484
485 486
485 495
485 494
485 496
485 497
443 433
443 431
443 445
443 444
443 448
443 442
443 441
443 433
429 430
429 425
429 65
429 67
429 447
429 446
429 445
429 430
64 65
64 426
64 427
64 63
64 67
64 65
455 456
455 477
455 478
455 480
455 454
455 456
65 64
65 67
65 429
65 425
65 426
65 64
425 424
425 422
425 426
425 65
425 429
425 430
425 424
63 427
63 62
63 64
63 427
427 422
427 420
427 411
427 428
427 62
427 63
427 64
427 426
427 422
439 436
439 440
439 441
439 481
439 438
439 436
254 252
254 253
254 257
254 256
254 255
254 251
254 252
428 427
428 411
428 410
428 59
428 62
428 427
433 431
433 443
433 441
433 434
433 301
433 432
433 431
423 421
423 424
423 431
423 432
423 302
423 303
423 421
421 422
421 424
421 423
421 303
421 417
421 420
421 422
411 412
411 542
411 543
411 410
411 428
411 427
411 420
411 412
509 510
509 101
509 105
509 99
509 510
333 397
333 334
333 331
333 332
333 488
333 397
178 177
178 176
178 175
178 167
178 166
178 517
178 532
178 177
529 92
529 528
176 204
176 207
176 175
176 178
176 177
176 202
176 204
534 146
534 145
534 508
534 535
534 148
534 146
375 406
375 374
375 376
375 377
375 378
375 404
375 406
404 406
404 375
404 378
404 402
404 405
402 379
402 401
402 403
402 405
402 404
402 378
402 379
535 534
535 508
535 130
535 131
535 150
535 148
535 534
54 53
54 401
54 48
328 329
328 334
328 336
328 327
328 355
328 356
328 329
361 357
361 360
361 362
361 318
361 319
361 321
361 357
362 364
362 363
362 318
362 361
362 360
362 365
362 364
101 511
101 530
101 102
101 104
101 105
101 509
101 510
101 511
104 102
104 103
104 106
104 105
104 101
104 102
158 169
158 171
158 157
158 159
158 160
158 169
171 172
171 157
171 158
171 169
171 170
171 172
263 260
263 323
263 322
263 320
263 523
263 262
263 261
263 260
40 47
40 41
355 328
355 327
355 354
355 353
355 356
355 328
516 519
516 518
516 515
516 513
516 519
187 186
187 181
187 14
187 15
187 16
187 186
16 17
16 191
16 188
16 186
16 187
16 15
536 537
536 27
536 350
536 351
536 25
536 537
