ply
format ascii 1.0
comment truncated icosahedron
element vertex 60
property float x
property float y
property float z
element face 32
property list uchar uint vertex_index
property uchar intensity
element edge 90
property uint source
property uint target
element volume 1
property list uchar int face_index
end_header
0.29534 0.821216 0
0.091265 0.821216 0.280885
-0.238935 0.821216 0.173596
-0.238935 0.821216 -0.173596
0.0912651 0.821216 -0.280885
0.59068 0.642432 0
0.681945 0.463648 0.280885
0.829615 0.154549 0.173596
0.681945 0.463648 -0.280885
0.829615 0.154549 -0.173596
0.77321 -0.154549 0.347193
0.569135 -0.154549 0.628078
0.386605 -0.463648 0.628078
0.47787 -0.642432 0.347193
0.238935 -0.821216 0.173596
-0.0912651 -0.821216 0.280885
-0.29534 -0.821216 -2.06555e-08
-0.091265 -0.821216 -0.280885
0.238935 -0.821216 -0.173596
0.716805 -0.463648 0.173596
0.47787 0.463648 0.56177
0.421465 0.154549 0.735366
0.18253 0.642432 0.56177
-0.0564049 0.463648 0.735366
0.091265 0.154549 0.842655
0.0564049 -0.463648 0.735366
-0.0912651 -0.154549 0.842655
-0.421465 -0.154549 0.735366
-0.47787 -0.463648 0.56177
-0.18253 -0.642432 0.56177
-0.386605 0.463648 0.628078
-0.569135 0.154549 0.628078
-0.47787 0.642432 0.347193
-0.716805 0.463648 0.173596
-0.77321 0.154549 0.347193
-0.681945 -0.463648 0.280885
-0.829615 -0.154549 0.173596
-0.829615 -0.154549 -0.173597
-0.681945 -0.463648 -0.280885
-0.59068 -0.642432 -4.13111e-08
-0.716805 0.463648 -0.173597
-0.77321 0.154549 -0.347193
-0.47787 0.642432 -0.347193
-0.386605 0.463648 -0.628078
-0.569135 0.154549 -0.628078
-0.47787 -0.463648 -0.56177
-0.421465 -0.154549 -0.735366
-0.091265 -0.154549 -0.842655
0.056405 -0.463648 -0.735366
-0.18253 -0.642432 -0.56177
-0.0564048 0.463648 -0.735366
0.0912652 0.154549 -0.842655
0.18253 0.642432 -0.56177
0.47787 0.463648 -0.56177
0.421465 0.154549 -0.735366
0.386605 -0.463648 -0.628078
0.569135 -0.154549 -0.628078
0.77321 -0.154549 -0.347193
0.716805 -0.463648 -0.173596
0.47787 -0.642432 -0.347193
6 0 5 6 20 22 1 0
5 0 1 2 3 4 255
6 0 5 8 53 52 4 0
6 1 22 23 30 32 2 0
6 2 32 33 40 42 3 0
6 3 42 43 50 52 4 0
6 12 25 29 15 14 13 0
5 14 15 16 17 18 255
6 13 19 58 59 18 14 0
6 15 29 28 35 39 16 0
6 16 39 38 45 49 17 0
6 17 49 48 55 59 18 0
5 5 6 7 9 8 255
6 6 20 21 11 10 7 0
6 7 10 19 58 57 9 0
6 8 53 54 56 57 9 0
5 10 11 12 13 19 255
6 11 21 24 26 25 12 0
5 20 22 23 24 21 255
6 23 30 31 27 26 24 0
5 25 26 27 28 29 255
6 27 31 34 36 35 28 0
5 30 32 33 34 31 255
6 33 40 41 37 36 34 0
5 35 36 37 38 39 255
6 37 41 44 46 45 38 0
5 40 42 43 44 41 255
6 43 50 51 47 46 44 0
5 45 46 47 48 49 255
6 47 51 54 56 55 48 0
5 50 52 53 54 51 255
5 55 56 57 58 59 255
1 0
2 1
3 2
4 3
4 0
15 14
16 15
17 16
18 17
18 14
5 0
6 5
7 6
8 5
9 8
9 7
10 7
11 10
12 11
13 12
13 14
19 10
19 13
20 6
21 20
21 11
22 20
22 1
23 22
24 21
24 23
25 12
26 25
26 24
27 26
28 27
29 25
29 15
29 28
30 23
31 30
31 27
32 30
32 2
33 32
34 31
34 33
35 28
36 35
36 34
37 36
38 37
39 35
39 16
39 38
40 33
41 40
41 37
42 40
42 3
43 42
44 41
44 43
45 38
46 45
46 44
47 46
48 47
49 45
49 17
49 48
50 43
51 50
51 47
52 50
52 4
53 52
53 8
54 51
54 53
55 48
56 55
56 54
57 56
57 9
58 57
58 19
59 55
59 18
59 58
32 +1 +2 -3 +4 +5 +6 -7 -8 +9 -10 -11 -12 -13 -14 -15 +16 -17 -18 -19 -20 -21 -22 -23 -24 -25 -26 -27 -28 -29 -30 -31 -32
