<?xml version="1.0" encoding="UTF-8" standalone="no"?>
<!-- Created with Inkscape (http://www.inkscape.org/) -->

<svg
   width="142.81677mm"
   height="77.879105mm"
   viewBox="0 0 142.81677 77.879105"
   version="1.1"
   id="svg5"
   sodipodi:docname="membrane_property.svg"
   inkscape:version="1.1.1 (3bf5ae0d25, 2021-09-20)"
   inkscape:export-filename="/home/joern/develop/morpheus.gitlab/doc/images/membrane_property.png"
   inkscape:export-xdpi="149.92412"
   inkscape:export-ydpi="149.92412"
   xmlns:inkscape="http://www.inkscape.org/namespaces/inkscape"
   xmlns:sodipodi="http://sodipodi.sourceforge.net/DTD/sodipodi-0.dtd"
   xmlns:xlink="http://www.w3.org/1999/xlink"
   xmlns="http://www.w3.org/2000/svg"
   xmlns:svg="http://www.w3.org/2000/svg">
  <sodipodi:namedview
     id="namedview7"
     pagecolor="#ffffff"
     bordercolor="#666666"
     borderopacity="1.0"
     inkscape:pageshadow="2"
     inkscape:pageopacity="0.0"
     inkscape:pagecheckerboard="0"
     inkscape:document-units="mm"
     showgrid="false"
     inkscape:zoom="0.90583672"
     inkscape:cx="-23.734962"
     inkscape:cy="369.82382"
     inkscape:window-width="1920"
     inkscape:window-height="1133"
     inkscape:window-x="0"
     inkscape:window-y="0"
     inkscape:window-maximized="1"
     inkscape:current-layer="layer1"
     fit-margin-left="1"
     fit-margin-top="1"
     fit-margin-right="1"
     fit-margin-bottom="1" />
  <defs
     id="defs2">
    <marker
       style="overflow:visible;"
       id="Arrow2Mend"
       refX="0.0"
       refY="0.0"
       orient="auto"
       inkscape:stockid="Arrow2Mend"
       inkscape:isstock="true">
      <path
         transform="scale(0.6) rotate(180) translate(0,0)"
         d="M 8.7185878,4.0337352 L -2.2072895,0.016013256 L 8.7185884,-4.0017078 C 6.9730900,-1.6296469 6.9831476,1.6157441 8.7185878,4.0337352 z "
         style="stroke:context-stroke;fill-rule:evenodd;fill:context-stroke;stroke-width:0.62500000;stroke-linejoin:round;"
         id="path133920" />
    </marker>
    <marker
       style="overflow:visible;"
       id="Arrow2Lend"
       refX="0.0"
       refY="0.0"
       orient="auto"
       inkscape:stockid="Arrow2Lend"
       inkscape:isstock="true">
      <path
         transform="scale(1.1) rotate(180) translate(1,0)"
         d="M 8.7185878,4.0337352 L -2.2072895,0.016013256 L 8.7185884,-4.0017078 C 6.9730900,-1.6296469 6.9831476,1.6157441 8.7185878,4.0337352 z "
         style="stroke:context-stroke;fill-rule:evenodd;fill:context-stroke;stroke-width:0.62500000;stroke-linejoin:round;"
         id="path133914" />
    </marker>
    <marker
       style="overflow:visible;"
       id="Arrow1Mend"
       refX="0.0"
       refY="0.0"
       orient="auto"
       inkscape:stockid="Arrow1Mend"
       inkscape:isstock="true">
      <path
         transform="scale(0.4) rotate(180) translate(10,0)"
         style="fill-rule:evenodd;fill:context-stroke;stroke:context-stroke;stroke-width:1.0pt;"
         d="M 0.0,0.0 L 5.0,-5.0 L -12.5,0.0 L 5.0,5.0 L 0.0,0.0 z "
         id="path133902" />
    </marker>
    <marker
       style="overflow:visible"
       id="Arrow1Lstart"
       refX="0.0"
       refY="0.0"
       orient="auto"
       inkscape:stockid="Arrow1Lstart"
       inkscape:isstock="true">
      <path
         transform="scale(0.8) translate(12.5,0)"
         style="fill-rule:evenodd;fill:context-stroke;stroke:context-stroke;stroke-width:1.0pt"
         d="M 0.0,0.0 L 5.0,-5.0 L -12.5,0.0 L 5.0,5.0 L 0.0,0.0 z "
         id="path133893" />
    </marker>
    <linearGradient
       inkscape:collect="always"
       id="1709">
      <stop
         style="stop-color:#c25000;stop-opacity:1"
         offset="0"
         id="stop1705" />
      <stop
         style="stop-color:#030c97;stop-opacity:0.72549021"
         offset="1"
         id="stop1707" />
    </linearGradient>
    <linearGradient
       inkscape:collect="always"
       xlink:href="#1709"
       id="linearGradient1713"
       x1="72.316444"
       y1="126.28699"
       x2="89.154266"
       y2="103.82049"
       gradientUnits="userSpaceOnUse" />
  </defs>
  <g
     inkscape:label="Ebene 1"
     inkscape:groupmode="layer"
     id="layer1"
     transform="translate(-45.017788,-72.055095)">
    <path
       style="fill:none;fill-rule:evenodd;stroke:#000000;stroke-width:0.465;stroke-linecap:butt;stroke-linejoin:miter;stroke-miterlimit:4;stroke-dasharray:none;stroke-opacity:1"
       d="m 50.865851,116.09242 c 2.947034,-6.42313 -6.870628,-13.2686 16.385191,-27.273222 21.385692,-12.878435 54.022598,-6.94758 49.505768,6.293178 -4.51684,13.240764 -18.469396,16.053564 -11.81267,32.227574 6.65673,16.17402 -14.527539,26.98412 -25.395357,16.51131 -10.867816,-10.47282 -28.966081,0.40743 -31.885411,-7.43564 -3.508495,-9.42592 0.255446,-13.90006 3.202479,-20.3232 z"
       id="path177"
       sodipodi:nodetypes="zsssssz" />
    <circle
       style="fill:none;fill-opacity:1;stroke:url(#linearGradient1713);stroke-width:0.874621;stroke-miterlimit:4;stroke-dasharray:3.49848, 0.874621;stroke-dashoffset:0;stroke-opacity:1"
       id="path794"
       cx="80.316147"
       cy="115.00392"
       r="14.56269" />
    <path
       style="fill:none;fill-rule:evenodd;stroke:#666666;stroke-width:0.264583px;stroke-linecap:butt;stroke-linejoin:miter;stroke-opacity:1"
       d="M 58.086288,95.514677 80.389851,114.59411 93.341816,81.723586"
       id="path2855" />
    <path
       style="fill:none;fill-rule:evenodd;stroke:#666666;stroke-width:0.264583px;stroke-linecap:butt;stroke-linejoin:miter;stroke-opacity:1"
       d="m 80.389851,114.59411 -33.861039,18.05064 v 0 0 0"
       id="path2857" />
    <path
       style="fill:none;fill-rule:evenodd;stroke:#666666;stroke-width:0.264583px;stroke-linecap:butt;stroke-linejoin:miter;stroke-opacity:1"
       d="m 80.389851,114.59411 2.799482,31.79219 v 0"
       id="path2859" />
    <path
       style="fill:none;fill-rule:evenodd;stroke:#666666;stroke-width:0.264583px;stroke-linecap:butt;stroke-linejoin:miter;stroke-opacity:1"
       d="m 80.389851,114.59411 23.471549,0.2189"
       id="path2894" />
    <path
       style="fill:none;fill-rule:evenodd;stroke:#666666;stroke-width:0.264583px;stroke-linecap:butt;stroke-linejoin:miter;stroke-opacity:1"
       d="M 80.389851,114.59411 116.64219,90.341655"
       id="path2929" />
    <path
       style="fill:none;fill-rule:evenodd;stroke:#666666;stroke-width:0.264583px;stroke-linecap:butt;stroke-linejoin:miter;stroke-opacity:1"
       d="m 51.282861,111.41295 29.10699,3.18116 -7.345333,-28.839746"
       id="path2931" />
    <path
       style="fill:none;fill-rule:evenodd;stroke:#666666;stroke-width:0.264583px;stroke-linecap:butt;stroke-linejoin:miter;stroke-opacity:1"
       d="M 80.389851,114.59411 102.8398,142.22718"
       id="path2966" />
    <path
       style="fill:none;fill-rule:evenodd;stroke:#666666;stroke-width:0.264583px;stroke-linecap:butt;stroke-linejoin:miter;stroke-opacity:1"
       d="M 80.389851,114.59411 67.345358,138.99048"
       id="path2968"
       sodipodi:nodetypes="cc" />
    <g
       id="g71774"
       style="stroke-width:0.7;stroke-miterlimit:4;stroke-dasharray:none"
       transform="matrix(0.99,0,0,0.99,0.67109732,1.1482514)">
      <path
         style="fill:none;fill-rule:evenodd;stroke:#c15001;stroke-width:0.7;stroke-linecap:butt;stroke-linejoin:miter;stroke-miterlimit:4;stroke-dasharray:none;stroke-opacity:1"
         d="m 83.166039,145.64198 c -1.267666,-0.62896 -2.469045,-1.46207 -3.563178,-2.51644 -1.78526,-1.72037 -3.770633,-2.84976 -5.851625,-3.57505 -1.980022,-0.6901 -4.046609,-1.01435 -6.109749,-1.13374"
         id="path5792" />
      <path
         style="fill:none;fill-rule:evenodd;stroke:#923e26;stroke-width:0.7;stroke-linecap:butt;stroke-linejoin:miter;stroke-miterlimit:4;stroke-dasharray:none;stroke-opacity:0.929412"
         d="m 102.41611,141.46639 c -4.453562,5.24381 -12.728895,7.41108 -19.250071,4.17559"
         id="path5790" />
      <path
         style="fill:none;fill-rule:evenodd;stroke:#4f285b;stroke-width:0.7;stroke-linecap:butt;stroke-linejoin:miter;stroke-miterlimit:4;stroke-dasharray:none;stroke-opacity:0.835294"
         d="m 103.43733,114.87171 c -1.16966,3.19297 -1.20817,6.96985 0.926,12.1553 2.37259,5.76474 1.11771,10.83061 -1.94722,14.43938"
         id="path5788" />
      <path
         style="fill:none;fill-rule:evenodd;stroke:#0d108f;stroke-width:0.7;stroke-linecap:butt;stroke-linejoin:miter;stroke-miterlimit:4;stroke-dasharray:none;stroke-opacity:0.741176"
         d="m 115.80789,90.813266 c 0.60226,1.450394 0.66474,3.056755 0.0728,4.791863 -2.9558,8.664701 -10.05591,12.749291 -12.44336,19.266581"
         id="path5786" />
      <path
         style="fill:none;fill-rule:evenodd;stroke:#030c98;stroke-width:0.7;stroke-linecap:butt;stroke-linejoin:miter;stroke-miterlimit:4;stroke-dasharray:none;stroke-opacity:0.72549"
         d="m 93.049587,82.491715 c 11.078593,-0.219806 20.549313,3.001766 22.758303,8.321551"
         id="path5784" />
      <path
         style="fill:none;fill-rule:evenodd;stroke:#0c0f90;stroke-width:0.7;stroke-linecap:butt;stroke-linejoin:miter;stroke-miterlimit:4;stroke-dasharray:none;stroke-opacity:0.737255"
         d="m 73.301386,86.589012 c 6.390999,-2.691065 13.338692,-3.970129 19.748201,-4.097297"
         id="path5782" />
      <path
         style="fill:none;fill-rule:evenodd;stroke:#391f6c;stroke-width:0.7;stroke-linecap:butt;stroke-linejoin:miter;stroke-miterlimit:4;stroke-dasharray:none;stroke-opacity:0.803922"
         d="m 58.62117,95.863424 c 2.210806,-1.950979 5.134638,-4.071585 8.991434,-6.394143 1.822926,-1.097764 3.729699,-2.055356 5.688782,-2.880269"
         id="path5780" />
      <path
         style="fill:none;fill-rule:evenodd;stroke:#72333f;stroke-width:0.7;stroke-linecap:butt;stroke-linejoin:miter;stroke-miterlimit:4;stroke-dasharray:none;stroke-opacity:0.886275"
         d="m 52.187371,111.58111 c -0.293734,-4.07613 -1.35511,-8.84418 6.433799,-15.717686"
         id="path5778" />
      <path
         style="fill:none;fill-rule:evenodd;stroke:#a34519;stroke-width:0.7;stroke-linecap:butt;stroke-linejoin:miter;stroke-miterlimit:4;stroke-dasharray:none;stroke-opacity:0.952941"
         d="m 47.450058,132.16347 c -1.309134,-6.78241 1.730091,-10.74793 4.186985,-16.1028 0.662721,-1.44442 0.663381,-2.91074 0.550328,-4.47956"
         id="path5776" />
      <path
         style="fill:none;fill-rule:evenodd;stroke:#c25000;stroke-width:0.7;stroke-linecap:butt;stroke-linejoin:miter;stroke-miterlimit:4;stroke-dasharray:none;stroke-opacity:1"
         d="m 67.641527,138.41675 c -8.638407,-0.49988 -17.216402,2.59178 -19.126901,-2.54096 -0.495808,-1.33204 -0.842659,-2.56265 -1.064568,-3.71232"
         id="path3258" />
    </g>
    <g
       id="g86823"
       transform="translate(14.300289,-2.1166667)">
      <rect
         style="opacity:0.727154;fill:#cccccc;fill-opacity:0.996078;stroke:#000000;stroke-width:0.216;stroke-miterlimit:4;stroke-dasharray:none;stroke-dashoffset:0;stroke-opacity:0.929412"
         id="rect86596"
         width="33.837097"
         height="13.148056"
         x="123.46131"
         y="107.23551"
         ry="0.22818138" />
      <text
         xml:space="preserve"
         style="font-style:normal;font-weight:normal;font-size:4.58611px;line-height:125%;font-family:sans-serif;letter-spacing:0px;word-spacing:0px;fill:#000000;fill-opacity:1;stroke:none;stroke-width:0.264583px;stroke-linecap:butt;stroke-linejoin:miter;stroke-opacity:1"
         x="125.68202"
         y="112.15984"
         id="text75188"><tspan
           sodipodi:role="line"
           style="font-size:4.58611px;stroke-width:0.264583px"
           x="125.68202"
           y="112.15984"
           id="tspan89492">circular PDE</tspan><tspan
           sodipodi:role="line"
           style="font-size:4.58611px;stroke-width:0.264583px"
           x="125.68202"
           y="117.89248"
           id="tspan89496">representation</tspan></text>
    </g>
    <g
       id="g86833"
       transform="translate(10.446804,6.9609227)">
      <rect
         style="opacity:0.727154;fill:#cccccc;fill-opacity:0.996078;stroke:#000000;stroke-width:0.216;stroke-miterlimit:4;stroke-dasharray:none;stroke-dashoffset:0;stroke-opacity:0.929412"
         id="rect86714"
         width="45.328144"
         height="7.3036752"
         x="127.3148"
         y="84.238716"
         ry="0.22818138" />
      <text
         xml:space="preserve"
         style="font-style:normal;font-weight:normal;font-size:4.58611px;line-height:125%;font-family:sans-serif;letter-spacing:0px;word-spacing:0px;fill:#000000;fill-opacity:1;stroke:none;stroke-width:0.264583px;stroke-linecap:butt;stroke-linejoin:miter;stroke-opacity:1"
         x="129.70117"
         y="89.14888"
         id="text84086"><tspan
           sodipodi:role="line"
           id="tspan84084"
           style="font-size:4.58611px;stroke-width:0.264583px"
           x="129.70117"
           y="89.14888">membrane property</tspan></text>
    </g>
    <g
       id="g86828"
       transform="translate(17.320759,4.2333335)">
      <rect
         style="opacity:0.727154;fill:#cccccc;fill-opacity:0.996078;stroke:#000000;stroke-width:0.216;stroke-miterlimit:4;stroke-dasharray:none;stroke-dashoffset:0;stroke-opacity:0.929412"
         id="rect86716"
         width="26.059565"
         height="7.3036728"
         x="120.44084"
         y="73.263298"
         ry="0.22818138" />
      <text
         xml:space="preserve"
         style="font-style:normal;font-weight:normal;font-size:4.58611px;line-height:125%;font-family:sans-serif;letter-spacing:0px;word-spacing:0px;fill:#000000;fill-opacity:1;stroke:none;stroke-width:0.264583px;stroke-linecap:butt;stroke-linejoin:miter;stroke-opacity:1"
         x="122.76674"
         y="78.486702"
         id="text83218"><tspan
           sodipodi:role="line"
           id="tspan83216"
           style="font-size:4.58611px;stroke-width:0.264583px"
           x="122.76674"
           y="78.486702">cell shape</tspan></text>
    </g>
    <path
       style="fill:none;fill-rule:evenodd;stroke:#4d4d4d;stroke-width:0.365;stroke-linecap:butt;stroke-linejoin:miter;stroke-miterlimit:4;stroke-dasharray:none;stroke-opacity:1"
       d="m 137.37339,94.663252 -22.0768,0.211137"
       id="path86868"
       sodipodi:nodetypes="cc" />
    <path
       style="fill:none;fill-rule:evenodd;stroke:#4d4d4d;stroke-width:0.365;stroke-linecap:butt;stroke-linejoin:miter;stroke-miterlimit:4;stroke-dasharray:none;stroke-opacity:1"
       d="m 137.64046,81.109397 -23.5711,5.892322"
       id="path86870"
       sodipodi:nodetypes="cc" />
    <path
       style="fill:none;fill-rule:evenodd;stroke:#4d4d4d;stroke-width:0.365;stroke-linecap:butt;stroke-linejoin:miter;stroke-miterlimit:4;stroke-dasharray:none;stroke-opacity:1"
       d="M 137.82268,111.73663 94.506371,110.63074"
       id="path86872"
       sodipodi:nodetypes="cc" />
    <path
       style="fill:none;fill-rule:evenodd;stroke:#000000;stroke-width:0.264583px;stroke-linecap:butt;stroke-linejoin:miter;stroke-opacity:1"
       d="m 80.389851,114.59411 42.602159,20.23018"
       id="path90201"
       sodipodi:nodetypes="cc" />
    <ellipse
       style="opacity:0.727154;fill:none;fill-opacity:0.996078;stroke:#4d4d4d;stroke-width:0.505399;stroke-miterlimit:4;stroke-dasharray:none;stroke-dashoffset:0;stroke-opacity:0.929412"
       id="path90225"
       cx="122.83379"
       cy="134.9043"
       rx="7.2473006"
       ry="7.2473001" />
    <path
       style="fill:none;fill-rule:evenodd;stroke:#000000;stroke-width:0.165;stroke-linecap:butt;stroke-linejoin:miter;stroke-miterlimit:4;stroke-dasharray:none;stroke-opacity:1"
       d="m 113.09371,134.85778 h 19.68613"
       id="path90340"
       sodipodi:nodetypes="cc" />
    <path
       style="fill:none;fill-rule:evenodd;stroke:#000000;stroke-width:0.165;stroke-linecap:butt;stroke-linejoin:miter;stroke-miterlimit:4;stroke-dasharray:none;stroke-opacity:1;marker-end:url(#Arrow2Mend)"
       d="m 122.99201,134.82429 5.27359,-4.74575"
       id="path90512"
       sodipodi:nodetypes="cc" />
    <text
       xml:space="preserve"
       style="font-style:normal;font-weight:normal;font-size:3.175px;line-height:125%;font-family:sans-serif;letter-spacing:0px;word-spacing:0px;fill:#000000;fill-opacity:1;stroke:none;stroke-width:0.264583px;stroke-linecap:butt;stroke-linejoin:miter;stroke-opacity:1"
       x="126.25269"
       y="133.80673"
       id="text102495"><tspan
         sodipodi:role="line"
         id="tspan102893"
         x="126.25269"
         y="133.80673">φ</tspan></text>
    <g
       id="g104977"
       transform="translate(14.300289,21.897279)">
      <rect
         style="opacity:0.727154;fill:#cccccc;fill-opacity:0.996078;stroke:#000000;stroke-width:0.216;stroke-miterlimit:4;stroke-dasharray:none;stroke-dashoffset:0;stroke-opacity:0.929412"
         id="rect104975"
         width="48.76268"
         height="12.494048"
         x="123.46131"
         y="107.23551"
         ry="0.22818138" />
      <text
         xml:space="preserve"
         style="font-style:normal;font-weight:normal;font-size:4.58611px;line-height:125%;font-family:sans-serif;letter-spacing:0px;word-spacing:0px;fill:#000000;fill-opacity:1;stroke:none;stroke-width:0.264583px;stroke-linecap:butt;stroke-linejoin:miter;stroke-opacity:1"
         x="124.44282"
         y="112.15984"
         id="text104973"><tspan
           sodipodi:role="line"
           style="font-size:4.58611px;stroke-width:0.264583px"
           x="124.44282"
           y="112.15984"
           id="tspan104969">cell-centred membrane</tspan><tspan
           sodipodi:role="line"
           style="font-size:4.58611px;stroke-width:0.264583px"
           x="124.44282"
           y="117.89248"
           id="tspan104971">coordinate system</tspan></text>
    </g>
    <path
       style="fill:none;fill-rule:evenodd;stroke:#000000;stroke-width:0.165;stroke-linecap:butt;stroke-linejoin:miter;stroke-miterlimit:4;stroke-dasharray:none;stroke-opacity:1"
       d="M 122.93677,144.70084 V 125.01471"
       id="path108292"
       sodipodi:nodetypes="cc" />
    <text
       xml:space="preserve"
       style="font-style:normal;font-weight:normal;font-size:3.175px;line-height:125%;font-family:sans-serif;letter-spacing:0px;word-spacing:0px;fill:#000000;fill-opacity:1;stroke:none;stroke-width:0.264583px;stroke-linecap:butt;stroke-linejoin:miter;stroke-opacity:1"
       x="123.47279"
       y="125.76239"
       id="text112655"><tspan
         sodipodi:role="line"
         id="tspan112653"
         x="123.47279"
         y="125.76239">y</tspan></text>
    <text
       xml:space="preserve"
       style="font-style:normal;font-weight:normal;font-size:3.175px;line-height:125%;font-family:sans-serif;letter-spacing:0px;word-spacing:0px;fill:#000000;fill-opacity:1;stroke:none;stroke-width:0.264583px;stroke-linecap:butt;stroke-linejoin:miter;stroke-opacity:1"
       x="131.51782"
       y="137.23082"
       id="text118109"><tspan
         sodipodi:role="line"
         id="tspan118107"
         x="131.51782"
         y="137.23082">x</tspan></text>
    <path
       style="fill:none;fill-rule:evenodd;stroke:#666666;stroke-width:0.264583px;stroke-linecap:butt;stroke-linejoin:miter;stroke-opacity:1"
       d="M 80.389851,114.59411 65.220565,90.093241"
       id="path132795" />
    <path
       style="fill:none;fill-rule:evenodd;stroke:#666666;stroke-width:0.264583px;stroke-linecap:butt;stroke-linejoin:miter;stroke-opacity:1"
       d="M 82.284305,82.876477 80.389851,114.59411 52.446045,102.57693"
       id="path132896" />
    <path
       style="fill:none;fill-rule:evenodd;stroke:#666666;stroke-width:0.264583px;stroke-linecap:butt;stroke-linejoin:miter;stroke-opacity:1"
       d="m 48.614277,120.78094 31.775574,-6.18683 -25.115517,24.97721"
       id="path133077" />
    <path
       style="fill:none;fill-rule:evenodd;stroke:#666666;stroke-width:0.264583px;stroke-linecap:butt;stroke-linejoin:miter;stroke-opacity:1"
       d="M 80.389851,114.59411 74.92515,140.94349"
       id="path133178" />
    <path
       style="fill:none;fill-rule:evenodd;stroke:#666666;stroke-width:0.264583px;stroke-linecap:butt;stroke-linejoin:miter;stroke-opacity:1"
       d="M 105.90478,82.720704 80.389851,114.59411 109.98889,106.08939"
       id="path133523" />
    <path
       style="fill:none;fill-rule:evenodd;stroke:#666666;stroke-width:0.264583px;stroke-linecap:butt;stroke-linejoin:miter;stroke-opacity:1"
       d="m 80.389851,114.59411 22.771239,7.26909"
       id="path133591" />
    <path
       style="fill:none;fill-rule:evenodd;stroke:#666666;stroke-width:0.264583px;stroke-linecap:butt;stroke-linejoin:miter;stroke-opacity:1"
       d="M 106.33524,132.11213 80.389851,114.59411 93.921227,147.94842"
       id="path133626" />
  </g>
</svg>
