<?xml version="1.0" encoding="UTF-8" standalone="no"?> <svg xmlns="http://www.w3.org/2000/svg" xmlns:xlink="http://www.w3.org/1999/xlink" width="1026pt" height="307pt" viewBox="0.00 0.00 1026 306.9">
<g id="graph0" class="graph" transform="translate(4, 302.8999938964844)">
<title>%0</title>
<polygon fill="#ffffff" stroke="transparent" points="-4,4 -4,-302.9 1022,-302.9 1022,4 -4,4"></polygon>
<g id="clust1" class="cluster">
<title>cluster</title>
<polygon fill="#234178" fill-opacity="0.184314" stroke="#000000" points="8,-8 8,-290.9 1010,-290.9 1010,-8 8,-8"></polygon>
<text text-anchor="middle" x="509" y="-274.3" font-family="Times,serif" font-size="14.00" fill="#000000">Global</text>
</g>
<g id="clust2" class="cluster">
<title>cluster_1</title>
<polygon fill="#234178" fill-opacity="0.184314" stroke="#000000" points="16,-181.3 16,-258.1 240,-258.1 240,-181.3 16,-181.3"></polygon>
<text text-anchor="middle" x="128" y="-241.5" font-family="Times,serif" font-size="14.00" fill="#000000">CellType[ct1]</text>
</g>
<g id="clust3" class="cluster">
<title>cluster_2</title>
<polygon fill="#234178" fill-opacity="0.184314" stroke="#000000" points="778,-181.3 778,-258.1 1002,-258.1 1002,-181.3 778,-181.3"></polygon>
<text text-anchor="middle" x="890" y="-241.5" font-family="Times,serif" font-size="14.00" fill="#000000">CellType[ct2]</text>
</g>
<g id="clust4" class="cluster">
<title>cluster_3</title>
<polygon fill="#234178" fill-opacity="0.184314" stroke="#000000" points="546,-181.3 546,-258.1 770,-258.1 770,-181.3 546,-181.3"></polygon>
<text text-anchor="middle" x="658" y="-241.5" font-family="Times,serif" font-size="14.00" fill="#000000">CellType[ct3]</text>
</g>
<g id="clust5" class="cluster">
<title>cluster_4</title>
<polygon fill="#234178" fill-opacity="0.184314" stroke="#000000" points="314,-181.3 314,-258.1 538,-258.1 538,-181.3 314,-181.3"></polygon>
<text text-anchor="middle" x="426" y="-241.5" font-family="Times,serif" font-size="14.00" fill="#000000">CellType[ct4]</text>
</g>
<!-- CPM_0_1 -->
<g id="node1" class="node">
<title>CPM_0_1</title>
<g id="a_node1">
<polygon fill="#fffea3" stroke="#000000" points="250,-182.5 250,-232.1 304,-232.1 304,-182.5 250,-182.5"></polygon>
<text text-anchor="middle" x="276.7819" y="-215.5" font-family="Times,serif" font-size="14.00" fill="#000000">CPM</text>
<polyline fill="none" stroke="#000000" points="250,-207.3 303.5638,-207.3 "></polyline>
<text text-anchor="middle" x="276.7819" y="-190.7" font-family="Times,serif" font-size="14.00" fill="#000000">1</text>
</g>
</g>
<!-- cell_center_0 -->
<g id="node3" class="node">
<title style="">cell_center_0</title>
<ellipse fill="#b5b426" stroke="#000000" cx="369" cy="-124" rx="50.9588" ry="18" style=""></ellipse>
<ellipse fill="none" stroke="#000000" cx="369" cy="-124" rx="54.9572" ry="22" style=""></ellipse>
<text text-anchor="middle" x="369" y="-119.8" font-family="Times,serif" font-size="14.00" fill="#000000">cell.center</text>
</g>
<!-- CPM_0_1&#45;&gt;cell_center_0 -->
<g id="edge1" class="edge">
<title style="">CPM_0_1-&gt;cell_center_0</title>
<path fill="none" stroke="#8f100d" stroke-width="3" d="M304.1054,-182.7578C315.1301,-172.7756 327.9074,-161.2067 339.1938,-150.9876"></path>
<polygon fill="#8f100d" stroke="#8f100d" stroke-width="3" points="341.6656,-153.471 346.7294,-144.1646 336.9673,-148.282 341.6656,-153.471"></polygon>
</g>
<!-- cell_type_0 -->
<g id="node4" class="node">
<title style="">cell_type_0</title>
<ellipse fill="#d3d247" stroke="#000000" cx="490" cy="-124" rx="44.0361" ry="18" style=""></ellipse>
<ellipse fill="none" stroke="#000000" cx="490" cy="-124" rx="48.0377" ry="22" style=""></ellipse>
<text text-anchor="middle" x="490" y="-119.8" font-family="Times,serif" font-size="14.00" fill="#000000">cell.type</text>
</g>
<!-- CPM_0_1&#45;&gt;cell_type_0 -->
<g id="edge2" class="edge">
<title style="">CPM_0_1-&gt;cell_type_0</title>
<path fill="none" stroke="#8f100d" stroke-width="3" d="M304.1933,-184.6199C306.1083,-183.4184 308.0525,-182.2976 310,-181.3 360.6188,-155.3709 379.0842,-164.1017 433,-146 436.6845,-144.763 440.4819,-143.4294 444.2845,-142.0522"></path>
<polygon fill="#8f100d" stroke="#8f100d" stroke-width="3" points="445.5247,-145.3253 453.686,-138.5692 443.0929,-138.7612 445.5247,-145.3253"></polygon>
</g>
<!-- Gnuplotter_0_20 -->
<g id="node2" class="node">
<title style="">Gnuplotter_0_20</title>
<g id="a_node2">">
<polygon fill="#fffea3" stroke="transparent" points="526,-66 454,-66 454,-16 526,-16 526,-66" style=""></polygon>
<text text-anchor="start" x="457.507" y="-48.5" font-family="times" font-size="15.00" fill="#000000">Gnuplotter</text>
<text text-anchor="start" x="482.5" y="-24.5" font-family="times" font-size="15.00" fill="#000000">20</text>
<polygon fill="#000000" stroke="#000000" points="454,-41 454,-41 526,-41 526,-41 454,-41" style=""></polygon>
<polygon fill="none" stroke="#000000" points="454,-16 454,-66 526,-66 526,-16 454,-16" style=""></polygon>
</g>
</g>
<!-- cell_type_0&#45;&gt;Gnuplotter_0_20 -->
<g id="edge7" class="edge">
<title style="">cell_type_0-&gt;Gnuplotter_0_20</title>
<path fill="none" stroke="#112c5f" stroke-width="2" d="M490,-101.7575C490,-93.974 490,-85.0292 490,-76.4385" style=""></path>
<polygon fill="#112c5f" stroke="#112c5f" stroke-width="2" points="493.5001,-76.2372 490,-66.2373 486.5001,-76.2373 493.5001,-76.2372" style=""></polygon>
</g>
<!-- cell_center_1 -->
<g id="node5" class="node">
<title>cell_center_1</title>
<ellipse fill="#b5b426" stroke="#000000" cx="75" cy="-207.3" rx="50.9572" ry="18"></ellipse>
<text text-anchor="middle" x="75" y="-203.1" font-family="Times,serif" font-size="14.00" fill="#000000">cell.center</text>
</g>
<!-- cell_center_1&#45;&gt;cell_center_0 -->
<g id="edge3" class="edge">
<title style="">cell_center_1-&gt;cell_center_0</title>
<path fill="none" stroke="#38568c" d="M105.7513,-192.7906C115.0252,-188.7386 125.316,-184.5579 135,-181.3 197.4362,-160.2951 271.6187,-143.4473 319.4612,-133.592"></path>
</g>
<!-- cell_type_1 -->
<g id="node6" class="node">
<title>cell_type_1</title>
<g id="a_node6">
<ellipse fill="#d3d247" stroke="#000000" cx="188" cy="-207.3" rx="44.0377" ry="18"></ellipse>
<text text-anchor="middle" x="188" y="-203.1" font-family="Times,serif" font-size="14.00" fill="#000000">cell.type</text>
</g>
</g>
<!-- cell_type_1&#45;&gt;cell_type_0 -->
<g id="edge8" class="edge">
<title style="">cell_type_1-&gt;cell_type_0</title>
<path fill="none" stroke="#38568c" d="M212.2189,-192.2373C219.6273,-188.1698 227.9498,-184.1193 236,-181.3 319.9507,-151.8994 347.3399,-169.9681 433,-146 440.0484,-144.0278 447.4381,-141.5206 454.4731,-138.9099"></path>
</g>
<!-- cell_center_2 -->
<g id="node7" class="node">
<title>cell_center_2</title>
<ellipse fill="#b5b426" stroke="#000000" cx="837" cy="-207.3" rx="50.9572" ry="18"></ellipse>
<text text-anchor="middle" x="837" y="-203.1" font-family="Times,serif" font-size="14.00" fill="#000000">cell.center</text>
</g>
<!-- cell_center_2&#45;&gt;cell_center_0 -->
<g id="edge4" class="edge">
<title style="">cell_center_2-&gt;cell_center_0</title>
<path fill="none" stroke="#38568c" d="M806.8401,-192.7847C796.6263,-188.4316 785.0135,-184.0803 774,-181.3 626.2692,-144.0061 581.7881,-178.8229 433,-146 425.0834,-144.2536 416.7849,-141.8504 408.8855,-139.2712"></path>
</g>
<!-- cell_type_2 -->
<g id="node8" class="node">
<title>cell_type_2</title>
<g id="a_node8">
<ellipse fill="#d3d247" stroke="#000000" cx="950" cy="-207.3" rx="44.0377" ry="18"></ellipse>
<text text-anchor="middle" x="950" y="-203.1" font-family="Times,serif" font-size="14.00" fill="#000000">cell.type</text>
</g>
</g>
<!-- cell_type_2&#45;&gt;cell_type_0 -->
<g id="edge9" class="edge">
<title style="">cell_type_2-&gt;cell_type_0</title>
<path fill="none" stroke="#38568c" d="M924.2536,-192.64C915.8016,-188.3851 906.2095,-184.1283 897,-181.3 771.1485,-142.6494 615.2991,-129.9476 538.0598,-125.8675"></path>
</g>
<!-- cell_center_3 -->
<g id="node9" class="node">
<title>cell_center_3</title>
<ellipse fill="#b5b426" stroke="#000000" cx="605" cy="-207.3" rx="50.9572" ry="18"></ellipse>
<text text-anchor="middle" x="605" y="-203.1" font-family="Times,serif" font-size="14.00" fill="#000000">cell.center</text>
</g>
<!-- cell_center_3&#45;&gt;cell_center_0 -->
<g id="edge5" class="edge">
<title style="">cell_center_3-&gt;cell_center_0</title>
<path fill="none" stroke="#38568c" d="M572.4926,-193.3161C562.7489,-189.2789 551.995,-184.9745 542,-181.3 494.206,-163.7291 481.3021,-162.1219 433,-146 425.7558,-143.5821 418.0644,-140.9737 410.6198,-138.4275"></path>
</g>
<!-- cell_type_3 -->
<g id="node10" class="node">
<title>cell_type_3</title>
<g id="a_node10">
<ellipse fill="#d3d247" stroke="#000000" cx="718" cy="-207.3" rx="44.0377" ry="18"></ellipse>
<text text-anchor="middle" x="718" y="-203.1" font-family="Times,serif" font-size="14.00" fill="#000000">cell.type</text>
</g>
</g>
<!-- cell_type_3&#45;&gt;cell_type_0 -->
<g id="edge10" class="edge">
<title style="">cell_type_3-&gt;cell_type_0</title>
<path fill="none" stroke="#38568c" d="M690.824,-193.0642C682.6317,-189.02 673.5445,-184.7749 665,-181.3 619.9869,-162.9942 566.7325,-146.226 530.8922,-135.6231"></path>
</g>
<!-- cell_center_4 -->
<g id="node11" class="node">
<title>cell_center_4</title>
<ellipse fill="#b5b426" stroke="#000000" cx="373" cy="-207.3" rx="50.9572" ry="18"></ellipse>
<text text-anchor="middle" x="373" y="-203.1" font-family="Times,serif" font-size="14.00" fill="#000000">cell.center</text>
</g>
<!-- cell_center_4&#45;&gt;cell_center_0 -->
<g id="edge6" class="edge">
<title style="">cell_center_4-&gt;cell_center_0</title>
<path fill="none" stroke="#38568c" d="M372.1321,-189.2251C371.5255,-176.5927 370.7117,-159.6462 370.0657,-146.1929"></path>
</g>
<!-- cell_type_4 -->
<g id="node12" class="node">
<title>cell_type_4</title>
<g id="a_node12">
<ellipse fill="#d3d247" stroke="#000000" cx="486" cy="-207.3" rx="44.0377" ry="18"></ellipse>
<text text-anchor="middle" x="486" y="-203.1" font-family="Times,serif" font-size="14.00" fill="#000000">cell.type</text>
</g>
</g>
<!-- cell_type_4&#45;&gt;cell_type_0 -->
<g id="edge11" class="edge">
<title style="">cell_type_4-&gt;cell_type_0</title>
<path fill="none" stroke="#38568c" d="M486.8679,-189.2251C487.4745,-176.5927 488.2883,-159.6462 488.9343,-146.1929"></path>
</g>
</g>
</svg>