<?xml version="1.0" encoding="UTF-8" standalone="no"?> <svg xmlns="http://www.w3.org/2000/svg" xmlns:xlink="http://www.w3.org/1999/xlink" width="662pt" height="353pt" viewBox="0.00 0.00 662.00 352.80">
<g id="graph0" class="graph" transform="scale(1 1) rotate(0) translate(4 348.8)">
<title style="">%0</title>
<polygon fill="#ffffff" stroke="transparent" points="-4,4 -4,-348.8 658,-348.8 658,4 -4,4" style=""></polygon>
<g id="clust1" class="cluster">
<title style="">cluster</title>
<polygon fill="#234178" fill-opacity="0.184314" stroke="#000000" points="8,-8 8,-336.8 646,-336.8 646,-8 8,-8" style=""></polygon>
<text text-anchor="middle" x="327" y="-320.2" font-family="Times,serif" font-size="14.00" fill="#000000">Global</text>
</g>
<g id="clust2" class="cluster">
<title style="">cluster_1</title>
<polygon fill="#234178" fill-opacity="0.184314" stroke="#000000" points="16,-166 16,-304 638,-304 638,-166 16,-166" style=""></polygon>
</g>
<!-- Logger_0_50 -->
<g id="node1" class="node">
<title style="">Logger_0_50</title>
<g id="a_node1">">
<polygon fill="#fffea3" stroke="transparent" points="334.5,-66 283.5,-66 283.5,-16 334.5,-16 334.5,-66" style=""></polygon>
<text text-anchor="start" x="287.8423" y="-48.5" font-family="times" font-size="15.00" fill="#000000">Logger</text>
<text text-anchor="start" x="302" y="-24.5" font-family="times" font-size="15.00" fill="#000000">50</text>
<polygon fill="#000000" stroke="#000000" points="284,-41 284,-41 335,-41 335,-41 284,-41" style=""></polygon>
<polygon fill="none" stroke="#000000" points="283.5,-16 283.5,-66 334.5,-66 334.5,-16 283.5,-16" style=""></polygon>
</g>
</g>
<!-- F_a_0 -->
<g id="node2" class="node">
<title style="">F_a_0</title>
<g id="a_node2">
<ellipse fill="#d3d247" stroke="#000000" cx="237" cy="-120" rx="27" ry="18" style=""></ellipse>
<text text-anchor="middle" x="237" y="-115.8" font-family="Times,serif" font-size="14.00" fill="#000000">F_a</text>
</g>
</g>
<!-- F_a_0&#45;&gt;Logger_0_50 -->
<g id="edge1" class="edge">
<title style="">F_a_0-&gt;Logger_0_50</title>
<path fill="none" stroke="#112c5f" stroke-width="2" d="M251.2249,-104.3921C259.2056,-95.6356 269.4732,-84.3697 279.1336,-73.77" style=""></path>
<polygon fill="#112c5f" stroke="#112c5f" stroke-width="2" points="281.87,-75.9636 286.0192,-66.215 276.6963,-71.2483 281.87,-75.9636" style=""></polygon>
</g>
<!-- a_0 -->
<g id="node3" class="node">
<title style="">a_0</title>
<g id="a_node3">
<ellipse fill="#d3d247" stroke="#000000" cx="309" cy="-120" rx="27" ry="18" style=""></ellipse>
<text text-anchor="middle" x="309" y="-115.8" font-family="Times,serif" font-size="14.00" fill="#000000">a</text>
</g>
</g>
<!-- a_0&#45;&gt;Logger_0_50 -->
<g id="edge5" class="edge">
<title style="">a_0-&gt;Logger_0_50</title>
<path fill="none" stroke="#112c5f" stroke-width="2" d="M309,-101.6772C309,-94.0766 309,-84.9908 309,-76.1933" style=""></path>
<polygon fill="#112c5f" stroke="#112c5f" stroke-width="2" points="312.5001,-76.1046 309,-66.1046 305.5001,-76.1047 312.5001,-76.1046" style=""></polygon>
</g>
<!-- i_0 -->
<g id="node4" class="node">
<title style="">i_0</title>
<g id="a_node4">
<ellipse fill="#d3d247" stroke="#000000" cx="381" cy="-120" rx="27" ry="18" style=""></ellipse>
<text text-anchor="middle" x="381" y="-115.8" font-family="Times,serif" font-size="14.00" fill="#000000">i</text>
</g>
</g>
<!-- i_0&#45;&gt;Logger_0_50 -->
<g id="edge10" class="edge">
<title style="">i_0-&gt;Logger_0_50</title>
<path fill="none" stroke="#112c5f" stroke-width="2" d="M366.7751,-104.3921C358.7944,-95.6356 348.5268,-84.3697 338.8664,-73.77" style=""></path>
<polygon fill="#112c5f" stroke="#112c5f" stroke-width="2" points="341.3037,-71.2483 331.9808,-66.215 336.13,-75.9636 341.3037,-71.2483" style=""></polygon>
</g>
<!-- System_1_0_05 -->
<g id="node5" class="node">
<title style="">System_1_0_05</title>
<g id="a_node5">">
<polygon fill="#fffea3" stroke="transparent" points="335,-224 283,-224 283,-174 335,-174 335,-224" style=""></polygon>
<text text-anchor="start" x="286.9163" y="-206.5" font-family="times" font-size="15.00" fill="#000000">System</text>
<text text-anchor="start" x="295.875" y="-182.5" font-family="times" font-size="15.00" fill="#000000">0.05</text>
<polygon fill="#000000" stroke="#000000" points="283,-199 283,-199 335,-199 335,-199 283,-199" style=""></polygon>
<polygon fill="none" stroke="#000000" points="283,-174 283,-224 335,-224 335,-174 283,-174" style=""></polygon>
</g>
</g>
<!-- System_1_0_05&#45;&gt;F_a_0 -->
<g id="edge2" class="edge">
<title style="">System_1_0_05-&gt;F_a_0</title>
<path fill="none" stroke="#8f100d" stroke-width="3" d="M285.8224,-173.5691C276.9583,-163.8431 266.9011,-152.8081 258.2278,-143.2917" style=""></path>
<polygon fill="#8f100d" stroke="#8f100d" stroke-width="3" points="260.6473,-140.7504 251.3244,-135.7171 255.4737,-145.4657 260.6473,-140.7504" style=""></polygon>
</g>
<!-- System_1_0_05&#45;&gt;a_0 -->
<g id="edge3" class="edge">
<title style="">System_1_0_05-&gt;a_0</title>
<path fill="none" stroke="#8f100d" stroke-width="3" d="M309,-173.5691C309,-165.5402 309,-156.6193 309,-148.397" style=""></path>
<polygon fill="#8f100d" stroke="#8f100d" stroke-width="3" points="312.5001,-148.1242 309,-138.1242 305.5001,-148.1242 312.5001,-148.1242" style=""></polygon>
</g>
<!-- System_1_0_05&#45;&gt;i_0 -->
<g id="edge4" class="edge">
<title style="">System_1_0_05-&gt;i_0</title>
<path fill="none" stroke="#8f100d" stroke-width="3" d="M332.1776,-173.5691C341.0417,-163.8431 351.0989,-152.8081 359.7722,-143.2917" style=""></path>
<polygon fill="#8f100d" stroke="#8f100d" stroke-width="3" points="362.5263,-145.4657 366.6756,-135.7171 357.3527,-140.7504 362.5263,-145.4657" style=""></polygon>
</g>
<!-- b_1 -->
<g id="node6" class="node">
<title style="">b_1</title>
<g id="a_node6">
<ellipse fill="#d3d247" stroke="#000000" cx="603" cy="-278" rx="27" ry="18" style=""></ellipse>
<text text-anchor="middle" x="603" y="-273.8" font-family="Times,serif" font-size="14.00" fill="#000000">b</text>
</g>
</g>
<!-- b_1&#45;&gt;System_1_0_05 -->
<g id="edge6" class="edge">
<title style="">b_1-&gt;System_1_0_05</title>
<path fill="none" stroke="#112c5f" stroke-width="2" d="M582.0393,-266.5027C577.1935,-264.1326 571.9925,-261.8106 567,-260 490.2482,-232.1651 395.9902,-213.617 345.3357,-204.85" style=""></path>
<polygon fill="#112c5f" stroke="#112c5f" stroke-width="2" points="345.6557,-201.3542 335.2104,-203.1278 344.4819,-208.2551 345.6557,-201.3542" style=""></polygon>
</g>
<!-- epsilon_1 -->
<g id="node7" class="node">
<title style="">epsilon_1</title>
<g id="a_node7">
<ellipse fill="#d3d247" stroke="#000000" cx="519" cy="-278" rx="38.8632" ry="18" style=""></ellipse>
<text text-anchor="middle" x="519" y="-273.8" font-family="Times,serif" font-size="14.00" fill="#000000">epsilon</text>
</g>
</g>
<!-- epsilon_1&#45;&gt;System_1_0_05 -->
<g id="edge7" class="edge">
<title style="">epsilon_1-&gt;System_1_0_05</title>
<path fill="none" stroke="#112c5f" stroke-width="2" d="M488.4642,-266.5127C450.3162,-252.1618 385.1507,-227.6472 344.7249,-212.4394" style=""></path>
<polygon fill="#112c5f" stroke="#112c5f" stroke-width="2" points="345.8509,-209.1235 335.2589,-208.8783 343.3862,-215.6753 345.8509,-209.1235" style=""></polygon>
</g>
<!-- eta_1 -->
<g id="node8" class="node">
<title style="">eta_1</title>
<g id="a_node8">
<ellipse fill="#d3d247" stroke="#000000" cx="435" cy="-278" rx="27" ry="18" style=""></ellipse>
<text text-anchor="middle" x="435" y="-273.8" font-family="Times,serif" font-size="14.00" fill="#000000">eta</text>
</g>
</g>
<!-- eta_1&#45;&gt;System_1_0_05 -->
<g id="edge8" class="edge">
<title style="">eta_1-&gt;System_1_0_05</title>
<path fill="none" stroke="#112c5f" stroke-width="2" d="M415.3125,-265.6563C396.1641,-253.6505 366.6688,-235.1575 343.5993,-220.6932" style=""></path>
<polygon fill="#112c5f" stroke="#112c5f" stroke-width="2" points="345.439,-217.7156 335.1073,-215.3689 341.7205,-223.6463 345.439,-217.7156" style=""></polygon>
</g>
<!-- gamma_1 -->
<g id="node9" class="node">
<title style="">gamma_1</title>
<g id="a_node9">
<ellipse fill="#d3d247" stroke="#000000" cx="351" cy="-278" rx="39.4254" ry="18" style=""></ellipse>
<text text-anchor="middle" x="351" y="-273.8" font-family="Times,serif" font-size="14.00" fill="#000000">gamma</text>
</g>
</g>
<!-- gamma_1&#45;&gt;System_1_0_05 -->
<g id="edge9" class="edge">
<title style="">gamma_1-&gt;System_1_0_05</title>
<path fill="none" stroke="#112c5f" stroke-width="2" d="M341.6788,-260.4673C337.3933,-252.4065 332.1564,-242.5561 327.1411,-233.1226" style=""></path>
<polygon fill="#112c5f" stroke="#112c5f" stroke-width="2" points="330.2236,-231.4646 322.4389,-224.2779 324.0428,-234.7506 330.2236,-231.4646" style=""></polygon>
</g>
<!-- k_n_1 -->
<g id="node10" class="node">
<title style="">k_n_1</title>
<g id="a_node10">
<ellipse fill="#d3d247" stroke="#000000" cx="267" cy="-278" rx="27" ry="18" style=""></ellipse>
<text text-anchor="middle" x="267" y="-273.8" font-family="Times,serif" font-size="14.00" fill="#000000">k_n</text>
</g>
</g>
<!-- k_n_1&#45;&gt;System_1_0_05 -->
<g id="edge11" class="edge">
<title style="">k_n_1-&gt;System_1_0_05</title>
<path fill="none" stroke="#112c5f" stroke-width="2" d="M276.1134,-260.8582C280.4282,-252.7423 285.7412,-242.7487 290.8287,-233.1794" style=""></path>
<polygon fill="#112c5f" stroke="#112c5f" stroke-width="2" points="293.9933,-234.6826 295.5973,-224.2099 287.8125,-231.3966 293.9933,-234.6826" style=""></polygon>
</g>
<!-- k_s_1 -->
<g id="node11" class="node">
<title style="">k_s_1</title>
<g id="a_node11">
<ellipse fill="#d3d247" stroke="#000000" cx="195" cy="-278" rx="27" ry="18" style=""></ellipse>
<text text-anchor="middle" x="195" y="-273.8" font-family="Times,serif" font-size="14.00" fill="#000000">k_s</text>
</g>
</g>
<!-- k_s_1&#45;&gt;System_1_0_05 -->
<g id="edge12" class="edge">
<title style="">k_s_1-&gt;System_1_0_05</title>
<path fill="none" stroke="#112c5f" stroke-width="2" d="M213.8248,-264.9548C230.3148,-253.5275 254.6938,-236.6333 274.6495,-222.8043" style=""></path>
<polygon fill="#112c5f" stroke="#112c5f" stroke-width="2" points="276.6695,-225.6628 282.8952,-217.0901 272.6823,-219.9093 276.6695,-225.6628" style=""></polygon>
</g>
<!-- n_1 -->
<g id="node12" class="node">
<title style="">n_1</title>
<g id="a_node12">
<ellipse fill="#d3d247" stroke="#000000" cx="123" cy="-278" rx="27" ry="18" style=""></ellipse>
<text text-anchor="middle" x="123" y="-273.8" font-family="Times,serif" font-size="14.00" fill="#000000">n</text>
</g>
</g>
<!-- n_1&#45;&gt;System_1_0_05 -->
<g id="edge13" class="edge">
<title style="">n_1-&gt;System_1_0_05</title>
<path fill="none" stroke="#112c5f" stroke-width="2" d="M144.5716,-266.875C149.2935,-264.5352 154.289,-262.1318 159,-260 197.7112,-242.4826 242.9981,-224.3868 273.6024,-212.5017" style=""></path>
<polygon fill="#112c5f" stroke="#112c5f" stroke-width="2" points="274.9312,-215.7405 282.9961,-208.8697 272.4067,-209.2115 274.9312,-215.7405" style=""></polygon>
</g>
<!-- s_1 -->
<g id="node13" class="node">
<title style="">s_1</title>
<g id="a_node13">
<ellipse fill="#d3d247" stroke="#000000" cx="51" cy="-278" rx="27" ry="18" style=""></ellipse>
<text text-anchor="middle" x="51" y="-273.8" font-family="Times,serif" font-size="14.00" fill="#000000">s</text>
</g>
</g>
<!-- s_1&#45;&gt;System_1_0_05 -->
<g id="edge14" class="edge">
<title style="">s_1-&gt;System_1_0_05</title>
<path fill="none" stroke="#112c5f" stroke-width="2" d="M72.0102,-266.6355C76.8534,-264.2585 82.0409,-261.9001 87,-260 150.8867,-235.5214 228.5874,-216.5063 273.0687,-206.592" style=""></path>
<polygon fill="#112c5f" stroke="#112c5f" stroke-width="2" points="273.8222,-210.01 282.8363,-204.4425 272.3178,-203.1735 273.8222,-210.01" style=""></polygon>
</g>
</g>
</svg>