<?xml version="1.0" encoding="UTF-8" standalone="no"?>
<!DOCTYPE svg PUBLIC "-//W3C//DTD SVG 1.1//EN"
 "http://www.w3.org/Graphics/SVG/1.1/DTD/svg11.dtd">
<!-- Generated by graphviz version 2.50.0 (20211204.2007)
 -->
<!-- Pages: 1 -->
<svg width="1254pt" height="365pt"
 viewBox="0.00 0.00 1254.00 365.00" xmlns="http://www.w3.org/2000/svg" xmlns:xlink="http://www.w3.org/1999/xlink">
<g id="graph0" class="graph" transform="scale(1 1) rotate(0) translate(4 361)">
<polygon fill="white" stroke="transparent" points="-4,4 -4,-361 1250,-361 1250,4 -4,4"/>
<g id="clust1" class="cluster">
<title>cluster</title>
<polygon fill="#234178" fill-opacity="0.184314" stroke="black" points="8,-8 8,-349 1238,-349 1238,-8 8,-8"/>
<text text-anchor="middle" x="623" y="-333.8" font-family="Times,serif" font-size="14.00">Global</text>
</g>
<g id="clust3" class="cluster">
<title>cluster_2</title>
<polygon fill="#234178" fill-opacity="0.184314" stroke="black" points="564,-187 564,-274 660,-274 660,-187 564,-187"/>
<text text-anchor="middle" x="612" y="-258.8" font-family="Times,serif" font-size="14.00">System</text>
</g>
<!-- Logger_0_6097416426442070905_1 -->
<g id="node1" class="node">
<title>Logger_0_6097416426442070905_1</title>
<g id="a_node1"><a xlink:href="morph://MorpheusModel/Analysis/Logger" xlink:title="&lt;TABLE&gt;">
<polygon fill="#fffea3" stroke="transparent" points="605,-87 475,-87 475,-16 605,-16 605,-87"/>
<text text-anchor="start" x="516.5" y="-70.5" font-family="times" font-size="15.00">Logger</text>
<text text-anchor="start" x="479" y="-48.5" font-family="times" font-style="italic" font-size="15.00">&quot;chemical profiles&quot;</text>
<text text-anchor="start" x="535.5" y="-24.5" font-family="times" font-size="15.00">1</text>
<polygon fill="black" stroke="black" points="475,-39.5 475,-39.5 605,-39.5 605,-39.5 475,-39.5"/>
<polygon fill="none" stroke="black" points="475,-16 475,-87 605,-87 605,-16 475,-16"/>
</a>
</g>
</g>
<!-- E_0 -->
<g id="node2" class="node">
<title>E_0</title>
<g id="a_node2"><a xlink:href="morph://MorpheusModel/Global/Field[2]" xlink:title="E">
<ellipse fill="#d3d247" stroke="black" cx="316" cy="-141" rx="27" ry="18"/>
<text text-anchor="middle" x="316" y="-137.3" font-family="Times,serif" font-size="14.00">E</text>
</a>
</g>
</g>
<!-- E_0&#45;&gt;Logger_0_6097416426442070905_1 -->
<g id="edge3" class="edge">
<title>E_0&#45;&gt;Logger_0_6097416426442070905_1</title>
<path fill="none" stroke="#112c5f" stroke-width="2" d="M337.19,-129.64C342.02,-127.37 347.16,-125.05 352,-123 388.83,-107.43 430.4,-91.66 465.07,-78.99"/>
<polygon fill="#112c5f" stroke="#112c5f" stroke-width="2" points="466.46,-82.21 474.66,-75.5 464.07,-75.63 466.46,-82.21"/>
</g>
<!-- E0_0 -->
<g id="node3" class="node">
<title>E0_0</title>
<g id="a_node3"><a xlink:href="morph://MorpheusModel/Global/Constant[6]" xlink:title="E0">
<ellipse fill="#d3d247" stroke="black" cx="1203" cy="-300" rx="27" ry="18"/>
<text text-anchor="middle" x="1203" y="-296.3" font-family="Times,serif" font-size="14.00">E0</text>
</a>
</g>
</g>
<!-- System_2_0_0009375 -->
<g id="node29" class="node">
<title>System_2_0_0009375</title>
<g id="a_node29"><a xlink:href="morph://MorpheusModel/Global/System" xlink:title="&lt;TABLE&gt;">
<polygon fill="#fffea3" stroke="transparent" points="651.5,-243 572.5,-243 572.5,-195 651.5,-195 651.5,-243"/>
<text text-anchor="start" x="587" y="-227" font-family="times" font-size="15.00">System</text>
<text text-anchor="start" x="577" y="-204" font-family="times" font-size="15.00">0.0009375</text>
<polygon fill="black" stroke="black" points="573,-219 573,-219 652,-219 652,-219 573,-219"/>
<polygon fill="none" stroke="black" points="572.5,-195 572.5,-243 651.5,-243 651.5,-195 572.5,-195"/>
</a>
</g>
</g>
<!-- E0_0&#45;&gt;System_2_0_0009375 -->
<g id="edge1" class="edge">
<title>E0_0&#45;&gt;System_2_0_0009375</title>
<path fill="none" stroke="#112c5f" stroke-width="2" d="M1182.51,-287.91C1177.56,-285.62 1172.19,-283.47 1167,-282 985.88,-230.66 760.22,-221.53 661.78,-220.12"/>
<polygon fill="#112c5f" stroke="#112c5f" stroke-width="2" points="661.58,-216.62 651.54,-219.99 661.5,-223.62 661.58,-216.62"/>
</g>
<!-- ECM_0 -->
<g id="node4" class="node">
<title>ECM_0</title>
<g id="a_node4"><a xlink:href="morph://MorpheusModel/Global/Field[5]" xlink:title="ECM">
<ellipse fill="#d3d247" stroke="black" cx="392" cy="-141" rx="30.59" ry="18"/>
<text text-anchor="middle" x="392" y="-137.3" font-family="Times,serif" font-size="14.00">ECM</text>
</a>
</g>
</g>
<!-- ECM_0&#45;&gt;Logger_0_6097416426442070905_1 -->
<g id="edge2" class="edge">
<title>ECM_0&#45;&gt;Logger_0_6097416426442070905_1</title>
<path fill="none" stroke="#112c5f" stroke-width="2" d="M412.89,-127.65C428.58,-118.37 450.99,-105.12 472.65,-92.32"/>
<polygon fill="#112c5f" stroke="#112c5f" stroke-width="2" points="474.71,-95.17 481.53,-87.07 471.14,-89.14 474.71,-95.17"/>
</g>
<!-- En_0 -->
<g id="node5" class="node">
<title>En_0</title>
<g id="a_node5"><a xlink:href="morph://MorpheusModel/Global/Constant[9]" xlink:title="En">
<ellipse fill="#d3d247" stroke="black" cx="1131" cy="-300" rx="27" ry="18"/>
<text text-anchor="middle" x="1131" y="-296.3" font-family="Times,serif" font-size="14.00">En</text>
</a>
</g>
</g>
<!-- En_0&#45;&gt;System_2_0_0009375 -->
<g id="edge4" class="edge">
<title>En_0&#45;&gt;System_2_0_0009375</title>
<path fill="none" stroke="#112c5f" stroke-width="2" d="M1110.49,-287.97C1105.54,-285.68 1100.17,-283.51 1095,-282 941.23,-237.05 750.46,-224.67 661.72,-221.28"/>
<polygon fill="#112c5f" stroke="#112c5f" stroke-width="2" points="661.79,-217.78 651.67,-220.91 661.53,-224.77 661.79,-217.78"/>
</g>
<!-- Et0_0 -->
<g id="node6" class="node">
<title>Et0_0</title>
<g id="a_node6"><a xlink:href="morph://MorpheusModel/Global/Constant[13]" xlink:title="Et0">
<ellipse fill="#d3d247" stroke="black" cx="1059" cy="-300" rx="27" ry="18"/>
<text text-anchor="middle" x="1059" y="-296.3" font-family="Times,serif" font-size="14.00">Et0</text>
</a>
</g>
</g>
<!-- Et0_0&#45;&gt;System_2_0_0009375 -->
<g id="edge5" class="edge">
<title>Et0_0&#45;&gt;System_2_0_0009375</title>
<path fill="none" stroke="#112c5f" stroke-width="2" d="M1038.47,-288.05C1033.51,-285.76 1028.16,-283.57 1023,-282 896.31,-243.44 740.06,-228.3 661.73,-222.82"/>
<polygon fill="#112c5f" stroke="#112c5f" stroke-width="2" points="661.87,-219.33 651.66,-222.14 661.4,-226.31 661.87,-219.33"/>
</g>
<!-- GammaE_0 -->
<g id="node7" class="node">
<title>GammaE_0</title>
<g id="a_node7"><a xlink:href="morph://MorpheusModel/Global/Constant[3]" xlink:title="GammaE">
<ellipse fill="#d3d247" stroke="black" cx="969" cy="-300" rx="44.69" ry="18"/>
<text text-anchor="middle" x="969" y="-296.3" font-family="Times,serif" font-size="14.00">GammaE</text>
</a>
</g>
</g>
<!-- GammaE_0&#45;&gt;System_2_0_0009375 -->
<g id="edge6" class="edge">
<title>GammaE_0&#45;&gt;System_2_0_0009375</title>
<path fill="none" stroke="#112c5f" stroke-width="2" d="M935.45,-287.85C928.72,-285.78 921.66,-283.72 915,-282 826.55,-259.09 721.82,-239.25 661.53,-228.51"/>
<polygon fill="#112c5f" stroke="#112c5f" stroke-width="2" points="661.98,-225.04 651.52,-226.74 660.76,-231.93 661.98,-225.04"/>
</g>
<!-- K_0 -->
<g id="node8" class="node">
<title>K_0</title>
<g id="a_node8"><a xlink:href="morph://MorpheusModel/Global/Constant[5]" xlink:title="K">
<ellipse fill="#d3d247" stroke="black" cx="879" cy="-300" rx="27" ry="18"/>
<text text-anchor="middle" x="879" y="-296.3" font-family="Times,serif" font-size="14.00">K</text>
</a>
</g>
</g>
<!-- K_0&#45;&gt;System_2_0_0009375 -->
<g id="edge7" class="edge">
<title>K_0&#45;&gt;System_2_0_0009375</title>
<path fill="none" stroke="#112c5f" stroke-width="2" d="M857.95,-288.29C853.11,-286.04 847.93,-283.81 843,-282 781.99,-259.61 709.23,-241.42 661.9,-230.67"/>
<polygon fill="#112c5f" stroke="#112c5f" stroke-width="2" points="662.43,-227.2 651.91,-228.42 660.9,-234.03 662.43,-227.2"/>
</g>
<!-- P_0 -->
<g id="node9" class="node">
<title>P_0</title>
<g id="a_node9"><a xlink:href="morph://MorpheusModel/Global/Field[0]" xlink:title="P">
<ellipse fill="#d3d247" stroke="black" cx="468" cy="-141" rx="27" ry="18"/>
<text text-anchor="middle" x="468" y="-137.3" font-family="Times,serif" font-size="14.00">P</text>
</a>
</g>
</g>
<!-- P_0&#45;&gt;Logger_0_6097416426442070905_1 -->
<g id="edge9" class="edge">
<title>P_0&#45;&gt;Logger_0_6097416426442070905_1</title>
<path fill="none" stroke="#112c5f" stroke-width="2" d="M480.54,-124.76C487.41,-116.41 496.31,-105.6 505.11,-94.9"/>
<polygon fill="#112c5f" stroke="#112c5f" stroke-width="2" points="507.83,-97.11 511.48,-87.16 502.42,-92.66 507.83,-97.11"/>
</g>
<!-- PI_0 -->
<g id="node10" class="node">
<title>PI_0</title>
<g id="a_node10"><a xlink:href="morph://MorpheusModel/Global/Field[4]" xlink:title="PI">
<ellipse fill="#d3d247" stroke="black" cx="540" cy="-141" rx="27" ry="18"/>
<text text-anchor="middle" x="540" y="-137.3" font-family="Times,serif" font-size="14.00">PI</text>
</a>
</g>
</g>
<!-- PI_0&#45;&gt;Logger_0_6097416426442070905_1 -->
<g id="edge8" class="edge">
<title>PI_0&#45;&gt;Logger_0_6097416426442070905_1</title>
<path fill="none" stroke="#112c5f" stroke-width="2" d="M540,-122.71C540,-115.33 540,-106.34 540,-97.29"/>
<polygon fill="#112c5f" stroke="#112c5f" stroke-width="2" points="543.5,-97.13 540,-87.13 536.5,-97.13 543.5,-97.13"/>
</g>
<!-- R_0 -->
<g id="node11" class="node">
<title>R_0</title>
<g id="a_node11"><a xlink:href="morph://MorpheusModel/Global/Field[1]" xlink:title="R">
<ellipse fill="#d3d247" stroke="black" cx="612" cy="-141" rx="27" ry="18"/>
<text text-anchor="middle" x="612" y="-137.3" font-family="Times,serif" font-size="14.00">R</text>
</a>
</g>
</g>
<!-- R_0&#45;&gt;Logger_0_6097416426442070905_1 -->
<g id="edge11" class="edge">
<title>R_0&#45;&gt;Logger_0_6097416426442070905_1</title>
<path fill="none" stroke="#112c5f" stroke-width="2" d="M599.46,-124.76C592.59,-116.41 583.69,-105.6 574.89,-94.9"/>
<polygon fill="#112c5f" stroke="#112c5f" stroke-width="2" points="577.58,-92.66 568.52,-87.16 572.17,-97.11 577.58,-92.66"/>
</g>
<!-- RI_0 -->
<g id="node12" class="node">
<title>RI_0</title>
<g id="a_node12"><a xlink:href="morph://MorpheusModel/Global/Field[3]" xlink:title="RI">
<ellipse fill="#d3d247" stroke="black" cx="684" cy="-141" rx="27" ry="18"/>
<text text-anchor="middle" x="684" y="-137.3" font-family="Times,serif" font-size="14.00">RI</text>
</a>
</g>
</g>
<!-- RI_0&#45;&gt;Logger_0_6097416426442070905_1 -->
<g id="edge10" class="edge">
<title>RI_0&#45;&gt;Logger_0_6097416426442070905_1</title>
<path fill="none" stroke="#112c5f" stroke-width="2" d="M664.58,-128.2C649.33,-118.93 627.16,-105.46 605.74,-92.45"/>
<polygon fill="#112c5f" stroke="#112c5f" stroke-width="2" points="607.31,-89.31 596.95,-87.1 603.68,-95.29 607.31,-89.31"/>
</g>
<!-- bR_0 -->
<g id="node13" class="node">
<title>bR_0</title>
<g id="a_node13"><a xlink:href="morph://MorpheusModel/Global/Constant[0]" xlink:title="bR">
<ellipse fill="#d3d247" stroke="black" cx="807" cy="-300" rx="27" ry="18"/>
<text text-anchor="middle" x="807" y="-296.3" font-family="Times,serif" font-size="14.00">bR</text>
</a>
</g>
</g>
<!-- bR_0&#45;&gt;System_2_0_0009375 -->
<g id="edge20" class="edge">
<title>bR_0&#45;&gt;System_2_0_0009375</title>
<path fill="none" stroke="#112c5f" stroke-width="2" d="M785.79,-288.69C780.96,-286.42 775.82,-284.08 771,-282 734.5,-266.29 692.6,-250.02 660.98,-238.09"/>
<polygon fill="#112c5f" stroke="#112c5f" stroke-width="2" points="662.11,-234.78 651.51,-234.54 659.64,-241.33 662.11,-234.78"/>
</g>
<!-- betaP_0 -->
<g id="node14" class="node">
<title>betaP_0</title>
<g id="a_node14"><a xlink:href="morph://MorpheusModel/Global/Constant[12]" xlink:title="betaP">
<ellipse fill="#d3d247" stroke="black" cx="731" cy="-300" rx="30.59" ry="18"/>
<text text-anchor="middle" x="731" y="-296.3" font-family="Times,serif" font-size="14.00">betaP</text>
</a>
</g>
</g>
<!-- betaP_0&#45;&gt;System_2_0_0009375 -->
<g id="edge21" class="edge">
<title>betaP_0&#45;&gt;System_2_0_0009375</title>
<path fill="none" stroke="#112c5f" stroke-width="2" d="M711.35,-285.95C696.24,-275.92 674.78,-261.67 655.66,-248.99"/>
<polygon fill="#112c5f" stroke="#112c5f" stroke-width="2" points="657.35,-245.9 647.08,-243.29 653.48,-251.74 657.35,-245.9"/>
</g>
<!-- betaR_0 -->
<g id="node15" class="node">
<title>betaR_0</title>
<g id="a_node15"><a xlink:href="morph://MorpheusModel/Global/Constant[11]" xlink:title="betaR">
<ellipse fill="#d3d247" stroke="black" cx="651" cy="-300" rx="31.4" ry="18"/>
<text text-anchor="middle" x="651" y="-296.3" font-family="Times,serif" font-size="14.00">betaR</text>
</a>
</g>
</g>
<!-- betaR_0&#45;&gt;System_2_0_0009375 -->
<g id="edge22" class="edge">
<title>betaR_0&#45;&gt;System_2_0_0009375</title>
<path fill="none" stroke="#112c5f" stroke-width="2" d="M642.73,-282.25C638.42,-273.51 632.99,-262.52 627.9,-252.21"/>
<polygon fill="#112c5f" stroke="#112c5f" stroke-width="2" points="630.93,-250.44 623.37,-243.02 624.65,-253.54 630.93,-250.44"/>
</g>
<!-- delta_0 -->
<g id="node16" class="node">
<title>delta_0</title>
<g id="a_node16"><a xlink:href="morph://MorpheusModel/Global/Constant[1]" xlink:title="delta">
<ellipse fill="#d3d247" stroke="black" cx="574" cy="-300" rx="27.9" ry="18"/>
<text text-anchor="middle" x="574" y="-296.3" font-family="Times,serif" font-size="14.00">delta</text>
</a>
</g>
</g>
<!-- delta_0&#45;&gt;System_2_0_0009375 -->
<g id="edge23" class="edge">
<title>delta_0&#45;&gt;System_2_0_0009375</title>
<path fill="none" stroke="#112c5f" stroke-width="2" d="M581.87,-282.63C586.07,-273.91 591.38,-262.87 596.37,-252.49"/>
<polygon fill="#112c5f" stroke="#112c5f" stroke-width="2" points="599.64,-253.77 600.82,-243.24 593.33,-250.73 599.64,-253.77"/>
</g>
<!-- dx_0 -->
<g id="node17" class="node">
<title>dx_0</title>
<ellipse fill="#d3d247" stroke="black" cx="226" cy="-219" rx="27" ry="18"/>
<text text-anchor="middle" x="226" y="-215.3" font-family="Times,serif" font-size="14.00">dx</text>
</g>
<!-- x_0 -->
<g id="node28" class="node">
<title>x_0</title>
<g id="a_node28"><a xlink:href="morph://MorpheusModel/Global/Function" xlink:title="x">
<ellipse fill="#d3d247" stroke="black" cx="226" cy="-141" rx="27" ry="18"/>
<text text-anchor="middle" x="226" y="-137.3" font-family="Times,serif" font-size="14.00">x</text>
</a>
</g>
</g>
<!-- dx_0&#45;&gt;x_0 -->
<g id="edge24" class="edge">
<title>dx_0&#45;&gt;x_0</title>
<path fill="none" stroke="#112c5f" stroke-width="2" d="M226,-200.75C226,-191.52 226,-179.93 226,-169.49"/>
<polygon fill="#112c5f" stroke="#112c5f" stroke-width="2" points="229.5,-169.18 226,-159.18 222.5,-169.18 229.5,-169.18"/>
</g>
<!-- epsilon_0 -->
<g id="node18" class="node">
<title>epsilon_0</title>
<g id="a_node18"><a xlink:href="morph://MorpheusModel/Global/Constant[4]" xlink:title="epsilon">
<ellipse fill="#d3d247" stroke="black" cx="492" cy="-300" rx="36.29" ry="18"/>
<text text-anchor="middle" x="492" y="-296.3" font-family="Times,serif" font-size="14.00">epsilon</text>
</a>
</g>
</g>
<!-- epsilon_0&#45;&gt;System_2_0_0009375 -->
<g id="edge25" class="edge">
<title>epsilon_0&#45;&gt;System_2_0_0009375</title>
<path fill="none" stroke="#112c5f" stroke-width="2" d="M519.43,-288.06C525.19,-285.92 531.26,-283.79 537,-282 550.99,-277.62 556.67,-281.93 569,-274 578,-268.21 585.94,-259.9 592.48,-251.52"/>
<polygon fill="#112c5f" stroke="#112c5f" stroke-width="2" points="595.48,-253.36 598.54,-243.21 589.82,-249.23 595.48,-253.36"/>
</g>
<!-- forcefield_0 -->
<g id="node19" class="node">
<title>forcefield_0</title>
<g id="a_node19"><a xlink:href="morph://MorpheusModel/Global/Field[6]" xlink:title="forcefield">
<ellipse fill="#d3d247" stroke="black" cx="774" cy="-141" rx="44.69" ry="18"/>
<text text-anchor="middle" x="774" y="-137.3" font-family="Times,serif" font-size="14.00">forcefield</text>
</a>
</g>
</g>
<!-- forcefield_0&#45;&gt;Logger_0_6097416426442070905_1 -->
<g id="edge26" class="edge">
<title>forcefield_0&#45;&gt;Logger_0_6097416426442070905_1</title>
<path fill="none" stroke="#112c5f" stroke-width="2" d="M742.44,-128.2C709.85,-116.01 657.81,-96.55 614.66,-80.42"/>
<polygon fill="#112c5f" stroke="#112c5f" stroke-width="2" points="615.63,-77.04 605.03,-76.82 613.17,-83.6 615.63,-77.04"/>
</g>
<!-- k0_0 -->
<g id="node20" class="node">
<title>k0_0</title>
<g id="a_node20"><a xlink:href="morph://MorpheusModel/Global/Constant[8]" xlink:title="k0">
<ellipse fill="#d3d247" stroke="black" cx="411" cy="-300" rx="27" ry="18"/>
<text text-anchor="middle" x="411" y="-296.3" font-family="Times,serif" font-size="14.00">k0</text>
</a>
</g>
</g>
<!-- k0_0&#45;&gt;System_2_0_0009375 -->
<g id="edge27" class="edge">
<title>k0_0&#45;&gt;System_2_0_0009375</title>
<path fill="none" stroke="#112c5f" stroke-width="2" d="M431.06,-287.91C436.12,-285.57 441.65,-283.39 447,-282 473.3,-275.19 544.92,-286.59 569,-274 578.9,-268.82 587.29,-260.26 593.96,-251.46"/>
<polygon fill="#112c5f" stroke="#112c5f" stroke-width="2" points="596.97,-253.25 599.82,-243.05 591.23,-249.25 596.97,-253.25"/>
</g>
<!-- k0c_0 -->
<g id="node21" class="node">
<title>k0c_0</title>
<g id="a_node21"><a xlink:href="morph://MorpheusModel/Global/Constant[14]" xlink:title="k0c">
<ellipse fill="#d3d247" stroke="black" cx="339" cy="-300" rx="27" ry="18"/>
<text text-anchor="middle" x="339" y="-296.3" font-family="Times,serif" font-size="14.00">k0c</text>
</a>
</g>
</g>
<!-- k0c_0&#45;&gt;System_2_0_0009375 -->
<g id="edge28" class="edge">
<title>k0c_0&#45;&gt;System_2_0_0009375</title>
<path fill="none" stroke="#112c5f" stroke-width="2" d="M359.04,-287.82C364.1,-285.48 369.63,-283.32 375,-282 395.95,-276.85 549.76,-283.77 569,-274 578.96,-268.94 587.37,-260.41 594.03,-251.6"/>
<polygon fill="#112c5f" stroke="#112c5f" stroke-width="2" points="597.05,-253.39 599.88,-243.18 591.31,-249.4 597.05,-253.39"/>
</g>
<!-- kE_0 -->
<g id="node22" class="node">
<title>kE_0</title>
<g id="a_node22"><a xlink:href="morph://MorpheusModel/Global/Constant[2]" xlink:title="kE">
<ellipse fill="#d3d247" stroke="black" cx="267" cy="-300" rx="27" ry="18"/>
<text text-anchor="middle" x="267" y="-296.3" font-family="Times,serif" font-size="14.00">kE</text>
</a>
</g>
</g>
<!-- kE_0&#45;&gt;System_2_0_0009375 -->
<g id="edge29" class="edge">
<title>kE_0&#45;&gt;System_2_0_0009375</title>
<path fill="none" stroke="#112c5f" stroke-width="2" d="M287.03,-287.77C292.09,-285.44 297.62,-283.29 303,-282 331.75,-275.1 542.56,-287.24 569,-274 578.99,-269 587.4,-260.48 594.07,-251.67"/>
<polygon fill="#112c5f" stroke="#112c5f" stroke-width="2" points="597.09,-253.45 599.91,-243.24 591.34,-249.46 597.09,-253.45"/>
</g>
<!-- n_0 -->
<g id="node23" class="node">
<title>n_0</title>
<g id="a_node23"><a xlink:href="morph://MorpheusModel/Global/Constant[7]" xlink:title="n">
<ellipse fill="#d3d247" stroke="black" cx="195" cy="-300" rx="27" ry="18"/>
<text text-anchor="middle" x="195" y="-296.3" font-family="Times,serif" font-size="14.00">n</text>
</a>
</g>
</g>
<!-- n_0&#45;&gt;System_2_0_0009375 -->
<g id="edge30" class="edge">
<title>n_0&#45;&gt;System_2_0_0009375</title>
<path fill="none" stroke="#112c5f" stroke-width="2" d="M215.02,-287.75C220.09,-285.41 225.62,-283.27 231,-282 267.56,-273.35 535.36,-290.71 569,-274 579,-269.03 587.42,-260.52 594.09,-251.71"/>
<polygon fill="#112c5f" stroke="#112c5f" stroke-width="2" points="597.11,-253.49 599.93,-243.27 591.36,-249.5 597.11,-253.49"/>
</g>
<!-- p_0 -->
<g id="node24" class="node">
<title>p_0</title>
<g id="a_node24"><a xlink:href="morph://MorpheusModel/Global/Constant[10]" xlink:title="p">
<ellipse fill="#d3d247" stroke="black" cx="123" cy="-300" rx="27" ry="18"/>
<text text-anchor="middle" x="123" y="-296.3" font-family="Times,serif" font-size="14.00">p</text>
</a>
</g>
</g>
<!-- p_0&#45;&gt;System_2_0_0009375 -->
<g id="edge31" class="edge">
<title>p_0&#45;&gt;System_2_0_0009375</title>
<path fill="none" stroke="#112c5f" stroke-width="2" d="M143.02,-287.73C148.08,-285.4 153.62,-283.26 159,-282 181.18,-276.8 548.58,-284.09 569,-274 579.1,-269.01 587.57,-260.41 594.26,-251.52"/>
<polygon fill="#112c5f" stroke="#112c5f" stroke-width="2" points="597.33,-253.24 600.12,-243.01 591.56,-249.26 597.33,-253.24"/>
</g>
<!-- plotR_0 -->
<g id="node25" class="node">
<title>plotR_0</title>
<g id="a_node25"><a xlink:href="morph://MorpheusModel/Global/Field[7]" xlink:title="plotR">
<ellipse fill="#d3d247" stroke="black" cx="867" cy="-141" rx="30.59" ry="18"/>
<text text-anchor="middle" x="867" y="-137.3" font-family="Times,serif" font-size="14.00">plotR</text>
</a>
</g>
</g>
<!-- plotR_0&#45;&gt;Logger_0_6097416426442070905_1 -->
<g id="edge32" class="edge">
<title>plotR_0&#45;&gt;Logger_0_6097416426442070905_1</title>
<path fill="none" stroke="#112c5f" stroke-width="2" d="M843.74,-129.09C838.62,-126.91 833.18,-124.75 828,-123 757.11,-99.07 673.89,-79.59 615.18,-67.22"/>
<polygon fill="#112c5f" stroke="#112c5f" stroke-width="2" points="615.75,-63.76 605.24,-65.14 614.32,-70.61 615.75,-63.76"/>
</g>
<!-- space_0 -->
<g id="node26" class="node">
<title>space_0</title>
<g id="a_node26"><a xlink:href="morph://MorpheusModel/Space/SpaceSymbol" xlink:title="space">
<ellipse fill="#b5b426" stroke="black" cx="47" cy="-300" rx="30.59" ry="18"/>
<text text-anchor="middle" x="47" y="-296.3" font-family="Times,serif" font-size="14.00">space</text>
</a>
</g>
</g>
<!-- space_x_0 -->
<g id="node27" class="node">
<title>space_x_0</title>
<ellipse fill="#d3d247" stroke="black" cx="109" cy="-219" rx="37.09" ry="18"/>
<text text-anchor="middle" x="109" y="-215.3" font-family="Times,serif" font-size="14.00">space.x</text>
</g>
<!-- space_0&#45;&gt;space_x_0 -->
<g id="edge33" class="edge">
<title>space_0&#45;&gt;space_x_0</title>
<path fill="none" stroke="#38568c" stroke-dasharray="5,2" d="M59.25,-283.39C69.98,-269.72 85.51,-249.94 96.35,-236.12"/>
</g>
<!-- space_x_0&#45;&gt;x_0 -->
<g id="edge34" class="edge">
<title>space_x_0&#45;&gt;x_0</title>
<path fill="none" stroke="#112c5f" stroke-width="2" d="M130.46,-204.06C149.74,-191.54 178.14,-173.09 198.96,-159.56"/>
<polygon fill="#112c5f" stroke="#112c5f" stroke-width="2" points="200.9,-162.48 207.38,-154.1 197.08,-156.61 200.9,-162.48"/>
</g>
<!-- x_0&#45;&gt;Logger_0_6097416426442070905_1 -->
<g id="edge35" class="edge">
<title>x_0&#45;&gt;Logger_0_6097416426442070905_1</title>
<path fill="none" stroke="#112c5f" stroke-width="2" d="M249.86,-132.26C259.23,-129.28 270.1,-125.9 280,-123 342.09,-104.82 413,-85.7 465.06,-71.97"/>
<polygon fill="#112c5f" stroke="#112c5f" stroke-width="2" points="466.11,-75.31 474.89,-69.38 464.32,-68.54 466.11,-75.31"/>
</g>
<!-- System_2_0_0009375&#45;&gt;E_0 -->
<g id="edge13" class="edge">
<title>System_2_0_0009375&#45;&gt;E_0</title>
<path fill="none" stroke="#8f100d" stroke-width="3" d="M584.01,-194.88C579.23,-191.81 574.14,-189.03 569,-187 478.57,-151.25 445.33,-186.32 352,-159 350.06,-158.43 348.09,-157.77 346.13,-157.05"/>
<polygon fill="#8f100d" stroke="#8f100d" stroke-width="3" points="347.08,-153.65 336.51,-153.03 344.39,-160.11 347.08,-153.65"/>
</g>
<!-- System_2_0_0009375&#45;&gt;ECM_0 -->
<g id="edge12" class="edge">
<title>System_2_0_0009375&#45;&gt;ECM_0</title>
<path fill="none" stroke="#8f100d" stroke-width="3" d="M583.39,-194.9C578.77,-191.91 573.89,-189.14 569,-187 512.08,-162.05 491.34,-177.47 432,-159 429.6,-158.25 427.16,-157.42 424.71,-156.52"/>
<polygon fill="#8f100d" stroke="#8f100d" stroke-width="3" points="425.98,-153.26 415.4,-152.87 423.43,-159.78 425.98,-153.26"/>
</g>
<!-- System_2_0_0009375&#45;&gt;P_0 -->
<g id="edge15" class="edge">
<title>System_2_0_0009375&#45;&gt;P_0</title>
<path fill="none" stroke="#8f100d" stroke-width="3" d="M581.53,-194.81C577.41,-192.04 573.16,-189.36 569,-187 541.64,-171.49 532.67,-171.94 504,-159 502.2,-158.19 500.36,-157.35 498.51,-156.49"/>
<polygon fill="#8f100d" stroke="#8f100d" stroke-width="3" points="499.81,-153.24 489.26,-152.19 496.85,-159.58 499.81,-153.24"/>
</g>
<!-- System_2_0_0009375&#45;&gt;PI_0 -->
<g id="edge14" class="edge">
<title>System_2_0_0009375&#45;&gt;PI_0</title>
<path fill="none" stroke="#8f100d" stroke-width="3" d="M590.01,-194.78C580.74,-185 570,-173.67 560.86,-164.02"/>
<polygon fill="#8f100d" stroke="#8f100d" stroke-width="3" points="563.35,-161.56 553.93,-156.7 558.27,-166.37 563.35,-161.56"/>
</g>
<!-- System_2_0_0009375&#45;&gt;R_0 -->
<g id="edge17" class="edge">
<title>System_2_0_0009375&#45;&gt;R_0</title>
<path fill="none" stroke="#8f100d" stroke-width="3" d="M612,-194.78C612,-186.68 612,-177.52 612,-169.12"/>
<polygon fill="#8f100d" stroke="#8f100d" stroke-width="3" points="615.5,-169.04 612,-159.04 608.5,-169.04 615.5,-169.04"/>
</g>
<!-- System_2_0_0009375&#45;&gt;RI_0 -->
<g id="edge16" class="edge">
<title>System_2_0_0009375&#45;&gt;RI_0</title>
<path fill="none" stroke="#8f100d" stroke-width="3" d="M633.99,-194.78C643.26,-185 654,-173.67 663.14,-164.02"/>
<polygon fill="#8f100d" stroke="#8f100d" stroke-width="3" points="665.73,-166.37 670.07,-156.7 660.65,-161.56 665.73,-166.37"/>
</g>
<!-- System_2_0_0009375&#45;&gt;forcefield_0 -->
<g id="edge18" class="edge">
<title>System_2_0_0009375&#45;&gt;forcefield_0</title>
<path fill="none" stroke="#8f100d" stroke-width="3" d="M651.63,-199.41C677.54,-187.25 711.18,-171.47 736.63,-159.53"/>
<polygon fill="#8f100d" stroke="#8f100d" stroke-width="3" points="738.38,-162.58 745.95,-155.16 735.41,-156.24 738.38,-162.58"/>
</g>
<!-- System_2_0_0009375&#45;&gt;plotR_0 -->
<g id="edge19" class="edge">
<title>System_2_0_0009375&#45;&gt;plotR_0</title>
<path fill="none" stroke="#8f100d" stroke-width="3" d="M651.54,-209.02C695.26,-198.67 767.51,-180.32 828,-159 830.09,-158.26 832.23,-157.46 834.38,-156.63"/>
<polygon fill="#8f100d" stroke="#8f100d" stroke-width="3" points="835.78,-159.84 843.71,-152.8 833.13,-153.36 835.78,-159.84"/>
</g>
</g>
</svg>
