<?xml version="1.0" encoding="UTF-8" standalone="no"?> <svg xmlns="http://www.w3.org/2000/svg" xmlns:xlink="http://www.w3.org/1999/xlink" width="1500pt" height="870pt" viewBox="0.00 0.00 1500 870">
<g id="graph0" class="graph" transform="translate(4, 866)">
<title>%0</title>
<polygon fill="#ffffff" stroke="transparent" points="-4,4 -4,-866 1496,-866 1496,4 -4,4"></polygon>
<g id="clust1" class="cluster">
<title>cluster</title>
<polygon fill="#234178" fill-opacity="0.184314" stroke="#000000" points="8,-8 8,-854 1484,-854 1484,-8 8,-8"></polygon>
<text text-anchor="middle" x="746" y="-837.4" font-family="Times,serif" font-size="14.00" fill="#000000">Global</text>
</g>
<g id="clust2" class="cluster">
<title>cluster_1</title>
<polygon fill="#234178" fill-opacity="0.184314" stroke="#000000" points="546,-456 546,-522 614,-522 614,-456 546,-456"></polygon>
</g>

<g id="clust4" class="cluster">
<title>cluster_3</title>
<polygon fill="#234178" fill-opacity="0.184314" stroke="#000000" points="546,-652.5 546,-729.3 806,-729.3 806,-652.5 546,-652.5"></polygon>
<text text-anchor="middle" x="676" y="-712.7" font-family="Times,serif" font-size="14.00" fill="#000000">CellType[medium]</text>
</g>
<g id="clust5" class="cluster">
<title>cluster_4</title>
<polygon fill="#234178" fill-opacity="0.184314" stroke="#000000" points="26,-463 26,-729.3 524,-729.3 524,-463 26,-463"></polygon>
<text text-anchor="middle" x="275" y="-712.7" font-family="Times,serif" font-size="14.00" fill="#000000">CellType[cell_secreting]</text>
</g><g id="clust6" class="cluster">
<title style="">cluster_6</title>
<polygon fill="#234178" fill-opacity="0.184314" stroke="#000000" points="157,-554 157,-620 225,-620 225,-554 157,-554" style=""></polygon>
</g>

<g id="clust7" class="cluster">
<title>cluster_5</title>
<polygon fill="#234178" fill-opacity="0.184314" stroke="#000000" points="984,-279 984,-762.6 1476,-762.6 1476,-279 984,-279"></polygon>
<text text-anchor="middle" x="1230" y="-746" font-family="Times,serif" font-size="14.00" fill="#000000" style="">CellType[cell_receiving]</text>
</g><g id="clust8" class="cluster">
<title style="">cluster_cpm5</title>
<polygon fill="#234178" fill-opacity="0.184314" stroke="#000000" points="1352,-652 1352,-729.8 1468,-729.8 1468,-652 1352,-652" style=""></polygon>
<text text-anchor="middle" x="1410" y="-713.2" font-family="Times,serif" font-size="14.00" fill="#000000" style="">CPM components</text>
</g>
<!-- CPM_0_1 --><g id="clust9" class="cluster">
<title style="">cluster_7</title>
<polygon fill="#234178" fill-opacity="0.184314" stroke="#000000" points="1118,-370 1118,-436 1186,-436 1186,-370 1118,-370" style=""></polygon>
</g>
<g id="node4" class="node">
<title>CPM_0_1</title>
<g id="a_node4">
<polygon fill="#fffea3" stroke="#000000" points="824,-771.1 824,-820.7 878,-820.7 878,-771.1 824,-771.1"></polygon>
<text text-anchor="middle" x="850.7819" y="-804.1" font-family="Times,serif" font-size="14.00" fill="#000000">CPM</text>
<polyline fill="none" stroke="#000000" points="824,-795.9 877.5638,-795.9 "></polyline>
<text text-anchor="middle" x="850.7819" y="-779.3" font-family="Times,serif" font-size="14.00" fill="#000000">1</text>
</g>
</g>
<!-- cell_center_0 --><g id="node1" class="node">
<title style="">Mapper_0_3461379510735590622_1</title>
<g id="a_node1">" style="">
<polygon fill="#fffea3" stroke="transparent" points="955.5,-342 844.5,-342 844.5,-268 955.5,-268 955.5,-342" style=""></polygon>
<text text-anchor="start" x="877.178" y="-324.5" font-family="times" font-size="15.00" fill="#000000" style="">Mapper</text>
<text text-anchor="start" x="848.8573" y="-301.5" font-family="times" font-style="italic" font-size="15.00" fill="#000000" style="">'U.total.external'</text>
<text text-anchor="start" x="896.75" y="-276.5" font-family="times" font-size="15.00" fill="#000000" style="">1</text>
<polygon fill="#000000" stroke="#000000" points="845,-293 845,-293 956,-293 956,-293 845,-293" style=""></polygon>
<polygon fill="none" stroke="#000000" points="844.5,-268 844.5,-342 955.5,-342 955.5,-268 844.5,-268" style=""></polygon>
</g>
</g>
<g id="node14" class="node">
<title>cell_center_0</title>
<ellipse fill="#b5b426" stroke="#000000" cx="667" cy="-587" rx="50.9588" ry="18"></ellipse>
<ellipse fill="none" stroke="#000000" cx="667" cy="-587" rx="54.9572" ry="22"></ellipse>
<text text-anchor="middle" x="667" y="-582.8" font-family="Times,serif" font-size="14.00" fill="#000000">cell.center</text>
</g>
<!-- CPM_0_1&#45;&gt;cell_center_0 --><g id="node11" class="node">
<title style="">U_total_external_0</title>
<g id="a_node11">
<ellipse fill="#d3d247" stroke="#000000" cx="660" cy="-210" rx="71.2036" ry="18" style=""></ellipse>
<text text-anchor="middle" x="660" y="-205.8" font-family="Times,serif" font-size="14.00" fill="#000000" style="">U.total.external</text>
</g>
</g>
<g id="edge2" class="edge">
<title>CPM_0_1-&gt;cell_center_0</title>
<path fill="none" stroke="#8f100d" stroke-width="3" d="M823.9438,-795.0096C752.0949,-792.3684 560.7015,-783.4252 542,-762.6 525.5783,-744.3135 528.7322,-672.6889 542,-652 558.1036,-626.8892 576.5025,-637.7025 603,-624 611.0345,-619.8452 619.4957,-615.1738 627.5398,-610.5851"></path>
<polygon fill="#8f100d" stroke="#8f100d" stroke-width="3" points="629.4883,-613.5017 636.3996,-605.4715 625.9891,-607.439 629.4883,-613.5017"></polygon>
</g>
<!-- cell_type_0 --><g id="edge6" class="edge">
<title style="">Mapper_0_3461379510735590622_1-&gt;U_total_external_0</title>
<path fill="none" stroke="#8f100d" stroke-width="3" d="M844.3442,-272.3918C841.2127,-270.8484 838.0844,-269.3728 835,-268 797.2077,-251.1791 752.9711,-236.5595 718.4295,-226.2058" style=""></path>
<polygon fill="#8f100d" stroke="#8f100d" stroke-width="3" points="719.0816,-222.7488 708.4994,-223.2664 717.0947,-229.4609 719.0816,-222.7488" style=""></polygon>
</g>
<g id="node15" class="node">
<title>cell_type_0</title>
<ellipse fill="#d3d247" stroke="#000000" cx="888" cy="-587" rx="44.0361" ry="18"></ellipse>
<ellipse fill="none" stroke="#000000" cx="888" cy="-587" rx="48.0377" ry="22"></ellipse>
<text text-anchor="middle" x="888" y="-582.8" font-family="Times,serif" font-size="14.00" fill="#000000">cell.type</text>
</g>
<!-- CPM_0_1&#45;&gt;cell_type_0 --><g id="node2" class="node">
<title style="">Mapper_0_14956948397767728913_1</title>
<g id="a_node2">" style="">
<polygon fill="#fffea3" stroke="transparent" points="826,-342 708,-342 708,-268 826,-268 826,-342" style=""></polygon>
<text text-anchor="start" x="743.678" y="-324.5" font-family="times" font-size="15.00" fill="#000000" style="">Mapper</text>
<text text-anchor="start" x="711.6073" y="-301.5" font-family="times" font-style="italic" font-size="15.00" fill="#000000" style="">'U.total.receiving'</text>
<text text-anchor="start" x="763.25" y="-276.5" font-family="times" font-size="15.00" fill="#000000" style="">1</text>
<polygon fill="#000000" stroke="#000000" points="708,-293 708,-293 826,-293 826,-293 708,-293" style=""></polygon>
<polygon fill="none" stroke="#000000" points="708,-268 708,-342 826,-342 826,-268 708,-268" style=""></polygon>
</g>
</g>
<g id="edge3" class="edge">
<title>CPM_0_1-&gt;cell_type_0</title>
<path fill="none" stroke="#8f100d" stroke-width="3" d="M850.3101,-771.0949C850.0559,-742.1252 851.3455,-692.9493 861,-652 863.7051,-640.5265 868.2055,-628.4701 872.764,-617.8992"></path>
<polygon fill="#8f100d" stroke="#8f100d" stroke-width="3" points="876.0059,-619.224 876.9169,-608.6684 869.6222,-616.3519 876.0059,-619.224"></polygon>
</g>
<!-- Chemotaxis_4 --><g id="node12" class="node">
<title style="">U_total_receiving_0</title>
<g id="a_node12">
<ellipse fill="#d3d247" stroke="#000000" cx="495" cy="-210" rx="75.8605" ry="18" style=""></ellipse>
<text text-anchor="middle" x="495" y="-205.8" font-family="Times,serif" font-size="14.00" fill="#000000" style="">U.total.receiving</text>
</g>
</g>

<!-- CPM_0_1&#45;&gt;Chemotaxis_4 --><g id="edge5" class="edge">
<title style="">Mapper_0_14956948397767728913_1-&gt;U_total_receiving_0</title>
<path fill="none" stroke="#8f100d" stroke-width="3" d="M707.9801,-284.3864C660.1349,-267.6758 593.3368,-244.3456 547.371,-228.2913" style=""></path>
<polygon fill="#8f100d" stroke="#8f100d" stroke-width="3" points="548.4877,-224.9741 537.8929,-224.981 546.1795,-231.5826 548.4877,-224.9741" style=""></polygon>
</g>

<!-- Gnuplotter_0_100 --><g id="node3" class="node">
<title style="">Mapper_0_13315321281765582996_1</title>
<g id="a_node3">" style="">
<polygon fill="#fffea3" stroke="transparent" points="534.5,-342 417.5,-342 417.5,-268 534.5,-268 534.5,-342" style=""></polygon>
<text text-anchor="start" x="453.178" y="-324.5" font-family="times" font-size="15.00" fill="#000000" style="">Mapper</text>
<text text-anchor="start" x="421.9405" y="-301.5" font-family="times" font-style="italic" font-size="15.00" fill="#000000" style="">'U.total.secreting'</text>
<text text-anchor="start" x="472.75" y="-276.5" font-family="times" font-size="15.00" fill="#000000" style="">1</text>
<polygon fill="#000000" stroke="#000000" points="418,-293 418,-293 535,-293 535,-293 418,-293" style=""></polygon>
<polygon fill="none" stroke="#000000" points="417.5,-268 417.5,-342 534.5,-342 534.5,-268 417.5,-268" style=""></polygon>
</g>
</g>

<!-- U_external_0 --><g id="node13" class="node">
<title style="">U_total_secreting_0</title>
<g id="a_node13">
<ellipse fill="#d3d247" stroke="#000000" cx="326" cy="-210" rx="74.7149" ry="18" style=""></ellipse>
<text text-anchor="middle" x="326" y="-205.8" font-family="Times,serif" font-size="14.00" fill="#000000" style="">U.total.secreting</text>
</g>
</g>
<g id="node7" class="node">
<title>U_external_0</title>
<g id="a_node7">
<ellipse fill="#d3d247" stroke="#000000" cx="922" cy="-678.5" rx="51.5426" ry="18"></ellipse>
<text text-anchor="middle" x="922" y="-674.3" font-family="Times,serif" font-size="14.00" fill="#000000">U.external</text>
</g>
</g>
<!-- U_external_0&#45;&gt;Gnuplotter_0_100 --><g id="edge4" class="edge">
<title style="">Mapper_0_13315321281765582996_1-&gt;U_total_secreting_0</title>
<path fill="none" stroke="#8f100d" stroke-width="3" d="M417.5766,-267.9985C398.6977,-256.0419 378.3438,-243.1511 361.6304,-232.5659" style=""></path>
<polygon fill="#8f100d" stroke="#8f100d" stroke-width="3" points="363.073,-229.3367 352.7521,-226.943 359.3276,-235.2505 363.073,-229.3367" style=""></polygon>
</g>

<!-- Mapper_4_12184331201545252660_1 -->

<!-- U_external_0&#45;&gt;Mapper_4_12184331201545252660_1 -->

<!-- U_external_0&#45;&gt;Chemotaxis_4 -->

<!-- U_internal_0 -->
<g id="node8" class="node">
<title>U_internal_0</title>
<ellipse fill="#d3d247" stroke="#000000" cx="566" cy="-403" rx="49.8427" ry="18"></ellipse>
<ellipse fill="none" stroke="#000000" cx="566" cy="-403" rx="53.8367" ry="22"></ellipse>
<text text-anchor="middle" x="566" y="-398.8" font-family="Times,serif" font-size="14.00" fill="#000000">U.internal</text>
</g>
<!-- U_internal_0&#45;&gt;Gnuplotter_0_100 -->

<!-- U_superthreshold_0 --><g id="node32" class="node">
<title style="">Chemotaxis_5</title>
<g id="a_node32">
<path fill="#fffea3" stroke="#000000" d="M1373.5589,-660.5C1373.5589,-660.5 1432.4411,-660.5 1432.4411,-660.5 1438.4411,-660.5 1444.4411,-666.5 1444.4411,-672.5 1444.4411,-672.5 1444.4411,-684.5 1444.4411,-684.5 1444.4411,-690.5 1438.4411,-696.5 1432.4411,-696.5 1432.4411,-696.5 1373.5589,-696.5 1373.5589,-696.5 1367.5589,-696.5 1361.5589,-690.5 1361.5589,-684.5 1361.5589,-684.5 1361.5589,-672.5 1361.5589,-672.5 1361.5589,-666.5 1367.5589,-660.5 1373.5589,-660.5" style=""></path>
<text text-anchor="middle" x="1403" y="-674.3" font-family="Times,serif" font-size="14.00" fill="#000000" style="">Chemotaxis</text>
</g>
</g>
<g id="node9" class="node">
<title>U_superthreshold_0</title>
<ellipse fill="#d3d247" stroke="#000000" cx="1132" cy="-210" rx="77.0606" ry="18"></ellipse>
<ellipse fill="none" stroke="#000000" cx="1132" cy="-210" rx="81.0495" ry="22"></ellipse>
<text text-anchor="middle" x="1132" y="-205.8" font-family="Times,serif" font-size="14.00" fill="#000000">U.superthreshold</text>
</g>
<!-- U_superthreshold_0&#45;&gt;Gnuplotter_0_100 --><g id="edge1" class="edge">
<title style="">CPM_0_1-&gt;Chemotaxis_5</title>
<path fill="none" stroke="#38568c" d="M878.1833,-795.6422C977.5699,-794.4933 1317.5454,-788.675 1358,-762.6 1370.1279,-754.783 1379.2132,-742.5443 1385.922,-729.7996"></path>
</g>

<!-- d_0 --><g id="node5" class="node">
<title style="">Gnuplotter_0_50</title>
<g id="a_node5">" style="">
<polygon fill="#fffea3" stroke="transparent" points="1011,-152 939,-152 939,-102 1011,-102 1011,-152" style=""></polygon>
<text text-anchor="start" x="942.507" y="-134.5" font-family="times" font-size="15.00" fill="#000000" style="">Gnuplotter</text>
<text text-anchor="start" x="967.5" y="-110.5" font-family="times" font-size="15.00" fill="#000000" style="">50</text>
<polygon fill="#000000" stroke="#000000" points="939,-127 939,-127 1011,-127 1011,-127 939,-127" style=""></polygon>
<polygon fill="none" stroke="#000000" points="939,-102 939,-152 1011,-152 1011,-102 939,-102" style=""></polygon>
</g>
</g>
<g id="node18" class="node">
<title>d_0</title>
<ellipse fill="#d3d247" stroke="#000000" cx="771" cy="-587" rx="27" ry="18"></ellipse>
<ellipse fill="none" stroke="#000000" cx="771" cy="-587" rx="31" ry="22"></ellipse>
<text text-anchor="middle" x="771" y="-582.8" font-family="Times,serif" font-size="14.00" fill="#000000">d</text>
</g>
<!-- System_1_1 --><g id="node6" class="node">
<title style="">Logger_0_1</title>
<g id="a_node6">" style="">
<polygon fill="#fffea3" stroke="transparent" points="518.5,-66 467.5,-66 467.5,-16 518.5,-16 518.5,-66" style=""></polygon>
<text text-anchor="start" x="471.8423" y="-48.5" font-family="times" font-size="15.00" fill="#000000" style="">Logger</text>
<text text-anchor="start" x="489.75" y="-24.5" font-family="times" font-size="15.00" fill="#000000" style="">1</text>
<polygon fill="#000000" stroke="#000000" points="468,-41 468,-41 519,-41 519,-41 468,-41" style=""></polygon>
<polygon fill="none" stroke="#000000" points="467.5,-16 467.5,-66 518.5,-66 518.5,-16 467.5,-16" style=""></polygon>
</g>
</g>

<!-- d_0&#45;&gt;System_1_1 -->

<!-- p_0 --><g id="edge14" class="edge">
<title style="">U_external_0-&gt;Mapper_0_3461379510735590622_1</title>
<path fill="none" stroke="#112c5f" stroke-width="2" d="M931.7839,-660.4232C936.8216,-650.0837 942.4334,-636.6829 945,-624 964.4283,-527.9949 936.2146,-414.0531 916.4508,-351.6461"></path>
<polygon fill="#112c5f" stroke="#112c5f" stroke-width="2" points="919.7659,-350.5221 913.3599,-342.0833 913.1051,-352.675 919.7659,-350.5221"></polygon>
</g>
<g id="node19" class="node">
<title>p_0</title>
<ellipse fill="#d3d247" stroke="#000000" cx="563" cy="-587" rx="27" ry="18"></ellipse>
<ellipse fill="none" stroke="#000000" cx="563" cy="-587" rx="31" ry="22"></ellipse>
<text text-anchor="middle" x="563" y="-582.8" font-family="Times,serif" font-size="14.00" fill="#000000">p</text>
</g>
<!-- p_0&#45;&gt;System_1_1 --><g id="edge13" class="edge">
<title style="">U_external_0-&gt;Gnuplotter_0_50</title>
<path fill="none" stroke="#112c5f" stroke-width="2" d="M934.3312,-660.6169C940.8533,-650.338 948.4344,-636.9333 953,-624 973.2362,-566.6755 975,-549.7915 975,-489 975,-489 975,-489 975,-305 975,-255.57 975,-198.4189 975,-162.4925"></path>
<polygon fill="#112c5f" stroke="#112c5f" stroke-width="2" points="978.5001,-162.0564 975,-152.0564 971.5001,-162.0564 978.5001,-162.0564"></polygon>
</g>

<!-- System_1_1&#45;&gt;U_external_0 --><g id="node31" class="node">
<title style="">Mapper_5_12184331201545252660_0_5</title>
<g id="a_node31">" style="">
<polygon fill="#fffea3" stroke="transparent" points="1161,-624 1069,-624 1069,-550 1161,-550 1161,-624" style=""></polygon>
<text text-anchor="start" x="1091.678" y="-606.5" font-family="times" font-size="15.00" fill="#000000" style="">Mapper</text>
<text text-anchor="start" x="1072.9385" y="-583.5" font-family="times" font-style="italic" font-size="15.00" fill="#000000" style="">'Uptake of U'</text>
<text text-anchor="start" x="1105.625" y="-558.5" font-family="times" font-size="15.00" fill="#000000" style="">0.5</text>
<polygon fill="#000000" stroke="#000000" points="1069,-575 1069,-575 1161,-575 1161,-575 1069,-575" style=""></polygon>
<polygon fill="none" stroke="#000000" points="1069,-550 1069,-624 1161,-624 1161,-550 1069,-550" style=""></polygon>
</g>
</g>

<!-- d_2 --><g id="edge15" class="edge">
<title style="">U_external_0-&gt;Mapper_5_12184331201545252660_0_5</title>
<path fill="none" stroke="#112c5f" stroke-width="2" d="M952.4317,-663.8327C961.2409,-659.7956 970.9291,-655.5538 980,-652 1013.996,-638.6812 1027.4385,-641.6275 1059.635,-626.4938"></path>
<polygon fill="#112c5f" stroke="#112c5f" stroke-width="2" points="1061.3382,-629.556 1068.7437,-621.9791 1058.2295,-623.2841 1061.3382,-629.556"></polygon>
</g>

<!-- d_2&#45;&gt;d_0 --><g id="edge12" class="edge">
<title style="">U_external_0-&gt;Chemotaxis_5</title>
<path fill="none" stroke="#112c5f" stroke-width="2" d="M927.6982,-696.4741C936.4368,-720.1268 955.7291,-759.5394 989,-766.6 1008.5643,-770.7518 1329.4357,-770.7518 1349,-766.6 1376.0575,-760.858 1390.1106,-730.0751 1397.0091,-706.4974"></path>
<polygon fill="#112c5f" stroke="#112c5f" stroke-width="2" points="1400.4513,-707.1703 1399.6205,-696.6081 1393.6833,-705.383 1400.4513,-707.1703"></polygon>
</g>

<!-- p_2 -->

<!-- p_2&#45;&gt;p_0 --><g id="edge18" class="edge">
<title style="">U_internal_0-&gt;Mapper_0_14956948397767728913_1</title>
<path fill="none" stroke="#112c5f" stroke-width="2" d="M601.4262,-386.401C627.1846,-374.263 662.8511,-357.3133 694,-342 695.5341,-341.2458 697.0852,-340.4808 698.6484,-339.7076"></path>
<polygon fill="#112c5f" stroke="#112c5f" stroke-width="2" points="700.3016,-342.7945 707.6983,-335.209 697.1857,-336.5262 700.3016,-342.7945"></polygon>
</g>

<!-- cell_center_3 --><g id="edge17" class="edge">
<title style="">U_internal_0-&gt;Mapper_0_13315321281765582996_1</title>
<path fill="none" stroke="#112c5f" stroke-width="2" d="M546.9133,-382.2167C538.1939,-372.7222 527.5054,-361.0837 517.0975,-349.7506"></path>
<polygon fill="#112c5f" stroke="#112c5f" stroke-width="2" points="519.664,-347.3708 510.322,-342.3729 514.5082,-352.1056 519.664,-347.3708"></polygon>
</g>

<!-- cell_center_3&#45;&gt;cell_center_0 --><g id="edge16" class="edge">
<title style="">U_internal_0-&gt;Gnuplotter_0_50</title>
<path fill="none" stroke="#112c5f" stroke-width="2" d="M583.1652,-381.7189C606.9485,-353.2059 652.2988,-302.2356 699,-268 773.6612,-213.2675 872.6278,-168.4175 929.5089,-144.8873"></path>
<polygon fill="#112c5f" stroke="#112c5f" stroke-width="2" points="931.0197,-148.0508 938.9454,-141.0199 928.3651,-141.5736 931.0197,-148.0508"></polygon>
</g>

<!-- cell_type_3 --><g id="node20" class="node">
<title style="">System_1_0_5</title>
<g id="a_node20">" style="">
<polygon fill="#fffea3" stroke="transparent" points="606,-514 554,-514 554,-464 606,-464 606,-514" style=""></polygon>
<text text-anchor="start" x="557.9163" y="-496.5" font-family="times" font-size="15.00" fill="#000000" style="">System</text>
<text text-anchor="start" x="570.625" y="-472.5" font-family="times" font-size="15.00" fill="#000000" style="">0.5</text>
<polygon fill="#000000" stroke="#000000" points="554,-489 554,-489 606,-489 606,-489 554,-489" style=""></polygon>
<polygon fill="none" stroke="#000000" points="554,-464 554,-514 606,-514 606,-464 554,-464" style=""></polygon>
</g>
</g>

<!-- cell_type_3&#45;&gt;cell_type_0 --><g id="edge19" class="edge">
<title style="">U_internal_0-&gt;System_1_0_5</title>
<path fill="none" stroke="#112c5f" stroke-width="2" d="M569.5736,-424.9518C571,-433.7144 572.6785,-444.0249 574.2669,-453.7823"></path>
<polygon fill="#112c5f" stroke="#112c5f" stroke-width="2" points="570.8139,-454.3546 575.8753,-463.6623 577.7229,-453.2298 570.8139,-454.3546"></polygon>
</g>

<!-- d_3 -->
<g id="node22" class="node">
<title>d_3</title>
<g id="a_node22">
<ellipse fill="#d3d247" stroke="#000000" cx="771" cy="-678.5" rx="27" ry="18"></ellipse>
<text text-anchor="middle" x="771" y="-674.3" font-family="Times,serif" font-size="14.00" fill="#000000">d</text>
</g>
</g>
<!-- d_3&#45;&gt;d_0 --><g id="edge23" class="edge">
<title style="">U_superthreshold_0-&gt;Gnuplotter_0_50</title>
<path fill="none" stroke="#112c5f" stroke-width="2" d="M1094.7932,-190.3302C1072.4588,-178.5228 1043.8901,-163.4196 1020.254,-150.9241"></path>
<polygon fill="#112c5f" stroke="#112c5f" stroke-width="2" points="1021.6047,-147.6792 1011.1283,-146.0997 1018.3331,-153.8676 1021.6047,-147.6792"></polygon>
</g>
<g id="edge45" class="edge">
<title>d_3-&gt;d_0</title>
<path fill="none" stroke="#38568c" stroke-dasharray="5,2" d="M771,-660.4225C771,-645.7355 771,-624.9537 771,-609.2463"></path>
</g>
<!-- p_3 --><g id="node10" class="node">
<title style="">U_total_0</title>
<g id="a_node10">
<ellipse fill="#d3d247" stroke="#000000" cx="522" cy="-127" rx="37.6768" ry="18" style=""></ellipse>
<text text-anchor="middle" x="522" y="-122.8" font-family="Times,serif" font-size="14.00" fill="#000000" style="">U.total</text>
</g>
</g>
<g id="node23" class="node">
<title>p_3</title>
<g id="a_node23">
<ellipse fill="#d3d247" stroke="#000000" cx="699" cy="-678.5" rx="27" ry="18"></ellipse>
<text text-anchor="middle" x="699" y="-674.3" font-family="Times,serif" font-size="14.00" fill="#000000">p</text>
</g>
</g>
<!-- p_3&#45;&gt;p_0 --><g id="edge26" class="edge">
<title style="">U_total_0-&gt;Logger_0_1</title>
<path fill="none" stroke="#112c5f" stroke-width="2" d="M515.9912,-109.1807C512.7576,-99.5915 508.6542,-87.4227 504.8117,-76.0279" style=""></path>
<polygon fill="#112c5f" stroke="#112c5f" stroke-width="2" points="508.0426,-74.6552 501.5307,-66.2978 501.4095,-76.892 508.0426,-74.6552" style=""></polygon>
</g>
<g id="edge50" class="edge">
<title>p_3-&gt;p_0</title>
<path fill="none" stroke="#38568c" stroke-dasharray="5,2" d="M681.5335,-664.5676C675.7937,-660.2849 669.2735,-655.723 663,-652 637.6933,-636.9817 627.4272,-640.41 603,-624 595.1476,-618.7248 587.3263,-611.9251 580.7101,-605.5969"></path>
</g>
<!-- U_uptake_4 --><g id="edge27" class="edge">
<title style="">U_total_external_0-&gt;Logger_0_1</title>
<path fill="none" stroke="#112c5f" stroke-width="2" d="M646.7828,-192.2634C629.8801,-170.0877 599.1733,-131.4625 569,-102 555.9681,-89.275 540.4564,-76.4649 526.8553,-65.8916" style=""></path>
<polygon fill="#112c5f" stroke="#112c5f" stroke-width="2" points="528.7384,-62.925 518.6729,-59.618 524.4792,-68.4802 528.7384,-62.925" style=""></polygon>
</g>

<!-- Mapper_4_12184331201545252660_1&#45;&gt;U_uptake_4 --><g id="edge28" class="edge">
<title style="">U_total_external_0-&gt;U_total_0</title>
<path fill="none" stroke="#112c5f" stroke-width="2" d="M632.4053,-193.4032C609.8077,-179.8119 577.8077,-160.5655 554.0724,-146.2899" style=""></path>
<polygon fill="#112c5f" stroke="#112c5f" stroke-width="2" points="555.7905,-143.239 545.4171,-141.0842 552.1827,-149.2377 555.7905,-143.239" style=""></polygon>
</g>

<!-- U_internal_4 --><g id="edge29" class="edge">
<title style="">U_total_receiving_0-&gt;Logger_0_1</title>
<path fill="none" stroke="#112c5f" stroke-width="2" d="M487.0009,-191.8622C482.4891,-180.6264 477.306,-165.7613 475,-152 471.3274,-130.0834 471.8227,-123.9939 475,-102 476.2482,-93.3598 478.4422,-84.2383 480.8789,-75.7567" style=""></path>
<polygon fill="#112c5f" stroke="#112c5f" stroke-width="2" points="484.2358,-76.7476 483.8086,-66.1614 477.5409,-74.7034 484.2358,-76.7476" style=""></polygon>
</g>

<!-- U_internal_4 -->
<g id="node24" class="node">
<title>U_internal_4</title>
<g id="a_node24">
<ellipse fill="#d3d247" stroke="#000000" cx="328" cy="-489" rx="49.8367" ry="18"></ellipse>
<text text-anchor="middle" x="328" y="-484.8" font-family="Times,serif" font-size="14.00" fill="#000000">U.internal</text>
</g>
</g>
<!-- U_internal_4&#45;&gt;U_internal_0 --><g id="edge30" class="edge">
<title style="">U_total_receiving_0-&gt;U_total_0</title>
<path fill="none" stroke="#112c5f" stroke-width="2" d="M500.8586,-191.9902C504.3967,-181.1138 508.979,-167.0276 512.9725,-154.7511" style=""></path>
<polygon fill="#112c5f" stroke="#112c5f" stroke-width="2" points="516.3876,-155.5669 516.1528,-144.9746 509.731,-153.4014 516.3876,-155.5669" style=""></polygon>
</g>

<!-- U_internal_4&#45;&gt;U_internal_0 -->
<g id="edge21" class="edge">
<title>U_internal_4-&gt;U_internal_0</title>
<path fill="none" stroke="#38568c" stroke-dasharray="5,2" d="M369.6929,-478.922C405.8674,-469.5971 459.3001,-454.4164 504,-436 514.3723,-431.7266 525.2968,-426.2627 535.0371,-421.016"></path>
</g>
<!-- U_superthreshold_4 --><g id="edge31" class="edge">
<title style="">U_total_secreting_0-&gt;Logger_0_1</title>
<path fill="none" stroke="#112c5f" stroke-width="2" d="M343.5563,-192.2335C371.3892,-164.0672 426.0601,-108.7416 460.9975,-73.3857" style=""></path>
<polygon fill="#112c5f" stroke="#112c5f" stroke-width="2" points="463.5972,-75.7344 468.1365,-66.1612 458.6181,-70.8142 463.5972,-75.7344" style=""></polygon>
</g>

<!-- U_superthreshold_4&#45;&gt;U_superthreshold_0 --><g id="edge32" class="edge">
<title style="">U_total_secreting_0-&gt;U_total_0</title>
<path fill="none" stroke="#112c5f" stroke-width="2" d="M363.3274,-194.193C398.0488,-179.4895 449.5224,-157.692 484.3478,-142.9446" style=""></path>
<polygon fill="#112c5f" stroke="#112c5f" stroke-width="2" points="485.8575,-146.1062 493.7011,-138.9837 483.1279,-139.6603 485.8575,-146.1062" style=""></polygon>
</g>

<!-- System_5_1 --><g id="edge38" class="edge">
<title style="">cell_type_0-&gt;Mapper_0_14956948397767728913_1</title>
<path fill="none" stroke="#112c5f" stroke-width="2" d="M894.4273,-565.048C905.2128,-523.5499 922.3246,-432.1874 885,-370 884.1488,-368.5817 860.9946,-355.7172 835.4206,-341.8026"></path>
<polygon fill="#112c5f" stroke="#112c5f" stroke-width="2" points="836.7648,-338.5498 826.3065,-336.8541 833.4247,-344.7016 836.7648,-338.5498"></polygon>
</g>

<!-- U_uptake_4&#45;&gt;System_5_1 --><g id="edge37" class="edge">
<title style="">cell_type_0-&gt;Mapper_0_13315321281765582996_1</title>
<path fill="none" stroke="#112c5f" stroke-width="2" d="M858.8305,-569.3204C796.7125,-531.5693 656.3962,-445.7135 649,-436 630.4317,-411.614 649.4776,-392.8063 629,-370 606.9996,-345.4977 574.2163,-329.9245 544.6327,-320.1884"></path>
<polygon fill="#112c5f" stroke="#112c5f" stroke-width="2" points="545.3313,-316.7402 534.7428,-317.1059 543.2483,-323.4231 545.3313,-316.7402"></polygon>
</g>

<!-- cell_center_4 --><g id="node16" class="node">
<title style="">celltype_cell_receiving_id_0</title>
<ellipse fill="#d3d247" stroke="#000000" cx="767" cy="-403" rx="108.7845" ry="18" style=""></ellipse>
<text text-anchor="middle" x="767" y="-398.8" font-family="Times,serif" font-size="14.00" fill="#000000" style="">celltype.cell_receiving.id</text>
</g>

<!-- cell_center_4 -->
<g id="node25" class="node">
<title>cell_center_4</title>
<ellipse fill="#b5b426" stroke="#000000" cx="287" cy="-678.5" rx="50.9572" ry="18"></ellipse>
<text text-anchor="middle" x="287" y="-674.3" font-family="Times,serif" font-size="14.00" fill="#000000">cell.center</text>
</g>
<!-- cell_center_4&#45;&gt;cell_center_0 --><g id="edge42" class="edge">
<title style="">celltype_cell_receiving_id_0-&gt;Mapper_0_14956948397767728913_1</title>
<path fill="none" stroke="#112c5f" stroke-width="2" d="M767,-384.5669C767,-375.304 767,-363.6147 767,-352.0686" style=""></path>
<polygon fill="#112c5f" stroke="#112c5f" stroke-width="2" points="770.5001,-352.0234 767,-342.0234 763.5001,-352.0234 770.5001,-352.0234" style=""></polygon>
</g>

<!-- cell_center_4&#45;&gt;cell_center_0 -->
<g id="edge34" class="edge">
<title>cell_center_4-&gt;cell_center_0</title>
<path fill="none" stroke="#38568c" stroke-dasharray="5,2" d="M315.9476,-663.5695C325.5961,-659.1793 336.5523,-654.8064 347,-652 457.5378,-622.3077 494.2308,-659.6303 603,-624 615.6845,-619.8449 628.6253,-612.9593 639.5208,-606.2476"></path>
</g>
<!-- cell_center_4&#45;&gt;Mapper_4_12184331201545252660_1 --><g id="node17" class="node">
<title style="">celltype_cell_secreting_id_0</title>
<ellipse fill="#d3d247" stroke="#000000" cx="387" cy="-403" rx="107.6386" ry="18" style=""></ellipse>
<text text-anchor="middle" x="387" y="-398.8" font-family="Times,serif" font-size="14.00" fill="#000000" style="">celltype.cell_secreting.id</text>
</g>

<!-- cell_type_4 --><g id="edge43" class="edge">
<title style="">celltype_cell_secreting_id_0-&gt;Mapper_0_13315321281765582996_1</title>
<path fill="none" stroke="#112c5f" stroke-width="2" d="M403.324,-385.0253C412.3004,-375.1411 423.8753,-362.3958 435.1374,-349.9948" style=""></path>
<polygon fill="#112c5f" stroke="#112c5f" stroke-width="2" points="437.9511,-352.1025 442.0831,-342.3466 432.7692,-347.3964 437.9511,-352.1025" style=""></polygon>
</g>

<!-- cell_type_4 -->
<g id="node26" class="node">
<title>cell_type_4</title>
<g id="a_node26">
<ellipse fill="#d3d247" stroke="#000000" cx="472" cy="-678.5" rx="44.0377" ry="18"></ellipse>
<text text-anchor="middle" x="472" y="-674.3" font-family="Times,serif" font-size="14.00" fill="#000000">cell.type</text>
</g>
</g>
<!-- cell_type_4&#45;&gt;cell_type_0 -->

<!-- cell_type_4&#45;&gt;cell_type_0 -->
<g id="edge39" class="edge">
<title>cell_type_4-&gt;cell_type_0</title>
<path fill="none" stroke="#38568c" stroke-dasharray="5,2" d="M502.1304,-665.1407C514.2925,-660.2674 528.5974,-655.1778 542,-652 658.9588,-624.2684 695.3422,-656.7362 811,-624 827.2686,-619.3953 844.3173,-611.5544 858.2252,-604.2727"></path>
</g>
<!-- d_4 --><g id="edge44" class="edge">
<title style="">d_0-&gt;System_1_0_5</title>
<path fill="none" stroke="#112c5f" stroke-width="2" d="M754.6366,-568.2265C747.9266,-561.573 739.6947,-554.6034 731,-550 682.2167,-524.1717 657.6206,-549.914 610,-522 609.211,-521.5375 608.4309,-521.0474 607.6605,-520.5332"></path>
<polygon fill="#112c5f" stroke="#112c5f" stroke-width="2" points="609.8172,-517.7764 599.8211,-514.2651 605.4458,-523.2437 609.8172,-517.7764"></polygon>
</g>

<!-- cell_volume_4 -->
<g id="node27" class="node">
<title style="">cell_volume_4</title>
<ellipse fill="#d3d247" stroke="#000000" cx="90" cy="-678.5" rx="56.2192" ry="18" style=""></ellipse>
<text text-anchor="middle" x="90" y="-674.3" font-family="Times,serif" font-size="14.00" fill="#000000" style="">cell.volume</text>
</g>
<!-- System_6_0_1 -->
<g id="node30" class="node">
<title style="">System_6_0_1</title>
<g id="a_node30">" style="">
<polygon fill="#fffea3" stroke="transparent" points="217,-612 165,-612 165,-562 217,-562 217,-612" style=""></polygon>
<text text-anchor="start" x="168.9163" y="-594.5" font-family="times" font-size="15.00" fill="#000000" style="">System</text>
<text text-anchor="start" x="181.625" y="-570.5" font-family="times" font-size="15.00" fill="#000000" style="">0.1</text>
<polygon fill="#000000" stroke="#000000" points="165,-587 165,-587 217,-587 217,-587 165,-587" style=""></polygon>
<polygon fill="none" stroke="#000000" points="165,-562 165,-612 217,-612 217,-562 165,-562" style=""></polygon>
</g>
</g>
<!-- cell_volume_4&#45;&gt;System_6_0_1 -->
<g id="edge41" class="edge">
<title style="">cell_volume_4-&gt;System_6_0_1</title>
<path fill="none" stroke="#112c5f" stroke-width="2" d="M108.9973,-661.2895C122.5509,-649.0108 141.1453,-632.1654 157.2014,-617.6196" style=""></path>
<polygon fill="#112c5f" stroke="#112c5f" stroke-width="2" points="159.7852,-620.0015 164.8463,-610.6937 155.0854,-614.8138 159.7852,-620.0015" style=""></polygon>
</g>
<!-- d_4 -->
<g id="node28" class="node">
<title>d_4</title>
<g id="a_node28">
<ellipse fill="#d3d247" stroke="#000000" cx="383" cy="-678.5" rx="27" ry="18"></ellipse>
<text text-anchor="middle" x="383" y="-674.3" font-family="Times,serif" font-size="14.00" fill="#000000">d</text>
</g>
</g>
<!-- d_4&#45;&gt;d_0 -->

<!-- d_4&#45;&gt;d_0 -->
<g id="edge46" class="edge">
<title>d_4-&gt;d_0</title>
<path fill="none" stroke="#38568c" stroke-dasharray="5,2" d="M399.0843,-663.7553C404.9448,-659.2084 411.8875,-654.6937 419,-652 549.1995,-602.6908 603.7618,-680.5132 731,-624 740.1642,-619.9297 748.5971,-612.8866 755.3333,-606.0303"></path>
</g>
<!-- d_4&#45;&gt;Mapper_4_12184331201545252660_1 --><g id="edge49" class="edge">
<title style="">p_0-&gt;System_1_0_5</title>
<path fill="none" stroke="#112c5f" stroke-width="2" d="M566.8576,-564.7623C568.9341,-552.7918 571.5438,-537.7475 573.8893,-524.2262"></path>
<polygon fill="#112c5f" stroke="#112c5f" stroke-width="2" points="577.3575,-524.7104 575.6183,-514.2593 570.4605,-523.5139 577.3575,-524.7104"></polygon>
</g>

<!-- p_4 --><g id="edge8" class="edge">
<title style="">System_1_0_5-&gt;U_external_0</title>
<path fill="none" stroke="#8f100d" stroke-width="3" d="M599.3003,-514.2473C602.5731,-517.2582 606.1655,-519.9759 610,-522 689.7648,-564.1057 743.3464,-490.3485 811,-550 836.5542,-572.5316 810.4478,-596.8284 831,-624 842.9041,-639.7381 860.7865,-651.8498 877.5568,-660.6135" style=""></path>
<polygon fill="#8f100d" stroke="#8f100d" stroke-width="3" points="876.1986,-663.8463 886.7142,-665.1396 879.3002,-657.571 876.1986,-663.8463" style=""></polygon>
</g>

<!-- p_4 -->
<g id="node29" class="node">
<title>p_4</title>
<g id="a_node29">
<ellipse fill="#d3d247" stroke="#000000" cx="191" cy="-678.5" rx="27" ry="18"></ellipse>
<text text-anchor="middle" x="191" y="-674.3" font-family="Times,serif" font-size="14.00" fill="#000000">p</text>
</g>
</g>
<!-- p_4&#45;&gt;p_0 --><g id="node21" class="node">
<title style="">U_internal_3</title>
<g id="a_node21">
<ellipse fill="#d3d247" stroke="#000000" cx="604" cy="-678.5" rx="49.8367" ry="18" style=""></ellipse>
<text text-anchor="middle" x="604" y="-674.3" font-family="Times,serif" font-size="14.00" fill="#000000" style="">U.internal</text>
</g>
</g>

<!-- p_4&#45;&gt;p_0 -->
<g id="edge52" class="edge">
<title>p_4-&gt;p_0</title>
<path fill="none" stroke="#38568c" stroke-dasharray="5,2" d="M207.612,-663.8875C213.407,-659.4629 220.1756,-654.989 227,-652 332.5816,-605.7562 471.0991,-592.2725 532.0006,-588.4537"></path>
</g>
<!-- System_5_1&#45;&gt;U_internal_4 --><g id="edge20" class="edge">
<title style="">U_internal_3-&gt;U_internal_0</title>
<path fill="none" stroke="#38568c" stroke-dasharray="5,2" d="M570.8614,-664.8348C557.7315,-659.9818 542.3649,-654.987 528,-652 364.3695,-617.9752 308.938,-684.133 153,-624 64.6575,-589.9332 -43.5487,-524.325 22,-456 59.1081,-417.3202 452.2736,-450.054 504,-436 515.414,-432.8988 527.0797,-427.4099 537.1676,-421.788" style=""></path>
</g>

<!-- System_5_1&#45;&gt;U_superthreshold_4 -->

<!-- U_threshold_5 -->

<!-- p_4&#45;&gt;System_6_0_1 -->
<g id="edge51" class="edge">
<title style="">p_4-&gt;System_6_0_1</title>
<path fill="none" stroke="#112c5f" stroke-width="2" d="M191,-660.4225C191,-649.5732 191,-635.3982 191,-622.3996"></path>
<polygon fill="#112c5f" stroke="#112c5f" stroke-width="2" points="194.5001,-622.3132 191,-612.3132 187.5001,-622.3133 194.5001,-622.3132"></polygon>
</g>
<!-- System_6_0_1&#45;&gt;U_internal_4 -->
<g id="edge9" class="edge">
<title style="">System_6_0_1-&gt;U_internal_4</title>
<path fill="none" stroke="#8f100d" stroke-width="3" d="M209.077,-561.8355C212.746,-557.6024 216.7827,-553.4648 221,-550 241.5844,-533.0881 250.8449,-535.1746 274,-522 280.5653,-518.2646 287.4988,-514.1554 294.1294,-510.1428" style=""></path>
<polygon fill="#8f100d" stroke="#8f100d" stroke-width="3" points="296.2096,-512.9735 302.9202,-504.7749 292.5615,-506.9993 296.2096,-512.9735" style=""></polygon>
</g>
<!-- U_uptake_5 -->
<g id="node36" class="node">
<title style="">U_uptake_5</title>
<g id="a_node36">
<ellipse fill="#d3d247" stroke="#000000" cx="1115" cy="-489" rx="46.3298" ry="18" style=""></ellipse>
<text text-anchor="middle" x="1115" y="-484.8" font-family="Times,serif" font-size="14.00" fill="#000000" style="">U.uptake</text>
</g>
</g>
<!-- Mapper_5_12184331201545252660_0_5&#45;&gt;U_uptake_5 -->
<g id="edge7" class="edge">
<title style="">Mapper_5_12184331201545252660_0_5-&gt;U_uptake_5</title>
<path fill="none" stroke="#8f100d" stroke-width="3" d="M1115,-549.9504C1115,-539.0886 1115,-527.3926 1115,-517.1791" style=""></path>
<polygon fill="#8f100d" stroke="#8f100d" stroke-width="3" points="1118.5001,-517.1693 1115,-507.1694 1111.5001,-517.1694 1118.5001,-517.1693" style=""></polygon>
</g>
<!-- U_internal_5 -->
<g id="node33" class="node">
<title style="">U_internal_5</title>
<g id="a_node33">
<ellipse fill="#d3d247" stroke="#000000" cx="1044" cy="-305" rx="49.8367" ry="18" style=""></ellipse>
<text text-anchor="middle" x="1044" y="-300.8" font-family="Times,serif" font-size="14.00" fill="#000000" style="">U.internal</text>
</g>
</g>
<!-- U_internal_5&#45;&gt;U_internal_0 -->
<g id="edge22" class="edge">
<title style="">U_internal_5-&gt;U_internal_0</title>
<path fill="none" stroke="#38568c" stroke-dasharray="5,2" d="M1024.8585,-321.7504C1015.0969,-329.2993 1002.6366,-337.5112 990,-342 846.7065,-392.9012 797.055,-335.3062 649,-370 632.8452,-373.7856 615.6949,-380.1717 601.2035,-386.3231" style=""></path>
</g>
<!-- U_superthreshold_5 -->
<g id="node34" class="node">
<title style="">U_superthreshold_5</title>
<g id="a_node34">
<ellipse fill="#d3d247" stroke="#000000" cx="1189" cy="-305" rx="77.0496" ry="18" style=""></ellipse>
<text text-anchor="middle" x="1189" y="-300.8" font-family="Times,serif" font-size="14.00" fill="#000000" style="">U.superthreshold</text>
</g>
</g>
<!-- U_superthreshold_5&#45;&gt;U_superthreshold_0 -->
<g id="edge24" class="edge">
<title style="">U_superthreshold_5-&gt;U_superthreshold_0</title>
<path fill="none" stroke="#38568c" stroke-dasharray="5,2" d="M1178.2787,-287.1312C1168.862,-271.4367 1155.1338,-248.5563 1145.0747,-231.7912" style=""></path>
</g>
<!-- U_threshold_5 -->
<g id="node35" class="node">
<title>U_threshold_5</title>
<g id="a_node35">
<ellipse fill="#d3d247" stroke="#000000" cx="1236" cy="-489" rx="56.2212" ry="18"></ellipse>
<text text-anchor="middle" x="1236" y="-484.8" font-family="Times,serif" font-size="14.00" fill="#000000">U.threshold</text>
</g>
</g>
<!-- U_threshold_5&#45;&gt;System_5_1 -->


<!-- System_7_0_1 -->
<g id="node41" class="node">
<title style="">System_7_0_1</title>
<g id="a_node41">" style="">
<polygon fill="#fffea3" stroke="transparent" points="1178,-428 1126,-428 1126,-378 1178,-378 1178,-428" style=""></polygon>
<text text-anchor="start" x="1129.9163" y="-410.5" font-family="times" font-size="15.00" fill="#000000" style="">System</text>
<text text-anchor="start" x="1142.625" y="-386.5" font-family="times" font-size="15.00" fill="#000000" style="">0.1</text>
<polygon fill="#000000" stroke="#000000" points="1126,-403 1126,-403 1178,-403 1178,-403 1126,-403" style=""></polygon>
<polygon fill="none" stroke="#000000" points="1126,-378 1126,-428 1178,-428 1178,-378 1126,-378" style=""></polygon>
</g>
</g>
<!-- U_threshold_5&#45;&gt;System_7_0_1 -->
<g id="edge25" class="edge">
<title style="">U_threshold_5-&gt;System_7_0_1</title>
<path fill="none" stroke="#112c5f" stroke-width="2" d="M1219.0013,-471.5966C1208.9176,-461.2727 1195.8107,-447.8538 1183.8667,-435.6254"></path>
<polygon fill="#112c5f" stroke="#112c5f" stroke-width="2" points="1186.1088,-432.9118 1176.6175,-428.2036 1181.1011,-437.803 1186.1088,-432.9118"></polygon>
</g>
<!-- U_uptake_5&#45;&gt;System_7_0_1 -->
<g id="edge33" class="edge">
<title style="">U_uptake_5-&gt;System_7_0_1</title>
<path fill="none" stroke="#112c5f" stroke-width="2" d="M1122.6664,-471.1807C1126.8337,-461.4947 1132.1333,-449.1766 1137.0783,-437.6829" style=""></path>
<polygon fill="#112c5f" stroke="#112c5f" stroke-width="2" points="1140.379,-438.867 1141.1161,-428.2978 1133.9488,-436.1005 1140.379,-438.867" style=""></polygon>
</g>
<!-- cell_center_5 -->
<g id="node37" class="node">
<title style="">cell_center_5</title>
<ellipse fill="#b5b426" stroke="#000000" cx="1115" cy="-678.5" rx="50.9572" ry="18" style=""></ellipse>
<text text-anchor="middle" x="1115" y="-674.3" font-family="Times,serif" font-size="14.00" fill="#000000" style="">cell.center</text>
</g>
<!-- cell_center_5&#45;&gt;cell_center_0 -->
<g id="edge36" class="edge">
<title style="">cell_center_5-&gt;cell_center_0</title>
<path fill="none" stroke="#38568c" stroke-dasharray="5,2" d="M1086.3936,-663.5673C1076.674,-659.1213 1065.5892,-654.7158 1055,-652 914.9943,-616.0935 868.8576,-667.4299 731,-624 718.1467,-619.9508 705.0705,-612.9987 694.1166,-606.2063" style=""></path>
</g>
<!-- cell_center_5&#45;&gt;Mapper_5_12184331201545252660_0_5 -->
<g id="edge35" class="edge">
<title style="">cell_center_5-&gt;Mapper_5_12184331201545252660_0_5</title>
<path fill="none" stroke="#112c5f" stroke-width="2" d="M1115,-660.4225C1115,-652.8495 1115,-643.6561 1115,-634.3734" style=""></path>
<polygon fill="#112c5f" stroke="#112c5f" stroke-width="2" points="1118.5001,-634.3382 1115,-624.3382 1111.5001,-634.3382 1118.5001,-634.3382" style=""></polygon>
</g>
<!-- cell_type_5 -->
<g id="node38" class="node">
<title style="">cell_type_5</title>
<g id="a_node38">
<ellipse fill="#d3d247" stroke="#000000" cx="1228" cy="-678.5" rx="44.0377" ry="18" style=""></ellipse>
<text text-anchor="middle" x="1228" y="-674.3" font-family="Times,serif" font-size="14.00" fill="#000000" style="">cell.type</text>
</g>
</g>
<!-- cell_type_5&#45;&gt;cell_type_0 -->
<g id="edge40" class="edge">
<title style="">cell_type_5-&gt;cell_type_0</title>
<path fill="none" stroke="#38568c" stroke-dasharray="5,2" d="M1202.5467,-663.7012C1194.0309,-659.3188 1184.3275,-654.9174 1175,-652 1091.4364,-625.8638 1064.5563,-646.72 980,-624 960.2153,-618.6839 938.9448,-610.3152 921.845,-602.8805" style=""></path>
</g>
<!-- d_5 -->
<g id="node39" class="node">
<title style="">d_5</title>
<g id="a_node39">
<ellipse fill="#d3d247" stroke="#000000" cx="1317" cy="-678.5" rx="27" ry="18" style=""></ellipse>
<text text-anchor="middle" x="1317" y="-674.3" font-family="Times,serif" font-size="14.00" fill="#000000" style="">d</text>
</g>
</g>
<!-- d_5&#45;&gt;d_0 -->
<g id="edge48" class="edge">
<title style="">d_5-&gt;d_0</title>
<path fill="none" stroke="#38568c" stroke-dasharray="5,2" d="M1300.957,-663.6438C1295.0998,-659.088 1288.1487,-654.5961 1281,-652 1092.6488,-583.599 1021.9956,-684.6263 831,-624 817.0026,-619.5569 802.9442,-611.1493 791.9575,-603.4702" style=""></path>
</g>
<!-- d_5&#45;&gt;Mapper_5_12184331201545252660_0_5 -->
<g id="edge47" class="edge">
<title style="">d_5-&gt;Mapper_5_12184331201545252660_0_5</title>
<path fill="none" stroke="#112c5f" stroke-width="2" d="M1299.6715,-664.3264C1293.9391,-660.0308 1287.3884,-655.5223 1281,-652 1245.8476,-632.6185 1203.7059,-616.1917 1170.6795,-604.7005" style=""></path>
<polygon fill="#112c5f" stroke="#112c5f" stroke-width="2" points="1171.7758,-601.3764 1161.1811,-601.4436 1169.5053,-607.9979 1171.7758,-601.3764" style=""></polygon>
</g>
<!-- p_5 -->
<g id="node40" class="node">
<title style="">p_5</title>
<g id="a_node40">
<ellipse fill="#d3d247" stroke="#000000" cx="1019" cy="-678.5" rx="27" ry="18" style=""></ellipse>
<text text-anchor="middle" x="1019" y="-674.3" font-family="Times,serif" font-size="14.00" fill="#000000" style="">p</text>
</g>
</g>
<!-- p_5&#45;&gt;p_0 -->
<g id="edge53" class="edge">
<title style="">p_5-&gt;p_0</title>
<path fill="none" stroke="#38568c" stroke-dasharray="5,2" d="M1004.8649,-663.1343C999.9707,-658.775 994.1559,-654.53 988,-652 829.3164,-586.782 760.3763,-692.3124 603,-624 593.8018,-620.0073 585.3629,-612.9775 578.6316,-606.1102" style=""></path>
</g>
<!-- System_7_0_1&#45;&gt;U_internal_5 -->
<g id="edge10" class="edge">
<title style="">System_7_0_1-&gt;U_internal_5</title>
<path fill="none" stroke="#8f100d" stroke-width="3" d="M1129.7502,-377.787C1127.1885,-375.1074 1124.5721,-372.4637 1122,-370 1106.5331,-355.1854 1088.1779,-339.7916 1073.1599,-327.7054" style=""></path>
<polygon fill="#8f100d" stroke="#8f100d" stroke-width="3" points="1075.1997,-324.8554 1065.1995,-321.3559 1070.8347,-330.3278 1075.1997,-324.8554" style=""></polygon>
</g>
<!-- System_7_0_1&#45;&gt;U_superthreshold_5 -->
<g id="edge11" class="edge">
<title style="">System_7_0_1-&gt;U_superthreshold_5</title>
<path fill="none" stroke="#8f100d" stroke-width="3" d="M1161.5284,-377.7626C1166.7318,-363.9806 1173.1846,-346.8894 1178.5285,-332.7352" style=""></path>
<polygon fill="#8f100d" stroke="#8f100d" stroke-width="3" points="1181.9322,-333.6288 1182.1901,-323.0371 1175.3834,-331.1563 1181.9322,-333.6288" style=""></polygon>
</g>
</g>
</svg>