{
	"info": {
		"_postman_id": "af561b28-8cb9-44dd-95b8-e5fcbf096222",
		"name": "TaxiApi",
		"schema": "https://schema.getpostman.com/json/collection/v2.1.0/collection.json"
	},
	"item": [
		{
			"name": "Client",
			"item": [
				{
					"name": "User",
					"item": [
						{
							"name": "Login",
							"request": {
								"auth": {
									"type": "noauth"
								},
								"method": "POST",
								"header": [
									{
										"key": "Content-Type",
										"name": "Content-Type",
										"type": "text",
										"value": "application/json"
									}
								],
								"body": {
									"mode": "raw",
									"raw": "{\n\t\"Login\": \"testClient\",\n\t\"Password\": \"123testClient\"\n}",
									"options": {
										"raw": {
											"language": "json"
										}
									}
								},
								"url": {
									"raw": "http://morozzz689.tplinkdns.com:5041/client/user/login",
									"protocol": "http",
									"host": [
										"morozzz689",
										"tplinkdns",
										"com"
									],
									"port": "5041",
									"path": [
										"client",
										"user",
										"login"
									]
								}
							},
							"response": []
						},
						{
							"name": "Register",
							"request": {
								"auth": {
									"type": "noauth"
								},
								"method": "POST",
								"header": [
									{
										"key": "Content-Type",
										"name": "Content-Type",
										"value": "application/json",
										"type": "text"
									}
								],
								"body": {
									"mode": "raw",
									"raw": "{\n\t\"Login\": \"testClient\",\n\t\"Password\": \"123testClient\",\n\t\"Email\": \"testClient@mail.ru\",\n\t\"Phone\": \"88005553535\",\n\t\"FirstName\": \"test\",\n\t\"LastName\": \"client\",\n\t\"Gender\": \"Male\"\n}",
									"options": {
										"raw": {
											"language": "json"
										}
									}
								},
								"url": {
									"raw": "http://morozzz689.tplinkdns.com:5041/client/user/register",
									"protocol": "http",
									"host": [
										"morozzz689",
										"tplinkdns",
										"com"
									],
									"port": "5041",
									"path": [
										"client",
										"user",
										"register"
									]
								}
							},
							"response": []
						},
						{
							"name": "Update",
							"request": {
								"method": "POST",
								"header": [
									{
										"key": "Content-Type",
										"name": "Content-Type",
										"type": "text",
										"value": "application/json"
									}
								],
								"body": {
									"mode": "raw",
									"raw": "{\n\t\"MiddleName\": \"pidor\"\n}",
									"options": {
										"raw": {
											"language": "json"
										}
									}
								},
								"url": {
									"raw": "http://morozzz689.tplinkdns.com:5041/client/user/update",
									"protocol": "http",
									"host": [
										"morozzz689",
										"tplinkdns",
										"com"
									],
									"port": "5041",
									"path": [
										"client",
										"user",
										"update"
									]
								}
							},
							"response": []
						}
					],
					"protocolProfileBehavior": {},
					"_postman_isSubFolder": true
				},
				{
					"name": "Order",
					"item": [
						{
							"name": "Calculate",
							"protocolProfileBehavior": {
								"disableBodyPruning": true
							},
							"request": {
								"method": "GET",
								"header": [
									{
										"key": "Content-Type",
										"name": "Content-Type",
										"value": "application/json",
										"type": "text"
									}
								],
								"body": {
									"mode": "raw",
									"raw": "{\n\t\"tarifId\": \"a5f9d4ec-0a14-4f16-95a4-7f89da5bed68\",\n\t\"Route\": [\n            {\n            \t\"SpecificAddress\": \"Космопорт\",\n                \"Latitude\": 53.206675,\n                \"Longitude\": 50.195907\n            },\n            {\n            \t\"City\": \"Самара\",\n            \t\"Street\": \"Лукачева\",\n            \t\"BuildingNumber\": \"59\",\n                \"Latitude\": 53.214290,\n                \"Longitude\": 50.172471\n            },\n            {\n                \"Latitude\": 53.203296,\n                \"Longitude\": 50.145362\n            }\n        ]\n}",
									"options": {
										"raw": {
											"language": "json"
										}
									}
								},
								"url": {
									"raw": "http://morozzz689.tplinkdns.com:5041/client/order/calculate",
									"protocol": "http",
									"host": [
										"morozzz689",
										"tplinkdns",
										"com"
									],
									"port": "5041",
									"path": [
										"client",
										"order",
										"calculate"
									]
								}
							},
							"response": []
						},
						{
							"name": "Create",
							"request": {
								"method": "POST",
								"header": [
									{
										"key": "Content-Type",
										"name": "Content-Type",
										"value": "application/json",
										"type": "text"
									}
								],
								"body": {
									"mode": "raw",
									"raw": "{\n\t\"TarifId\": \"764cb89f-e8e6-4174-85be-c6e7425f6a4f\",\n\t\"Route\": [\n            {\n            \t\"SpecificAddress\": \"Космопорт\",\n                \"Latitude\": 53.206675,\n                \"Longitude\": 50.195907\n            },\n            {\n            \t\"City\": \"Самара\",\n            \t\"Street\": \"Лукачева\",\n            \t\"BuildingNumber\": \"59\",\n                \"Latitude\": 53.214290,\n                \"Longitude\": 50.172471\n            },\n            {\n                \"Latitude\": 53.203296,\n                \"Longitude\": 50.145362\n            }\n        ],\n\t\"CarTypesIds\": [\"0281c710-6e53-4d49-a219-73a27a8d3d5f\",\"1bafafbd-5ec7-4dbb-8d7d-a1b1b43ba866\",\"a245f9a1-fa31-4552-bf88-4e4689a0b861\"],\n\t\"CarOptionsIds\": [\"b98ab410-bdce-4aea-9300-48f41371873c\"],\n\t\"Start\": \"2019-11-17T16:12:25\"\n}",
									"options": {
										"raw": {
											"language": "json"
										}
									}
								},
								"url": {
									"raw": "http://morozzz689.tplinkdns.com:5041/client/order/create",
									"protocol": "http",
									"host": [
										"morozzz689",
										"tplinkdns",
										"com"
									],
									"port": "5041",
									"path": [
										"client",
										"order",
										"create"
									]
								}
							},
							"response": []
						},
						{
							"name": "Info",
							"protocolProfileBehavior": {
								"disableBodyPruning": true
							},
							"request": {
								"method": "GET",
								"header": [
									{
										"key": "Content-Type",
										"name": "Content-Type",
										"value": "application/json",
										"type": "text"
									}
								],
								"body": {
									"mode": "raw",
									"raw": "{\n\t\"OrderId\": \"123ce97c-ccad-4085-82a1-8637d77e949e\"\n}",
									"options": {
										"raw": {
											"language": "json"
										}
									}
								},
								"url": {
									"raw": "http://morozzz689.tplinkdns.com:5041/client/order/info",
									"protocol": "http",
									"host": [
										"morozzz689",
										"tplinkdns",
										"com"
									],
									"port": "5041",
									"path": [
										"client",
										"order",
										"info"
									]
								}
							},
							"response": []
						},
						{
							"name": "Cancel",
							"request": {
								"method": "POST",
								"header": [
									{
										"key": "Content-Type",
										"name": "Content-Type",
										"type": "text",
										"value": "application/json"
									}
								],
								"body": {
									"mode": "raw",
									"raw": "{\n\t\"OrderId\": \"f069ee9a-109a-45a6-b19e-575d9542bb6b\"\n}",
									"options": {
										"raw": {
											"language": "json"
										}
									}
								},
								"url": {
									"raw": "http://morozzz689.tplinkdns.com:5041/client/order/cancel",
									"protocol": "http",
									"host": [
										"morozzz689",
										"tplinkdns",
										"com"
									],
									"port": "5041",
									"path": [
										"client",
										"order",
										"cancel"
									]
								}
							},
							"response": []
						},
						{
							"name": "List",
							"request": {
								"method": "GET",
								"header": [
									{
										"key": "Content-Type",
										"name": "Content-Type",
										"value": "application/json",
										"type": "text"
									}
								],
								"url": {
									"raw": "http://morozzz689.tplinkdns.com:5041/client/order/list",
									"protocol": "http",
									"host": [
										"morozzz689",
										"tplinkdns",
										"com"
									],
									"port": "5041",
									"path": [
										"client",
										"order",
										"list"
									]
								}
							},
							"response": []
						}
					],
					"protocolProfileBehavior": {},
					"_postman_isSubFolder": true
				},
				{
					"name": "Info",
					"request": {
						"method": "GET",
						"header": [],
						"url": {
							"raw": "http://morozzz689.tplinkdns.com:5041/client/info",
							"protocol": "http",
							"host": [
								"morozzz689",
								"tplinkdns",
								"com"
							],
							"port": "5041",
							"path": [
								"client",
								"info"
							]
						}
					},
					"response": []
				}
			],
			"auth": {
				"type": "bearer",
				"bearer": [
					{
						"key": "token",
						"value": "eyJhbGciOiJIUzI1NiIsInR5cCI6IkpXVCJ9.eyJodHRwOi8vc2NoZW1hcy54bWxzb2FwLm9yZy93cy8yMDA1LzA1L2lkZW50aXR5L2NsYWltcy9uYW1lIjoidGVzdENsaWVudCIsImh0dHA6Ly9zY2hlbWFzLm1pY3Jvc29mdC5jb20vd3MvMjAwOC8wNi9pZGVudGl0eS9jbGFpbXMvcm9sZSI6ImNsaWVudCIsIm5iZiI6MTU3NDAwMjA1OCwiZXhwIjoxNTc0MDAyMzU4LCJpc3MiOiJUYXhpV2ViQXBpIiwiYXVkIjoiVGF4aU1vYmlsZUFwcCJ9.Gm1tAT2dzucDHcsriSZ79Qb8f8lOXscd74S8XS8bOHU",
						"type": "string"
					}
				]
			},
			"event": [
				{
					"listen": "prerequest",
					"script": {
						"id": "877125b3-1753-4d76-bdf9-62e9a6d61b48",
						"type": "text/javascript",
						"exec": [
							""
						]
					}
				},
				{
					"listen": "test",
					"script": {
						"id": "244a80c0-ef10-41ba-94e9-e02419429a55",
						"type": "text/javascript",
						"exec": [
							""
						]
					}
				}
			],
			"protocolProfileBehavior": {}
		},
		{
			"name": "Driver",
			"item": [
				{
					"name": "User",
					"item": [
						{
							"name": "Login",
							"request": {
								"auth": {
									"type": "noauth"
								},
								"method": "POST",
								"header": [
									{
										"key": "Content-Type",
										"name": "Content-Type",
										"type": "text",
										"value": "application/json"
									}
								],
								"body": {
									"mode": "raw",
									"raw": "{\n\t\"Login\": \"testDriver\",\n\t\"Password\": \"123testDriver\"\n}",
									"options": {
										"raw": {
											"language": "json"
										}
									}
								},
								"url": {
									"raw": "http://morozzz689.tplinkdns.com:5041/driver/user/login",
									"protocol": "http",
									"host": [
										"morozzz689",
										"tplinkdns",
										"com"
									],
									"port": "5041",
									"path": [
										"driver",
										"user",
										"login"
									]
								}
							},
							"response": []
						},
						{
							"name": "Register",
							"request": {
								"auth": {
									"type": "noauth"
								},
								"method": "POST",
								"header": [
									{
										"key": "Content-Type",
										"name": "Content-Type",
										"value": "application/json",
										"type": "text"
									}
								],
								"body": {
									"mode": "raw",
									"raw": "{\n\t\"Login\": \"testDriver\",\n\t\"Password\": \"123testDriver\",\n\t\"Email\": \"testDriver@mail.ru\",\n\t\"Phone\": \"88005553536\",\n\t\"FirstName\": \"test\",\n\t\"LastName\": \"driver\",\n\t\"Gender\": \"female\",\n\t\"LicenceNumber\": \"7701397000\"\n}",
									"options": {
										"raw": {
											"language": "json"
										}
									}
								},
								"url": {
									"raw": "http://morozzz689.tplinkdns.com:5041/driver/user/register",
									"protocol": "http",
									"host": [
										"morozzz689",
										"tplinkdns",
										"com"
									],
									"port": "5041",
									"path": [
										"driver",
										"user",
										"register"
									]
								}
							},
							"response": []
						},
						{
							"name": "Update",
							"request": {
								"method": "POST",
								"header": [
									{
										"key": "Content-Type",
										"name": "Content-Type",
										"type": "text",
										"value": "application/json"
									}
								],
								"body": {
									"mode": "raw",
									"raw": "{\n\t\"MiddleName\": \"klava\"\n}",
									"options": {
										"raw": {
											"language": "json"
										}
									}
								},
								"url": {
									"raw": "http://morozzz689.tplinkdns.com:5041/driver/user/update",
									"protocol": "http",
									"host": [
										"morozzz689",
										"tplinkdns",
										"com"
									],
									"port": "5041",
									"path": [
										"driver",
										"user",
										"update"
									]
								}
							},
							"response": []
						}
					],
					"protocolProfileBehavior": {},
					"_postman_isSubFolder": true
				},
				{
					"name": "Order",
					"item": [
						{
							"name": "Available",
							"request": {
								"method": "GET",
								"header": [
									{
										"key": "Content-Type",
										"name": "Content-Type",
										"type": "text",
										"value": "application/json"
									}
								],
								"url": {
									"raw": "http://morozzz689.tplinkdns.com:5041/driver/order/available",
									"protocol": "http",
									"host": [
										"morozzz689",
										"tplinkdns",
										"com"
									],
									"port": "5041",
									"path": [
										"driver",
										"order",
										"available"
									]
								}
							},
							"response": []
						},
						{
							"name": "Take",
							"request": {
								"method": "POST",
								"header": [
									{
										"key": "Content-Type",
										"name": "Content-Type",
										"value": "application/json",
										"type": "text"
									}
								],
								"body": {
									"mode": "raw",
									"raw": "{\n\t\"OrderId\": \"123ce97c-ccad-4085-82a1-8637d77e949e\"\n}",
									"options": {
										"raw": {
											"language": "json"
										}
									}
								},
								"url": {
									"raw": "http://morozzz689.tplinkdns.com:5041/driver/order/take",
									"protocol": "http",
									"host": [
										"morozzz689",
										"tplinkdns",
										"com"
									],
									"port": "5041",
									"path": [
										"driver",
										"order",
										"take"
									]
								}
							},
							"response": []
						},
						{
							"name": "Info",
							"protocolProfileBehavior": {
								"disableBodyPruning": true
							},
							"request": {
								"method": "GET",
								"header": [
									{
										"key": "Content-Type",
										"name": "Content-Type",
										"value": "application/json",
										"type": "text"
									}
								],
								"body": {
									"mode": "raw",
									"raw": "{\n\t\"OrderId\": \"123ce97c-ccad-4085-82a1-8637d77e949e\"\n}",
									"options": {
										"raw": {
											"language": "json"
										}
									}
								},
								"url": {
									"raw": "http://morozzz689.tplinkdns.com:5041/driver/order/info",
									"protocol": "http",
									"host": [
										"morozzz689",
										"tplinkdns",
										"com"
									],
									"port": "5041",
									"path": [
										"driver",
										"order",
										"info"
									]
								}
							},
							"response": []
						},
						{
							"name": "Cancel",
							"request": {
								"method": "POST",
								"header": [
									{
										"key": "Content-Type",
										"name": "Content-Type",
										"type": "text",
										"value": "application/json"
									}
								],
								"body": {
									"mode": "raw",
									"raw": "{\n\t\"OrderId\": \"123ce97c-ccad-4085-82a1-8637d77e949e\"\n}",
									"options": {
										"raw": {
											"language": "json"
										}
									}
								},
								"url": {
									"raw": "http://morozzz689.tplinkdns.com:5041/driver/order/cancel",
									"protocol": "http",
									"host": [
										"morozzz689",
										"tplinkdns",
										"com"
									],
									"port": "5041",
									"path": [
										"driver",
										"order",
										"cancel"
									]
								}
							},
							"response": []
						},
						{
							"name": "Complete",
							"request": {
								"method": "POST",
								"header": [
									{
										"key": "Content-Type",
										"name": "Content-Type",
										"type": "text",
										"value": "application/json"
									}
								],
								"body": {
									"mode": "raw",
									"raw": "{\n\t\"OrderId\": \"123ce97c-ccad-4085-82a1-8637d77e949e\"\n}",
									"options": {
										"raw": {
											"language": "json"
										}
									}
								},
								"url": {
									"raw": "http://morozzz689.tplinkdns.com:5041/driver/order/complete",
									"protocol": "http",
									"host": [
										"morozzz689",
										"tplinkdns",
										"com"
									],
									"port": "5041",
									"path": [
										"driver",
										"order",
										"complete"
									]
								}
							},
							"response": []
						},
						{
							"name": "Update",
							"request": {
								"method": "POST",
								"header": [
									{
										"key": "Content-Type",
										"name": "Content-Type",
										"type": "text",
										"value": "application/json"
									}
								],
								"body": {
									"mode": "raw",
									"raw": "{\n\t\"OrderId\": \"123ce97c-ccad-4085-82a1-8637d77e949e\",\n\t\"Status\": \"Waiting\"\n}",
									"options": {
										"raw": {
											"language": "json"
										}
									}
								},
								"url": {
									"raw": "http://morozzz689.tplinkdns.com:5041/driver/order/update",
									"protocol": "http",
									"host": [
										"morozzz689",
										"tplinkdns",
										"com"
									],
									"port": "5041",
									"path": [
										"driver",
										"order",
										"update"
									]
								}
							},
							"response": []
						},
						{
							"name": "List",
							"request": {
								"method": "GET",
								"header": [
									{
										"key": "Content-Type",
										"name": "Content-Type",
										"value": "application/json",
										"type": "text"
									}
								],
								"url": {
									"raw": "http://morozzz689.tplinkdns.com:5041/driver/order/list",
									"protocol": "http",
									"host": [
										"morozzz689",
										"tplinkdns",
										"com"
									],
									"port": "5041",
									"path": [
										"driver",
										"order",
										"list"
									]
								}
							},
							"response": []
						}
					],
					"protocolProfileBehavior": {},
					"_postman_isSubFolder": true
				},
				{
					"name": "Board",
					"item": [
						{
							"name": "Info",
							"request": {
								"method": "GET",
								"header": [],
								"url": {
									"raw": "http://morozzz689.tplinkdns.com:5041/driver/board/info",
									"protocol": "http",
									"host": [
										"morozzz689",
										"tplinkdns",
										"com"
									],
									"port": "5041",
									"path": [
										"driver",
										"board",
										"info"
									]
								}
							},
							"response": []
						},
						{
							"name": "Start",
							"request": {
								"method": "POST",
								"header": [
									{
										"key": "Content-Type",
										"name": "Content-Type",
										"value": "application/json",
										"type": "text"
									}
								],
								"body": {
									"mode": "raw",
									"raw": "{\n\t\"CarId\": \"e0ca6bd1-c710-4200-a16e-70e8ad5d694f\",\n\t\"Latitude\": 53.10,\n\t\"Longitude\": 50.75\n}",
									"options": {
										"raw": {
											"language": "json"
										}
									}
								},
								"url": {
									"raw": "http://morozzz689.tplinkdns.com:5041/driver/board/start",
									"protocol": "http",
									"host": [
										"morozzz689",
										"tplinkdns",
										"com"
									],
									"port": "5041",
									"path": [
										"driver",
										"board",
										"start"
									]
								}
							},
							"response": []
						},
						{
							"name": "End",
							"request": {
								"method": "POST",
								"header": [
									{
										"key": "Content-Type",
										"name": "Content-Type",
										"value": "application/json",
										"type": "text"
									}
								],
								"url": {
									"raw": "http://morozzz689.tplinkdns.com:5041/driver/board/end",
									"protocol": "http",
									"host": [
										"morozzz689",
										"tplinkdns",
										"com"
									],
									"port": "5041",
									"path": [
										"driver",
										"board",
										"end"
									]
								}
							},
							"response": []
						},
						{
							"name": "Update",
							"request": {
								"method": "POST",
								"header": [
									{
										"key": "Content-Type",
										"name": "Content-Type",
										"value": "application/json",
										"type": "text"
									}
								],
								"body": {
									"mode": "raw",
									"raw": "{\n\t\"Latitude\": 53.13,\n\t\"Longitude\": 50.42\n}",
									"options": {
										"raw": {
											"language": "json"
										}
									}
								},
								"url": {
									"raw": "http://morozzz689.tplinkdns.com:5041/driver/board/update",
									"protocol": "http",
									"host": [
										"morozzz689",
										"tplinkdns",
										"com"
									],
									"port": "5041",
									"path": [
										"driver",
										"board",
										"update"
									]
								}
							},
							"response": []
						}
					],
					"protocolProfileBehavior": {},
					"_postman_isSubFolder": true
				},
				{
					"name": "Info",
					"request": {
						"method": "GET",
						"header": [],
						"url": {
							"raw": "http://morozzz689.tplinkdns.com:5041/driver/info",
							"protocol": "http",
							"host": [
								"morozzz689",
								"tplinkdns",
								"com"
							],
							"port": "5041",
							"path": [
								"driver",
								"info"
							]
						}
					},
					"response": []
				}
			],
			"auth": {
				"type": "bearer",
				"bearer": [
					{
						"key": "token",
						"value": "eyJhbGciOiJIUzI1NiIsInR5cCI6IkpXVCJ9.eyJodHRwOi8vc2NoZW1hcy54bWxzb2FwLm9yZy93cy8yMDA1LzA1L2lkZW50aXR5L2NsYWltcy9uYW1lIjoidGVzdERyaXZlciIsImh0dHA6Ly9zY2hlbWFzLm1pY3Jvc29mdC5jb20vd3MvMjAwOC8wNi9pZGVudGl0eS9jbGFpbXMvcm9sZSI6ImRyaXZlciIsIm5iZiI6MTU3NDAwNDM0NiwiZXhwIjoxNTc0MDA0NjQ2LCJpc3MiOiJUYXhpV2ViQXBpIiwiYXVkIjoiVGF4aU1vYmlsZUFwcCJ9.VohY9vlFnXtel7qJL6LbbTJIrSGcS10LaTwm0GCBwJI",
						"type": "string"
					}
				]
			},
			"event": [
				{
					"listen": "prerequest",
					"script": {
						"id": "947c028d-8911-49e2-8f36-277d952200c7",
						"type": "text/javascript",
						"exec": [
							""
						]
					}
				},
				{
					"listen": "test",
					"script": {
						"id": "ef7b160e-c2f4-47b0-b39b-ce8f8be07a76",
						"type": "text/javascript",
						"exec": [
							""
						]
					}
				}
			],
			"protocolProfileBehavior": {}
		}
	],
	"protocolProfileBehavior": {}
}