{
  "name": "_MODNAME_",
  "author": "",
  "description": "",
  "version": "1.0",
  "license": "GNU AGPLv3",
  "icon": "icon.png",
  "banner": "banner.jpg",
  "gameVersion": "1.0",
  "updateUrl": "",
  "isModPermanent": false,
  "excludedFiles": []
}