<?xml version="1.0" encoding="utf-8"?>
<!DOCTYPE eagle SYSTEM "eagle.dtd">
<eagle version="9.3.0">
<drawing>
<settings>
<setting alwaysvectorfont="yes"/>
<setting verticaltext="up"/>
</settings>
<grid distance="100" unitdist="mil" unit="mil" style="dots" multiple="1" display="yes" altdistance="0.01" altunitdist="inch" altunit="inch"/>
<layers>
<layer number="1" name="Top" color="4" fill="1" visible="no" active="no"/>
<layer number="2" name="Route2" color="1" fill="3" visible="no" active="no"/>
<layer number="3" name="Route3" color="4" fill="3" visible="no" active="no"/>
<layer number="4" name="Route4" color="18" fill="1" visible="no" active="no"/>
<layer number="5" name="Route5" color="19" fill="1" visible="no" active="no"/>
<layer number="6" name="Route6" color="25" fill="1" visible="no" active="no"/>
<layer number="7" name="Route7" color="26" fill="1" visible="no" active="no"/>
<layer number="8" name="Route8" color="27" fill="1" visible="no" active="no"/>
<layer number="9" name="Route9" color="28" fill="1" visible="no" active="no"/>
<layer number="10" name="Route10" color="29" fill="1" visible="no" active="no"/>
<layer number="11" name="Route11" color="30" fill="1" visible="no" active="no"/>
<layer number="12" name="Route12" color="20" fill="1" visible="no" active="no"/>
<layer number="13" name="Route13" color="21" fill="1" visible="no" active="no"/>
<layer number="14" name="Route14" color="1" fill="6" visible="no" active="no"/>
<layer number="15" name="Route15" color="4" fill="6" visible="no" active="no"/>
<layer number="16" name="Bottom" color="1" fill="1" visible="no" active="no"/>
<layer number="17" name="Pads" color="2" fill="1" visible="no" active="no"/>
<layer number="18" name="Vias" color="2" fill="1" visible="no" active="no"/>
<layer number="19" name="Unrouted" color="6" fill="1" visible="no" active="no"/>
<layer number="20" name="Dimension" color="15" fill="1" visible="no" active="no"/>
<layer number="21" name="tPlace" color="7" fill="1" visible="no" active="no"/>
<layer number="22" name="bPlace" color="7" fill="1" visible="no" active="no"/>
<layer number="23" name="tOrigins" color="15" fill="1" visible="no" active="no"/>
<layer number="24" name="bOrigins" color="15" fill="1" visible="no" active="no"/>
<layer number="25" name="tNames" color="7" fill="1" visible="no" active="no"/>
<layer number="26" name="bNames" color="7" fill="1" visible="no" active="no"/>
<layer number="27" name="tValues" color="7" fill="1" visible="no" active="no"/>
<layer number="28" name="bValues" color="7" fill="1" visible="no" active="no"/>
<layer number="29" name="tStop" color="7" fill="3" visible="no" active="no"/>
<layer number="30" name="bStop" color="7" fill="6" visible="no" active="no"/>
<layer number="31" name="tCream" color="7" fill="4" visible="no" active="no"/>
<layer number="32" name="bCream" color="7" fill="5" visible="no" active="no"/>
<layer number="33" name="tFinish" color="6" fill="3" visible="no" active="no"/>
<layer number="34" name="bFinish" color="6" fill="6" visible="no" active="no"/>
<layer number="35" name="tGlue" color="7" fill="4" visible="no" active="no"/>
<layer number="36" name="bGlue" color="7" fill="5" visible="no" active="no"/>
<layer number="37" name="tTest" color="7" fill="1" visible="no" active="no"/>
<layer number="38" name="bTest" color="7" fill="1" visible="no" active="no"/>
<layer number="39" name="tKeepout" color="4" fill="11" visible="no" active="no"/>
<layer number="40" name="bKeepout" color="1" fill="11" visible="no" active="no"/>
<layer number="41" name="tRestrict" color="4" fill="10" visible="no" active="no"/>
<layer number="42" name="bRestrict" color="1" fill="10" visible="no" active="no"/>
<layer number="43" name="vRestrict" color="2" fill="10" visible="no" active="no"/>
<layer number="44" name="Drills" color="7" fill="1" visible="no" active="no"/>
<layer number="45" name="Holes" color="7" fill="1" visible="no" active="no"/>
<layer number="46" name="Milling" color="3" fill="1" visible="no" active="no"/>
<layer number="47" name="Measures" color="7" fill="1" visible="no" active="no"/>
<layer number="48" name="Document" color="7" fill="1" visible="no" active="no"/>
<layer number="49" name="Reference" color="7" fill="1" visible="no" active="no"/>
<layer number="50" name="ReferenceLS" color="12" fill="1" visible="no" active="no"/>
<layer number="51" name="tDocu" color="7" fill="1" visible="no" active="no"/>
<layer number="52" name="bDocu" color="7" fill="1" visible="no" active="no"/>
<layer number="53" name="tGND_GNDA" color="7" fill="1" visible="no" active="no"/>
<layer number="54" name="bGND_GNDA" color="7" fill="1" visible="no" active="no"/>
<layer number="56" name="wert" color="7" fill="1" visible="no" active="no"/>
<layer number="88" name="SimResults" color="9" fill="1" visible="yes" active="yes"/>
<layer number="89" name="SimProbes" color="9" fill="1" visible="yes" active="yes"/>
<layer number="90" name="Modules" color="5" fill="1" visible="yes" active="yes"/>
<layer number="91" name="Nets" color="2" fill="1" visible="yes" active="yes"/>
<layer number="92" name="Busses" color="1" fill="1" visible="yes" active="yes"/>
<layer number="93" name="Pins" color="2" fill="1" visible="no" active="yes"/>
<layer number="94" name="Symbols" color="4" fill="1" visible="yes" active="yes"/>
<layer number="95" name="Names" color="7" fill="1" visible="yes" active="yes"/>
<layer number="96" name="Values" color="7" fill="1" visible="yes" active="yes"/>
<layer number="97" name="Info" color="7" fill="1" visible="yes" active="yes"/>
<layer number="98" name="Guide" color="6" fill="1" visible="yes" active="yes"/>
<layer number="99" name="SpiceOrder" color="5" fill="1" visible="yes" active="yes"/>
<layer number="100" name="Muster" color="7" fill="1" visible="no" active="no"/>
<layer number="101" name="Patch_Top" color="7" fill="1" visible="no" active="no"/>
<layer number="102" name="Vscore" color="7" fill="1" visible="no" active="no"/>
<layer number="104" name="Name" color="7" fill="1" visible="no" active="no"/>
<layer number="116" name="Patch_BOT" color="7" fill="1" visible="no" active="no"/>
<layer number="121" name="_tsilk" color="7" fill="1" visible="no" active="no"/>
<layer number="122" name="_bsilk" color="7" fill="1" visible="no" active="no"/>
<layer number="151" name="HeatSink" color="7" fill="1" visible="no" active="no"/>
<layer number="200" name="200bmp" color="1" fill="10" visible="no" active="no"/>
<layer number="201" name="201bmp" color="2" fill="10" visible="no" active="no"/>
<layer number="202" name="202bmp" color="3" fill="10" visible="no" active="no"/>
<layer number="203" name="203bmp" color="4" fill="10" visible="no" active="no"/>
<layer number="204" name="204bmp" color="5" fill="10" visible="no" active="no"/>
<layer number="205" name="205bmp" color="6" fill="10" visible="no" active="no"/>
<layer number="206" name="206bmp" color="7" fill="10" visible="no" active="no"/>
<layer number="207" name="207bmp" color="8" fill="10" visible="no" active="no"/>
<layer number="208" name="208bmp" color="9" fill="10" visible="no" active="no"/>
<layer number="209" name="209bmp" color="10" fill="10" visible="no" active="no"/>
<layer number="210" name="210bmp" color="11" fill="10" visible="no" active="no"/>
<layer number="211" name="211bmp" color="12" fill="10" visible="no" active="no"/>
<layer number="212" name="212bmp" color="13" fill="10" visible="no" active="no"/>
<layer number="213" name="213bmp" color="14" fill="10" visible="no" active="no"/>
<layer number="214" name="214bmp" color="15" fill="10" visible="no" active="no"/>
<layer number="215" name="215bmp" color="16" fill="1" visible="no" active="no"/>
<layer number="216" name="216bmp" color="17" fill="1" visible="no" active="no"/>
<layer number="217" name="217bmp" color="18" fill="1" visible="no" active="no"/>
<layer number="218" name="218bmp" color="19" fill="1" visible="no" active="no"/>
<layer number="219" name="219bmp" color="20" fill="1" visible="no" active="no"/>
<layer number="220" name="220bmp" color="21" fill="1" visible="no" active="no"/>
<layer number="221" name="221bmp" color="22" fill="1" visible="no" active="no"/>
<layer number="222" name="222bmp" color="23" fill="1" visible="no" active="no"/>
<layer number="223" name="223bmp" color="24" fill="1" visible="no" active="no"/>
<layer number="224" name="224bmp" color="25" fill="1" visible="no" active="no"/>
<layer number="250" name="Descript" color="3" fill="1" visible="no" active="no"/>
<layer number="251" name="SMDround" color="12" fill="11" visible="no" active="no"/>
<layer number="254" name="cooling" color="7" fill="1" visible="no" active="no"/>
</layers>
<schematic xreflabel="%F%N/%S.%C%R" xrefpart="/%S.%C%R">
<libraries>
<library name="00_SMD_Schustzplatine">
<packages>
</packages>
<symbols>
<symbol name="GEIER-FRAME_A3">
<wire x1="289.56" y1="3.81" x2="342.265" y2="3.81" width="0.1016" layer="94"/>
<wire x1="342.265" y1="3.81" x2="383.54" y2="3.81" width="0.1016" layer="94"/>
<wire x1="383.54" y1="3.81" x2="383.54" y2="8.89" width="0.1016" layer="94"/>
<wire x1="383.54" y1="8.89" x2="383.54" y2="13.97" width="0.1016" layer="94"/>
<wire x1="383.54" y1="13.97" x2="383.54" y2="19.05" width="0.1016" layer="94"/>
<wire x1="383.54" y1="19.05" x2="383.54" y2="24.13" width="0.1016" layer="94"/>
<wire x1="289.56" y1="3.81" x2="289.56" y2="24.13" width="0.1016" layer="94"/>
<wire x1="289.56" y1="24.13" x2="342.265" y2="24.13" width="0.1016" layer="94"/>
<wire x1="342.265" y1="24.13" x2="383.54" y2="24.13" width="0.1016" layer="94"/>
<wire x1="383.54" y1="8.89" x2="342.265" y2="8.89" width="0.1016" layer="94"/>
<wire x1="342.265" y1="8.89" x2="342.265" y2="3.81" width="0.1016" layer="94"/>
<wire x1="342.265" y1="8.89" x2="342.265" y2="13.97" width="0.1016" layer="94"/>
<wire x1="342.265" y1="13.97" x2="383.54" y2="13.97" width="0.1016" layer="94"/>
<wire x1="342.265" y1="13.97" x2="342.265" y2="19.05" width="0.1016" layer="94"/>
<wire x1="342.265" y1="19.05" x2="383.54" y2="19.05" width="0.1016" layer="94"/>
<wire x1="342.265" y1="19.05" x2="342.265" y2="24.13" width="0.1016" layer="94"/>
<frame x1="0" y1="0" x2="387.35" y2="260.35" columns="8" rows="5" layer="94"/>
<text x="343.535" y="15.24" size="2.54" layer="94" font="vector">&gt;DRAWING_NAME</text>
<text x="356.87" y="5.08" size="2.54" layer="94" font="vector">&gt;SHEET</text>
<text x="343.281" y="4.953" size="2.54" layer="94" font="vector">Sheet:</text>
<text x="343.535" y="20.32" size="2.54" layer="94" font="vector">Geier Moritz</text>
<text x="343.535" y="10.16" size="2.54" layer="94" font="vector">&gt;LAST_DATE_TIME</text>
</symbol>
</symbols>
<devicesets>
<deviceset name="GEIER-FRAMES-A3" prefix="FRAME" uservalue="yes">
<description>&lt;b&gt;FRAME&lt;/b&gt;&lt;p&gt;
DIN A3, landscape with location and doc. field</description>
<gates>
<gate name="G$1" symbol="GEIER-FRAME_A3" x="0" y="0"/>
</gates>
<devices>
<device name="">
<technologies>
<technology name=""/>
</technologies>
</device>
</devices>
</deviceset>
</devicesets>
</library>
<library name="WET_Platine">
<packages>
<package name="SOP254P977X370-8" urn="urn:adsk.eagle:footprint:10402558/1">
<description>8-SOP, 2.54 mm pitch, 9.78 mm span, 9.82 X 6.42 X 3.70 mm body
&lt;p&gt;8-pin SOP package with 2.54 mm pitch, 9.78 mm span with body size 9.82 X 6.42 X 3.70 mm&lt;/p&gt;</description>
<circle x="-4.3314" y="5.1812" radius="0.25" width="0" layer="21"/>
<wire x1="-3.25" y1="4.9312" x2="-3.25" y2="5" width="0.12" layer="21"/>
<wire x1="-3.25" y1="5" x2="3.25" y2="5" width="0.12" layer="21"/>
<wire x1="3.25" y1="5" x2="3.25" y2="4.9312" width="0.12" layer="21"/>
<wire x1="-3.25" y1="-4.9312" x2="-3.25" y2="-5" width="0.12" layer="21"/>
<wire x1="-3.25" y1="-5" x2="3.25" y2="-5" width="0.12" layer="21"/>
<wire x1="3.25" y1="-5" x2="3.25" y2="-4.9312" width="0.12" layer="21"/>
<wire x1="3.25" y1="-5" x2="-3.25" y2="-5" width="0.12" layer="51"/>
<wire x1="-3.25" y1="-5" x2="-3.25" y2="5" width="0.12" layer="51"/>
<wire x1="-3.25" y1="5" x2="3.25" y2="5" width="0.12" layer="51"/>
<wire x1="3.25" y1="5" x2="3.25" y2="-5" width="0.12" layer="51"/>
<smd name="1" x="-4.5165" y="3.81" dx="1.7925" dy="1.7345" layer="1"/>
<smd name="2" x="-4.5165" y="1.27" dx="1.7925" dy="1.7345" layer="1"/>
<smd name="3" x="-4.5165" y="-1.27" dx="1.7925" dy="1.7345" layer="1"/>
<smd name="4" x="-4.5165" y="-3.81" dx="1.7925" dy="1.7345" layer="1"/>
<smd name="5" x="4.5165" y="-3.81" dx="1.7925" dy="1.7345" layer="1"/>
<smd name="6" x="4.5165" y="-1.27" dx="1.7925" dy="1.7345" layer="1"/>
<smd name="7" x="4.5165" y="1.27" dx="1.7925" dy="1.7345" layer="1"/>
<smd name="8" x="4.5165" y="3.81" dx="1.7925" dy="1.7345" layer="1"/>
<text x="0" y="6.0662" size="1.27" layer="25" align="bottom-center">&gt;NAME</text>
<text x="0" y="-5.635" size="1.27" layer="27" align="top-center">&gt;VALUE</text>
</package>
<package name="TO-247AC">
<pad name="2" x="0" y="0" drill="1.5"/>
<pad name="1" x="-5.46" y="0" drill="1.5"/>
<pad name="3" x="5.46" y="0" drill="1.5"/>
<wire x1="7.62" y1="2.54" x2="-7.62" y2="2.54" width="0.127" layer="21"/>
<wire x1="-7.62" y1="2.54" x2="-7.62" y2="0.635" width="0.127" layer="21"/>
<wire x1="-7.62" y1="0.635" x2="-6.985" y2="0" width="0.127" layer="21"/>
<wire x1="-6.985" y1="0" x2="-6.985" y2="-1.27" width="0.127" layer="21"/>
<wire x1="-6.985" y1="-1.27" x2="-7.62" y2="-1.905" width="0.127" layer="21"/>
<wire x1="-7.62" y1="-1.905" x2="-7.62" y2="-2.2225" width="0.127" layer="21"/>
<wire x1="-7.62" y1="-2.2225" x2="7.62" y2="-2.2225" width="0.127" layer="21"/>
<wire x1="7.62" y1="-2.2225" x2="7.62" y2="-1.905" width="0.127" layer="21"/>
<wire x1="7.62" y1="-1.905" x2="6.985" y2="-1.27" width="0.127" layer="21"/>
<wire x1="6.985" y1="-1.27" x2="6.985" y2="0" width="0.127" layer="21"/>
<wire x1="6.985" y1="0" x2="7.62" y2="0.635" width="0.127" layer="21"/>
<wire x1="7.62" y1="0.635" x2="7.62" y2="2.54" width="0.127" layer="21"/>
<rectangle x1="-7.62" y1="1.5875" x2="7.62" y2="2.54" layer="21"/>
<text x="-7.62" y="3.81" size="0.8128" layer="25">&gt;NAME</text>
</package>
<package name="SOIC127P780X200-8" urn="urn:adsk.eagle:footprint:10402892/1">
<description>8-SOIC, 1.27 mm pitch, 7.80 mm span, 6.20 X 5.30 X 2.00 mm body
&lt;p&gt;8-pin SOIC package with 1.27 mm pitch, 7.80 mm span with body size 6.20 X 5.30 X 2.00 mm&lt;/p&gt;</description>
<circle x="-3.6541" y="2.8515" radius="0.25" width="0" layer="21"/>
<wire x1="-2.8" y1="2.6015" x2="-2.8" y2="3.25" width="0.12" layer="21"/>
<wire x1="-2.8" y1="3.25" x2="2.8" y2="3.25" width="0.12" layer="21"/>
<wire x1="2.8" y1="3.25" x2="2.8" y2="2.6015" width="0.12" layer="21"/>
<wire x1="-2.8" y1="-2.6015" x2="-2.8" y2="-3.25" width="0.12" layer="21"/>
<wire x1="-2.8" y1="-3.25" x2="2.8" y2="-3.25" width="0.12" layer="21"/>
<wire x1="2.8" y1="-3.25" x2="2.8" y2="-2.6015" width="0.12" layer="21"/>
<wire x1="2.8" y1="-3.25" x2="-2.8" y2="-3.25" width="0.12" layer="51"/>
<wire x1="-2.8" y1="-3.25" x2="-2.8" y2="3.25" width="0.12" layer="51"/>
<wire x1="-2.8" y1="3.25" x2="2.8" y2="3.25" width="0.12" layer="51"/>
<wire x1="2.8" y1="3.25" x2="2.8" y2="-3.25" width="0.12" layer="51"/>
<smd name="1" x="-3.6073" y="1.905" dx="1.8018" dy="0.885" layer="1"/>
<smd name="2" x="-3.6073" y="0.635" dx="1.8018" dy="0.885" layer="1"/>
<smd name="3" x="-3.6073" y="-0.635" dx="1.8018" dy="0.885" layer="1"/>
<smd name="4" x="-3.6073" y="-1.905" dx="1.8018" dy="0.885" layer="1"/>
<smd name="5" x="3.6073" y="-1.905" dx="1.8018" dy="0.885" layer="1"/>
<smd name="6" x="3.6073" y="-0.635" dx="1.8018" dy="0.885" layer="1"/>
<smd name="7" x="3.6073" y="0.635" dx="1.8018" dy="0.885" layer="1"/>
<smd name="8" x="3.6073" y="1.905" dx="1.8018" dy="0.885" layer="1"/>
<text x="0" y="3.885" size="1.27" layer="25" align="bottom-center">&gt;NAME</text>
<text x="0" y="-3.885" size="1.27" layer="27" align="top-center">&gt;VALUE</text>
</package>
<package name="RK12L">
<pad name="P$1" x="-6" y="0" drill="2.2"/>
<pad name="P$2" x="6" y="0" drill="2.2"/>
<pad name="R2_1" x="-1" y="-11" drill="0.9"/>
<pad name="R2_2" x="1" y="-11" drill="0.9"/>
<pad name="R1_1" x="-3" y="-11" drill="0.9"/>
<pad name="R2_3" x="3" y="-11" drill="0.9"/>
<pad name="R1_2" x="-5" y="-11" drill="0.9"/>
<pad name="R1_3" x="5" y="-11" drill="0.9"/>
<wire x1="-6" y1="-9.5" x2="6" y2="-9.5" width="0.127" layer="21"/>
<wire x1="6" y1="-9.5" x2="6" y2="-2" width="0.127" layer="21"/>
<wire x1="6" y1="2" x2="6" y2="6" width="0.127" layer="21"/>
<wire x1="6" y1="6" x2="-6" y2="6" width="0.127" layer="21"/>
<wire x1="-6" y1="6" x2="-6" y2="2" width="0.127" layer="21"/>
<wire x1="-6" y1="-2" x2="-6" y2="-9.5" width="0.127" layer="21"/>
<circle x="0" y="0" radius="3.905121875" width="0.127" layer="21"/>
<wire x1="-3.875" y1="-0.5" x2="3.875" y2="-0.5" width="0.127" layer="21"/>
<wire x1="3.875" y1="0.5" x2="-3.875" y2="0.5" width="0.127" layer="21"/>
<text x="-5.08" y="6.35" size="0.8128" layer="25" font="vector">&gt;NAME</text>
<text x="-5.08" y="-8.89" size="0.8128" layer="27" font="vector">&gt;VALUE</text>
</package>
</packages>
<packages3d>
<package3d name="SOP254P977X370-8" urn="urn:adsk.eagle:package:10402530/1" type="model">
<description>8-SOP, 2.54 mm pitch, 9.78 mm span, 9.82 X 6.42 X 3.70 mm body
&lt;p&gt;8-pin SOP package with 2.54 mm pitch, 9.78 mm span with body size 9.82 X 6.42 X 3.70 mm&lt;/p&gt;</description>
<packageinstances>
<packageinstance name="SOP254P977X370-8"/>
</packageinstances>
</package3d>
<package3d name="SOIC127P780X200-8" urn="urn:adsk.eagle:package:10402884/1" type="model">
<description>8-SOIC, 1.27 mm pitch, 7.80 mm span, 6.20 X 5.30 X 2.00 mm body
&lt;p&gt;8-pin SOIC package with 1.27 mm pitch, 7.80 mm span with body size 6.20 X 5.30 X 2.00 mm&lt;/p&gt;</description>
<packageinstances>
<packageinstance name="SOIC127P780X200-8"/>
</packageinstances>
</package3d>
</packages3d>
<symbols>
<symbol name="PWR">
<circle x="0" y="2.54" radius="1.27" width="0.254" layer="94"/>
<circle x="0" y="-2.54" radius="1.27" width="0.254" layer="94"/>
<pin name="+" x="0" y="7.62" visible="pad" length="short" rot="R270"/>
<pin name="-" x="0" y="-7.62" visible="pad" length="short" rot="R90"/>
<wire x1="0" y1="5.08" x2="0" y2="3.81" width="0.1524" layer="94"/>
<wire x1="0" y1="-5.08" x2="0" y2="-3.81" width="0.1524" layer="94"/>
<text x="-2.54" y="0" size="0.8128" layer="95">&gt;NAME</text>
</symbol>
<symbol name="HCPL-3120">
<pin name="AN" x="-10.16" y="2.54" length="short"/>
<pin name="CA" x="-10.16" y="-2.54" length="short"/>
<pin name="VO1" x="10.16" y="2.54" length="short" rot="R180"/>
<pin name="VO2" x="10.16" y="-2.54" length="short" rot="R180"/>
<wire x1="-7.62" y1="3.81" x2="-7.62" y2="-3.81" width="0.254" layer="94"/>
<wire x1="-7.62" y1="-3.81" x2="7.62" y2="-3.81" width="0.254" layer="94"/>
<wire x1="7.62" y1="-3.81" x2="7.62" y2="3.81" width="0.254" layer="94"/>
<wire x1="7.62" y1="3.81" x2="-7.62" y2="3.81" width="0.254" layer="94"/>
<text x="-7.62" y="5.08" size="1.27" layer="95">&gt;NAME</text>
</symbol>
<symbol name="P-MOSFET">
<wire x1="0.762" y1="-0.762" x2="0.762" y2="0" width="0.254" layer="94"/>
<wire x1="0.762" y1="0" x2="0.762" y2="0.762" width="0.254" layer="94"/>
<wire x1="0.762" y1="-3.175" x2="0.762" y2="-2.54" width="0.254" layer="94"/>
<wire x1="0.762" y1="-2.54" x2="0.762" y2="-1.905" width="0.254" layer="94"/>
<wire x1="0.762" y1="0" x2="2.54" y2="0" width="0.1524" layer="94"/>
<wire x1="2.54" y1="0" x2="2.54" y2="2.54" width="0.1524" layer="94"/>
<wire x1="0.762" y1="1.905" x2="0.762" y2="2.54" width="0.254" layer="94"/>
<wire x1="0.762" y1="2.54" x2="0.762" y2="3.175" width="0.254" layer="94"/>
<wire x1="0" y1="-2.54" x2="0" y2="2.54" width="0.254" layer="94"/>
<wire x1="2.54" y1="2.54" x2="0.762" y2="2.54" width="0.1524" layer="94"/>
<wire x1="3.81" y1="-2.54" x2="3.81" y2="0.508" width="0.1524" layer="94"/>
<wire x1="3.81" y1="0.508" x2="3.81" y2="2.54" width="0.1524" layer="94"/>
<wire x1="2.54" y1="2.54" x2="3.81" y2="2.54" width="0.1524" layer="94"/>
<wire x1="0.762" y1="-2.54" x2="3.81" y2="-2.54" width="0.1524" layer="94"/>
<wire x1="3.048" y1="0.762" x2="3.302" y2="0.508" width="0.1524" layer="94"/>
<wire x1="3.302" y1="0.508" x2="3.81" y2="0.508" width="0.1524" layer="94"/>
<wire x1="3.81" y1="0.508" x2="4.318" y2="0.508" width="0.1524" layer="94"/>
<wire x1="4.318" y1="0.508" x2="4.572" y2="0.254" width="0.1524" layer="94"/>
<circle x="2.54" y="2.54" radius="0.3592" width="0" layer="94"/>
<circle x="2.54" y="-2.54" radius="0.3592" width="0" layer="94"/>
<text x="6.35" y="-2.54" size="0.8128" layer="96" rot="R90">&gt;VALUE</text>
<text x="-1.27" y="-2.54" size="0.8128" layer="95" rot="R90">&gt;NAME</text>
<pin name="S" x="2.54" y="5.08" visible="off" length="short" direction="pas" rot="R270"/>
<pin name="G" x="-2.54" y="2.54" visible="off" length="short" direction="pas"/>
<pin name="D" x="2.54" y="-5.08" visible="off" length="short" direction="pas" rot="R90"/>
<polygon width="0.1524" layer="94">
<vertex x="3.81" y="0.508"/>
<vertex x="4.318" y="-0.254"/>
<vertex x="3.302" y="-0.254"/>
</polygon>
<polygon width="0.1524" layer="94">
<vertex x="2.54" y="0"/>
<vertex x="1.524" y="0.762"/>
<vertex x="1.524" y="-0.762"/>
</polygon>
</symbol>
<symbol name="N-MOSFET">
<wire x1="-2.54" y1="-2.54" x2="-1.2192" y2="-2.54" width="0.1524" layer="94"/>
<wire x1="0" y1="0.762" x2="0" y2="0" width="0.254" layer="94"/>
<wire x1="0" y1="0" x2="0" y2="-0.762" width="0.254" layer="94"/>
<wire x1="0" y1="3.683" x2="0" y2="2.54" width="0.254" layer="94"/>
<wire x1="0" y1="2.54" x2="0" y2="1.397" width="0.254" layer="94"/>
<wire x1="0" y1="0" x2="2.54" y2="0" width="0.1524" layer="94"/>
<wire x1="2.54" y1="0" x2="2.54" y2="-2.54" width="0.1524" layer="94"/>
<wire x1="0" y1="-1.397" x2="0" y2="-2.54" width="0.254" layer="94"/>
<wire x1="0" y1="-2.54" x2="0" y2="-3.683" width="0.254" layer="94"/>
<wire x1="-1.143" y1="2.54" x2="-1.143" y2="-2.54" width="0.254" layer="94"/>
<wire x1="0" y1="2.54" x2="2.54" y2="2.54" width="0.1524" layer="94"/>
<wire x1="2.54" y1="2.54" x2="2.54" y2="5.08" width="0.1524" layer="94"/>
<wire x1="2.54" y1="-2.54" x2="0" y2="-2.54" width="0.1524" layer="94"/>
<wire x1="3.81" y1="2.54" x2="3.81" y2="0.508" width="0.1524" layer="94"/>
<wire x1="3.81" y1="0.508" x2="3.81" y2="-2.54" width="0.1524" layer="94"/>
<wire x1="2.54" y1="-2.54" x2="3.81" y2="-2.54" width="0.1524" layer="94"/>
<wire x1="2.54" y1="2.54" x2="3.81" y2="2.54" width="0.1524" layer="94"/>
<wire x1="4.572" y1="0.762" x2="4.318" y2="0.508" width="0.1524" layer="94"/>
<wire x1="4.318" y1="0.508" x2="3.81" y2="0.508" width="0.1524" layer="94"/>
<wire x1="3.81" y1="0.508" x2="3.302" y2="0.508" width="0.1524" layer="94"/>
<wire x1="3.302" y1="0.508" x2="3.048" y2="0.254" width="0.1524" layer="94"/>
<circle x="2.54" y="-2.54" radius="0.3592" width="0" layer="94"/>
<circle x="2.54" y="2.54" radius="0.3592" width="0" layer="94"/>
<text x="6.35" y="-1.27" size="0.8128" layer="96" rot="R90">&gt;VALUE</text>
<text x="-2.54" y="-1.27" size="0.8128" layer="95" rot="R90">&gt;NAME</text>
<pin name="D" x="2.54" y="5.08" visible="off" length="point" direction="pas" rot="R180"/>
<pin name="S" x="2.54" y="-5.08" visible="off" length="short" direction="pas" rot="R90"/>
<pin name="G" x="-5.08" y="-2.54" visible="off" length="short" direction="pas"/>
<polygon width="0.1524" layer="94">
<vertex x="3.81" y="0.508"/>
<vertex x="3.302" y="-0.254"/>
<vertex x="4.318" y="-0.254"/>
</polygon>
<polygon width="0.1524" layer="94">
<vertex x="0.254" y="0"/>
<vertex x="1.27" y="0.762"/>
<vertex x="1.27" y="-0.762"/>
</polygon>
</symbol>
<symbol name="TLC555">
<pin name="THR" x="-10.16" y="0" length="short"/>
<pin name="CONT" x="10.16" y="0" length="short" rot="R180"/>
<pin name="DIS" x="-10.16" y="-5.08" length="short"/>
<pin name="RST" x="10.16" y="-5.08" length="short" rot="R180"/>
<pin name="OUT" x="10.16" y="5.08" length="short" rot="R180"/>
<pin name="TRIG" x="-10.16" y="5.08" length="short"/>
<wire x1="-7.62" y1="6.35" x2="-7.62" y2="-6.35" width="0.254" layer="94"/>
<wire x1="-7.62" y1="-6.35" x2="7.62" y2="-6.35" width="0.254" layer="94"/>
<wire x1="7.62" y1="-6.35" x2="7.62" y2="6.35" width="0.254" layer="94"/>
<wire x1="7.62" y1="6.35" x2="-7.62" y2="6.35" width="0.254" layer="94"/>
<text x="-7.62" y="7.62" size="1.778" layer="95">&gt;NAME</text>
</symbol>
<symbol name="R_TRIM">
<wire x1="-2.54" y1="0.9525" x2="-2.54" y2="-0.9525" width="0.1524" layer="94"/>
<wire x1="-2.54" y1="-0.9525" x2="2.54" y2="-0.9525" width="0.1524" layer="94"/>
<wire x1="2.54" y1="-0.9525" x2="2.54" y2="0.9525" width="0.1524" layer="94"/>
<wire x1="2.54" y1="0.9525" x2="-2.54" y2="0.9525" width="0.1524" layer="94"/>
<pin name="1" x="-5.08" y="0" visible="off" length="short" direction="pas"/>
<pin name="3" x="5.08" y="0" visible="off" length="short" direction="pas" rot="R180"/>
<text x="-2.54" y="1.27" size="0.8128" layer="95" font="vector">&gt;NAME</text>
<text x="0.3175" y="-2.2225" size="0.8128" layer="96" font="vector">&gt;VALUE</text>
<wire x1="0" y1="-1.27" x2="2.8575" y2="1.5875" width="0.1524" layer="94"/>
<wire x1="2.8575" y1="1.5875" x2="2.54" y2="1.5875" width="0.1524" layer="94"/>
<wire x1="2.54" y1="1.5875" x2="2.8575" y2="1.27" width="0.1524" layer="94"/>
<wire x1="2.8575" y1="1.27" x2="2.8575" y2="1.5875" width="0.1524" layer="94"/>
<pin name="2" x="0" y="-5.08" visible="off" length="short" rot="R90"/>
<wire x1="0" y1="-2.54" x2="0" y2="-1.27" width="0.1524" layer="94"/>
</symbol>
</symbols>
<devicesets>
<deviceset name="HCPL-3120" prefix="IC">
<gates>
<gate name="PWR" symbol="PWR" x="15.24" y="10.16" addlevel="request"/>
<gate name="G$2" symbol="HCPL-3120" x="-10.16" y="10.16"/>
</gates>
<devices>
<device name="" package="SOP254P977X370-8">
<connects>
<connect gate="G$2" pin="AN" pad="2"/>
<connect gate="G$2" pin="CA" pad="3"/>
<connect gate="G$2" pin="VO1" pad="6"/>
<connect gate="G$2" pin="VO2" pad="7"/>
<connect gate="PWR" pin="+" pad="8"/>
<connect gate="PWR" pin="-" pad="5"/>
</connects>
<package3dinstances>
<package3dinstance package3d_urn="urn:adsk.eagle:package:10402530/1"/>
</package3dinstances>
<technologies>
<technology name=""/>
</technologies>
</device>
</devices>
</deviceset>
<deviceset name="P-MOSFET" prefix="FET" uservalue="yes">
<gates>
<gate name="G$1" symbol="P-MOSFET" x="0" y="0"/>
</gates>
<devices>
<device name="IRFP9240" package="TO-247AC">
<connects>
<connect gate="G$1" pin="D" pad="2"/>
<connect gate="G$1" pin="G" pad="1"/>
<connect gate="G$1" pin="S" pad="3"/>
</connects>
<technologies>
<technology name=""/>
</technologies>
</device>
</devices>
</deviceset>
<deviceset name="N-MOSFET" prefix="FET" uservalue="yes">
<gates>
<gate name="G$1" symbol="N-MOSFET" x="0" y="0"/>
</gates>
<devices>
<device name="IRFP240" package="TO-247AC">
<connects>
<connect gate="G$1" pin="D" pad="2"/>
<connect gate="G$1" pin="G" pad="1"/>
<connect gate="G$1" pin="S" pad="3"/>
</connects>
<technologies>
<technology name=""/>
</technologies>
</device>
</devices>
</deviceset>
<deviceset name="TLC555" prefix="IC">
<gates>
<gate name="G$1" symbol="TLC555" x="0" y="0"/>
<gate name="PWR" symbol="PWR" x="27.94" y="0" addlevel="request"/>
</gates>
<devices>
<device name="" package="SOIC127P780X200-8">
<connects>
<connect gate="G$1" pin="CONT" pad="5"/>
<connect gate="G$1" pin="DIS" pad="7"/>
<connect gate="G$1" pin="OUT" pad="3"/>
<connect gate="G$1" pin="RST" pad="4"/>
<connect gate="G$1" pin="THR" pad="6"/>
<connect gate="G$1" pin="TRIG" pad="2"/>
<connect gate="PWR" pin="+" pad="8"/>
<connect gate="PWR" pin="-" pad="1"/>
</connects>
<package3dinstances>
<package3dinstance package3d_urn="urn:adsk.eagle:package:10402884/1"/>
</package3dinstances>
<technologies>
<technology name=""/>
</technologies>
</device>
</devices>
</deviceset>
<deviceset name="R_TRIM_DUAL" prefix="R" uservalue="yes">
<gates>
<gate name="INNER" symbol="R_TRIM" x="-10.16" y="0" swaplevel="1"/>
<gate name="OUTER" symbol="R_TRIM" x="10.16" y="0" swaplevel="1"/>
</gates>
<devices>
<device name="" package="RK12L">
<connects>
<connect gate="INNER" pin="1" pad="R2_1"/>
<connect gate="INNER" pin="2" pad="R2_2"/>
<connect gate="INNER" pin="3" pad="R2_3"/>
<connect gate="OUTER" pin="1" pad="R1_1"/>
<connect gate="OUTER" pin="2" pad="R1_2"/>
<connect gate="OUTER" pin="3" pad="R1_3"/>
</connects>
<technologies>
<technology name=""/>
</technologies>
</device>
</devices>
</deviceset>
</devicesets>
</library>
<library name="RobticArm">
<packages>
<package name="2POL254" urn="urn:adsk.eagle:footprint:9305/1" locally_modified="yes">
<description>&lt;b&gt;PHOENIX CONNECTOR&lt;/b&gt;</description>
<pad name="1" x="-2.54" y="0" drill="1.5" shape="long" rot="R90"/>
<pad name="2" x="2.54" y="0" drill="1.5" shape="long" rot="R90"/>
<wire x1="-5.08" y1="5.08" x2="-5.08" y2="-5.08" width="0.127" layer="21"/>
<wire x1="-5.08" y1="-5.08" x2="5.08" y2="-5.08" width="0.127" layer="21"/>
<wire x1="5.08" y1="-5.08" x2="5.08" y2="5.08" width="0.127" layer="21"/>
<wire x1="5.08" y1="5.08" x2="-5.08" y2="5.08" width="0.127" layer="21"/>
<rectangle x1="-5.08" y1="3.81" x2="5.08" y2="5.08" layer="21"/>
</package>
<package name="CAPC2012X135" urn="urn:adsk.eagle:footprint:7158980/1" locally_modified="yes">
<description>Chip, 2.00 X 1.25 X 1.35 mm body
&lt;p&gt;Chip package with body size 2.00 X 1.25 X 1.35 mm&lt;/p&gt;</description>
<wire x1="0.272125" y1="-0.675" x2="-0.272125" y2="-0.675" width="0.12" layer="21"/>
<wire x1="-0.272125" y1="-0.675" x2="-0.272125" y2="0.675" width="0.12" layer="21"/>
<wire x1="-0.272125" y1="0.675" x2="0.272125" y2="0.675" width="0.12" layer="21"/>
<wire x1="0.272125" y1="0.675" x2="0.272125" y2="-0.675" width="0.12" layer="21"/>
<smd name="1" x="-0.9399" y="0" dx="1.0202" dy="1.45" layer="1"/>
<smd name="2" x="0.9399" y="0" dx="1.0202" dy="1.45" layer="1"/>
<text x="0" y="0.896125" size="0.8128" layer="25" align="bottom-center">&gt;NAME</text>
<text x="0" y="-0.896125" size="0.8128" layer="27" align="top-center">&gt;VALUE</text>
<rectangle x1="-0.275271875" y1="-0.642303125" x2="0.275271875" y2="0.642303125" layer="21"/>
</package>
<package name="RESC2016X70" urn="urn:adsk.eagle:footprint:7158856/1" locally_modified="yes">
<description>Chip, 2.00 X 1.60 X 0.70 mm body
&lt;p&gt;Chip package with body size 2.00 X 1.60 X 0.70 mm&lt;/p&gt;</description>
<wire x1="0.272125" y1="-0.85" x2="-0.272125" y2="-0.85" width="0.127" layer="21"/>
<wire x1="-0.272125" y1="-0.85" x2="-0.272125" y2="0.85" width="0.127" layer="21"/>
<wire x1="-0.272125" y1="0.85" x2="0.272125" y2="0.85" width="0.127" layer="21"/>
<wire x1="0.272125" y1="0.85" x2="0.272125" y2="-0.85" width="0.127" layer="21"/>
<smd name="1" x="-0.9399" y="0" dx="1.0202" dy="1.8" layer="1"/>
<smd name="2" x="0.9399" y="0" dx="1.0202" dy="1.8" layer="1"/>
<text x="0" y="1.071125" size="0.8128" layer="25" align="bottom-center">&gt;NAME</text>
<text x="0" y="-1.071125" size="0.8128" layer="27" align="top-center">&gt;VALUE</text>
</package>
<package name="DIOM4226X243" urn="urn:adsk.eagle:footprint:7189003/1" locally_modified="yes">
<description>Molded Body, 4.29 X 2.69 X 2.44 mm body
&lt;p&gt;Molded Body package with body size 4.29 X 2.69 X 2.44 mm&lt;/p&gt;</description>
<smd name="C" x="-1.6761" y="0" dx="2.2846" dy="1.5839" layer="1"/>
<smd name="A" x="1.6777" y="0" dx="2.2814" dy="1.5871" layer="1"/>
<text x="0" y="1.1305" size="0.8128" layer="25" align="bottom-center">&gt;NAME</text>
<text x="0" y="-1.1305" size="0.8128" layer="27" align="top-center">&gt;VALUE</text>
<polygon width="0.127" layer="21">
<vertex x="-0.36703125" y="0"/>
<vertex x="0.367028125" y="0.734059375"/>
<vertex x="0.36703125" y="0.734059375"/>
<vertex x="0.36703125" y="-0.734059375"/>
<vertex x="-0.367028125" y="0"/>
</polygon>
</package>
<package name="TO455P987X240-3" urn="urn:adsk.eagle:footprint:7472989/1" locally_modified="yes">
<description>3-TO, DPAK, 4.55 mm pitch, 9.88 mm span, 6.54 X 6.09 X 2.40 mm body
&lt;p&gt;3-pin TO, DPAK package with 4.55 mm pitch, 9.88 mm span with body size 6.54 X 6.09 X 2.40 mm&lt;/p&gt;</description>
<circle x="-4.3452" y="3.3005" radius="0.25" width="0" layer="21"/>
<wire x1="3.8325" y1="3.0374" x2="3.8325" y2="3.365" width="0.12" layer="21"/>
<wire x1="3.8325" y1="3.365" x2="-2.3875" y2="3.365" width="0.12" layer="21"/>
<wire x1="-2.3875" y1="3.365" x2="-2.3875" y2="-3.365" width="0.12" layer="21"/>
<wire x1="-2.3875" y1="-3.365" x2="3.8325" y2="-3.365" width="0.12" layer="21"/>
<wire x1="3.8325" y1="-3.365" x2="3.8325" y2="-3.0374" width="0.12" layer="21"/>
<smd name="A" x="-4.3452" y="2.275" dx="2.4332" dy="1.0429" layer="1"/>
<smd name="A1" x="-4.3452" y="-2.275" dx="2.4332" dy="1.0429" layer="1"/>
<smd name="C" x="2.4182" y="0" dx="6.2871" dy="5.5669" layer="1"/>
<text x="0" y="4.1855" size="0.8128" layer="25" align="bottom-center">&gt;NAME</text>
<text x="0" y="-4" size="0.8128" layer="27" align="top-center">&gt;VALUE</text>
</package>
<package name="LEDC2012X70" urn="urn:adsk.eagle:footprint:7159536/1" locally_modified="yes">
<description>Chip, 2.00 X 1.25 X 0.70 mm body
&lt;p&gt;Chip package with body size 2.00 X 1.25 X 0.70 mm&lt;/p&gt;</description>
<smd name="C" x="-0.9399" y="0" dx="1.0202" dy="1.45" layer="1"/>
<smd name="A" x="0.9399" y="0" dx="1.0202" dy="1.45" layer="1"/>
<text x="0" y="0.896125" size="0.8128" layer="25" align="bottom-center">&gt;NAME</text>
<text x="0" y="-0.896125" size="0.8128" layer="27" align="top-center">&gt;VALUE</text>
<polygon width="0.127" layer="21">
<vertex x="0.275271875" y="0.734059375"/>
<vertex x="-0.275271875" y="0.09175625"/>
<vertex x="-0.275271875" y="0"/>
<vertex x="0.275271875" y="-0.734059375"/>
</polygon>
</package>
</packages>
<packages3d>
<package3d name="2POL254" urn="urn:adsk.eagle:package:9320/1" locally_modified="yes" type="box">
<description>PHOENIX CONNECTOR</description>
<packageinstances>
<packageinstance name="2POL254"/>
</packageinstances>
</package3d>
<package3d name="CAPC2012X135" urn="urn:adsk.eagle:package:7158867/1" locally_modified="yes" type="model">
<description>Chip, 2.00 X 1.25 X 1.35 mm body
&lt;p&gt;Chip package with body size 2.00 X 1.25 X 1.35 mm&lt;/p&gt;</description>
<packageinstances>
<packageinstance name="CAPC2012X135"/>
</packageinstances>
</package3d>
<package3d name="RESC2016X70" urn="urn:adsk.eagle:package:7158853/1" locally_modified="yes" type="model">
<description>Chip, 2.00 X 1.60 X 0.70 mm body
&lt;p&gt;Chip package with body size 2.00 X 1.60 X 0.70 mm&lt;/p&gt;</description>
<packageinstances>
<packageinstance name="RESC2016X70"/>
</packageinstances>
</package3d>
<package3d name="DIOM4226X243" urn="urn:adsk.eagle:package:7188975/1" locally_modified="yes" type="model">
<description>Molded Body, 4.29 X 2.69 X 2.44 mm body
&lt;p&gt;Molded Body package with body size 4.29 X 2.69 X 2.44 mm&lt;/p&gt;</description>
<packageinstances>
<packageinstance name="DIOM4226X243"/>
</packageinstances>
</package3d>
<package3d name="TO455P987X240-3" urn="urn:adsk.eagle:package:7472987/1" locally_modified="yes" type="model">
<description>3-TO, DPAK, 4.55 mm pitch, 9.88 mm span, 6.54 X 6.09 X 2.40 mm body
&lt;p&gt;3-pin TO, DPAK package with 4.55 mm pitch, 9.88 mm span with body size 6.54 X 6.09 X 2.40 mm&lt;/p&gt;</description>
<packageinstances>
<packageinstance name="TO455P987X240-3"/>
</packageinstances>
</package3d>
<package3d name="LEDC2012X70" urn="urn:adsk.eagle:package:7159533/1" locally_modified="yes" type="model">
<description>Chip, 2.00 X 1.25 X 0.70 mm body
&lt;p&gt;Chip package with body size 2.00 X 1.25 X 0.70 mm&lt;/p&gt;</description>
<packageinstances>
<packageinstance name="LEDC2012X70"/>
</packageinstances>
</package3d>
</packages3d>
<symbols>
<symbol name="GEIER-X2">
<wire x1="-2.54" y1="3.81" x2="2.54" y2="3.81" width="0.254" layer="94"/>
<wire x1="2.54" y1="3.81" x2="2.54" y2="-3.81" width="0.254" layer="94"/>
<wire x1="2.54" y1="-3.81" x2="-2.54" y2="-3.81" width="0.254" layer="94"/>
<wire x1="-2.54" y1="-3.81" x2="-2.54" y2="3.81" width="0.254" layer="94"/>
<pin name="+" x="5.08" y="2.54" visible="pad" length="short" direction="pwr" rot="R180"/>
<pin name="-" x="5.08" y="-2.54" visible="pad" length="short" direction="pwr" rot="R180"/>
<text x="-2.54" y="4.445" size="0.8128" layer="95" font="vector">&gt;NAME</text>
</symbol>
<symbol name="GEIER-C">
<pin name="P$1" x="-5.08" y="0" visible="off" length="short" direction="pas"/>
<pin name="P$2" x="5.08" y="0" visible="off" length="short" direction="pas" rot="R180"/>
<wire x1="-0.635" y1="0" x2="-2.54" y2="0" width="0.1524" layer="94"/>
<wire x1="0.635" y1="0" x2="2.54" y2="0" width="0.1524" layer="94"/>
<wire x1="-0.635" y1="1.905" x2="-0.635" y2="-1.905" width="0.4064" layer="94"/>
<wire x1="0.635" y1="1.905" x2="0.635" y2="-1.905" width="0.4064" layer="94"/>
<text x="0" y="2.54" size="0.8128" layer="95" font="vector">&gt;NAME</text>
<text x="0" y="-3.81" size="0.8128" layer="96" font="vector">&gt;VALUE</text>
</symbol>
<symbol name="GEIER-R">
<wire x1="-2.54" y1="0.9525" x2="-2.54" y2="-0.9525" width="0.1524" layer="94"/>
<wire x1="-2.54" y1="-0.9525" x2="2.54" y2="-0.9525" width="0.1524" layer="94"/>
<wire x1="2.54" y1="-0.9525" x2="2.54" y2="0.9525" width="0.1524" layer="94"/>
<wire x1="2.54" y1="0.9525" x2="-2.54" y2="0.9525" width="0.1524" layer="94"/>
<pin name="P$1" x="-5.08" y="0" visible="off" length="short" direction="pas"/>
<pin name="P$2" x="5.08" y="0" visible="off" length="short" direction="pas" rot="R180"/>
<text x="-2.54" y="1.27" size="0.8128" layer="95" font="vector">&gt;NAME</text>
<text x="-2.54" y="-2.2225" size="0.8128" layer="96" font="vector">&gt;VALUE</text>
</symbol>
<symbol name="GEIER-D">
<wire x1="-1.27" y1="-1.27" x2="1.27" y2="0" width="0.1524" layer="94"/>
<wire x1="1.27" y1="0" x2="-1.27" y2="1.27" width="0.1524" layer="94"/>
<wire x1="1.27" y1="1.27" x2="1.27" y2="0" width="0.1524" layer="94"/>
<wire x1="-1.27" y1="1.27" x2="-1.27" y2="0" width="0.1524" layer="94"/>
<wire x1="-1.27" y1="0" x2="-1.27" y2="-1.27" width="0.1524" layer="94"/>
<wire x1="1.27" y1="0" x2="1.27" y2="-1.27" width="0.1524" layer="94"/>
<text x="-2.54" y="1.7526" size="0.8128" layer="95" font="vector">&gt;NAME</text>
<pin name="A" x="-2.54" y="0" visible="off" length="short" direction="pas"/>
<pin name="C" x="2.54" y="0" visible="off" length="short" direction="pas" rot="R180"/>
<text x="-2.54" y="-2.6924" size="0.8128" layer="96" font="vector">&gt;VALUE</text>
<wire x1="-1.27" y1="0" x2="1.27" y2="0" width="0.1524" layer="94"/>
</symbol>
<symbol name="GEIER-D_LED">
<wire x1="-1.27" y1="-1.27" x2="1.27" y2="0" width="0.1524" layer="94"/>
<wire x1="1.27" y1="0" x2="-1.27" y2="1.27" width="0.1524" layer="94"/>
<wire x1="1.27" y1="1.27" x2="1.27" y2="0" width="0.1524" layer="94"/>
<wire x1="-1.27" y1="1.27" x2="-1.27" y2="0" width="0.1524" layer="94"/>
<wire x1="-1.27" y1="0" x2="-1.27" y2="-1.27" width="0.1524" layer="94"/>
<wire x1="1.27" y1="0" x2="1.27" y2="-1.27" width="0.1524" layer="94"/>
<text x="-2.54" y="1.7526" size="0.8128" layer="95" font="vector">&gt;NAME</text>
<pin name="A" x="-2.54" y="0" visible="off" length="short" direction="pas"/>
<pin name="C" x="2.54" y="0" visible="off" length="short" direction="pas" rot="R180"/>
<text x="-2.54" y="-2.6924" size="0.8128" layer="96" font="vector">&gt;VALUE</text>
<wire x1="-1.27" y1="0" x2="1.27" y2="0" width="0.1524" layer="94"/>
<wire x1="1.00933125" y1="1.00933125" x2="0.367034375" y2="1.651634375" width="0.127" layer="94"/>
<wire x1="0.642303125" y1="0.6423" x2="0" y2="1.284603125" width="0.127" layer="94"/>
<polygon width="0.127" layer="94">
<vertex x="0" y="1.28460625"/>
<vertex x="0" y="1.101090625"/>
<vertex x="0.183515625" y="1.28460625"/>
</polygon>
<polygon width="0.127" layer="94">
<vertex x="0.36703125" y="1.651634375"/>
<vertex x="0.36703125" y="1.46811875"/>
<vertex x="0.55054375" y="1.65163125"/>
<vertex x="0.55054375" y="1.651634375"/>
</polygon>
</symbol>
</symbols>
<devicesets>
<deviceset name="GEIER-X2" prefix="X">
<gates>
<gate name="G$1" symbol="GEIER-X2" x="0" y="0"/>
</gates>
<devices>
<device name="" package="2POL254">
<connects>
<connect gate="G$1" pin="+" pad="1"/>
<connect gate="G$1" pin="-" pad="2"/>
</connects>
<package3dinstances>
<package3dinstance package3d_urn="urn:adsk.eagle:package:9320/1"/>
</package3dinstances>
<technologies>
<technology name=""/>
</technologies>
</device>
</devices>
</deviceset>
<deviceset name="GEIER-C" prefix="C" uservalue="yes">
<gates>
<gate name="G$1" symbol="GEIER-C" x="0" y="0"/>
</gates>
<devices>
<device name="0805" package="CAPC2012X135">
<connects>
<connect gate="G$1" pin="P$1" pad="1"/>
<connect gate="G$1" pin="P$2" pad="2"/>
</connects>
<package3dinstances>
<package3dinstance package3d_urn="urn:adsk.eagle:package:7158867/1"/>
</package3dinstances>
<technologies>
<technology name=""/>
</technologies>
</device>
</devices>
</deviceset>
<deviceset name="GEIER-R" prefix="R" uservalue="yes">
<gates>
<gate name="G$1" symbol="GEIER-R" x="0" y="0"/>
</gates>
<devices>
<device name="0805" package="RESC2016X70">
<connects>
<connect gate="G$1" pin="P$1" pad="1"/>
<connect gate="G$1" pin="P$2" pad="2"/>
</connects>
<package3dinstances>
<package3dinstance package3d_urn="urn:adsk.eagle:package:7158853/1"/>
</package3dinstances>
<technologies>
<technology name=""/>
</technologies>
</device>
</devices>
</deviceset>
<deviceset name="GEIER-D" prefix="D" uservalue="yes">
<gates>
<gate name="G$1" symbol="GEIER-D" x="0" y="0"/>
</gates>
<devices>
<device name="1N4007" package="DIOM4226X243">
<connects>
<connect gate="G$1" pin="A" pad="A"/>
<connect gate="G$1" pin="C" pad="C"/>
</connects>
<package3dinstances>
<package3dinstance package3d_urn="urn:adsk.eagle:package:7188975/1"/>
</package3dinstances>
<technologies>
<technology name=""/>
</technologies>
</device>
<device name="FRED" package="TO455P987X240-3">
<connects>
<connect gate="G$1" pin="A" pad="A A1"/>
<connect gate="G$1" pin="C" pad="C"/>
</connects>
<package3dinstances>
<package3dinstance package3d_urn="urn:adsk.eagle:package:7472987/1"/>
</package3dinstances>
<technologies>
<technology name=""/>
</technologies>
</device>
</devices>
</deviceset>
<deviceset name="GEIER-LED" prefix="LED" uservalue="yes">
<gates>
<gate name="G$1" symbol="GEIER-D_LED" x="0" y="0"/>
</gates>
<devices>
<device name="0805" package="LEDC2012X70">
<connects>
<connect gate="G$1" pin="A" pad="A"/>
<connect gate="G$1" pin="C" pad="C"/>
</connects>
<package3dinstances>
<package3dinstance package3d_urn="urn:adsk.eagle:package:7159533/1"/>
</package3dinstances>
<technologies>
<technology name=""/>
</technologies>
</device>
</devices>
</deviceset>
</devicesets>
</library>
<library name="supply1" urn="urn:adsk.eagle:library:371">
<description>&lt;b&gt;Supply Symbols&lt;/b&gt;&lt;p&gt;
 GND, VCC, 0V, +5V, -5V, etc.&lt;p&gt;
 Please keep in mind, that these devices are necessary for the
 automatic wiring of the supply signals.&lt;p&gt;
 The pin name defined in the symbol is identical to the net which is to be wired automatically.&lt;p&gt;
 In this library the device names are the same as the pin names of the symbols, therefore the correct signal names appear next to the supply symbols in the schematic.&lt;p&gt;
 &lt;author&gt;Created by librarian@cadsoft.de&lt;/author&gt;</description>
<packages>
</packages>
<symbols>
<symbol name="GND" urn="urn:adsk.eagle:symbol:26925/1" library_version="1">
<wire x1="-1.905" y1="0" x2="1.905" y2="0" width="0.254" layer="94"/>
<text x="-2.54" y="-2.54" size="1.778" layer="96">&gt;VALUE</text>
<pin name="GND" x="0" y="2.54" visible="off" length="short" direction="sup" rot="R270"/>
</symbol>
<symbol name="+12V" urn="urn:adsk.eagle:symbol:26931/1" library_version="1">
<wire x1="1.27" y1="-1.905" x2="0" y2="0" width="0.254" layer="94"/>
<wire x1="0" y1="0" x2="-1.27" y2="-1.905" width="0.254" layer="94"/>
<wire x1="1.27" y1="-0.635" x2="0" y2="1.27" width="0.254" layer="94"/>
<wire x1="0" y1="1.27" x2="-1.27" y2="-0.635" width="0.254" layer="94"/>
<text x="-2.54" y="-5.08" size="1.778" layer="96" rot="R90">&gt;VALUE</text>
<pin name="+12V" x="0" y="-2.54" visible="off" length="short" direction="sup" rot="R90"/>
</symbol>
<symbol name="-12V" urn="urn:adsk.eagle:symbol:26932/1" library_version="1">
<wire x1="-1.27" y1="1.905" x2="0" y2="0" width="0.254" layer="94"/>
<wire x1="0" y1="0" x2="1.27" y2="1.905" width="0.254" layer="94"/>
<wire x1="-1.27" y1="0.635" x2="0" y2="-1.27" width="0.254" layer="94"/>
<wire x1="0" y1="-1.27" x2="1.27" y2="0.635" width="0.254" layer="94"/>
<text x="-2.54" y="-2.54" size="1.778" layer="96" rot="R90">&gt;VALUE</text>
<pin name="-12V" x="0" y="2.54" visible="off" length="short" direction="sup" rot="R270"/>
</symbol>
</symbols>
<devicesets>
<deviceset name="GND" urn="urn:adsk.eagle:component:26954/1" prefix="GND" library_version="1">
<description>&lt;b&gt;SUPPLY SYMBOL&lt;/b&gt;</description>
<gates>
<gate name="1" symbol="GND" x="0" y="0"/>
</gates>
<devices>
<device name="">
<technologies>
<technology name=""/>
</technologies>
</device>
</devices>
</deviceset>
<deviceset name="+12V" urn="urn:adsk.eagle:component:26959/1" prefix="P+" library_version="1">
<description>&lt;b&gt;SUPPLY SYMBOL&lt;/b&gt;</description>
<gates>
<gate name="1" symbol="+12V" x="0" y="0"/>
</gates>
<devices>
<device name="">
<technologies>
<technology name=""/>
</technologies>
</device>
</devices>
</deviceset>
<deviceset name="-12V" urn="urn:adsk.eagle:component:26961/1" prefix="P-" library_version="1">
<description>&lt;b&gt;SUPPLY SYMBOL&lt;/b&gt;</description>
<gates>
<gate name="1" symbol="-12V" x="0" y="0"/>
</gates>
<devices>
<device name="">
<technologies>
<technology name=""/>
</technologies>
</device>
</devices>
</deviceset>
</devicesets>
</library>
</libraries>
<attributes>
</attributes>
<variantdefs>
</variantdefs>
<classes>
<class number="0" name="default" width="0" drill="0">
</class>
</classes>
<parts>
<part name="FRAME1" library="00_SMD_Schustzplatine" deviceset="GEIER-FRAMES-A3" device=""/>
<part name="IC1" library="WET_Platine" deviceset="HCPL-3120" device="" package3d_urn="urn:adsk.eagle:package:10402530/1"/>
<part name="FET1" library="WET_Platine" deviceset="P-MOSFET" device="IRFP9240"/>
<part name="FET2" library="WET_Platine" deviceset="P-MOSFET" device="IRFP9240"/>
<part name="FET3" library="WET_Platine" deviceset="N-MOSFET" device="IRFP240"/>
<part name="FET4" library="WET_Platine" deviceset="N-MOSFET" device="IRFP240"/>
<part name="IC2" library="WET_Platine" deviceset="HCPL-3120" device="" package3d_urn="urn:adsk.eagle:package:10402530/1"/>
<part name="X2" library="RobticArm" deviceset="GEIER-X2" device="" package3d_urn="urn:adsk.eagle:package:9320/1"/>
<part name="C1" library="RobticArm" deviceset="GEIER-C" device="0805" package3d_urn="urn:adsk.eagle:package:7158867/1"/>
<part name="R1" library="RobticArm" deviceset="GEIER-R" device="0805" package3d_urn="urn:adsk.eagle:package:7158853/1" value="640"/>
<part name="R2" library="RobticArm" deviceset="GEIER-R" device="0805" package3d_urn="urn:adsk.eagle:package:7158853/1" value="640"/>
<part name="R3" library="RobticArm" deviceset="GEIER-R" device="0805" package3d_urn="urn:adsk.eagle:package:7158853/1"/>
<part name="R4" library="RobticArm" deviceset="GEIER-R" device="0805" package3d_urn="urn:adsk.eagle:package:7158853/1"/>
<part name="R5" library="RobticArm" deviceset="GEIER-R" device="0805" package3d_urn="urn:adsk.eagle:package:7158853/1"/>
<part name="R6" library="RobticArm" deviceset="GEIER-R" device="0805" package3d_urn="urn:adsk.eagle:package:7158853/1"/>
<part name="IC3" library="WET_Platine" deviceset="TLC555" device="" package3d_urn="urn:adsk.eagle:package:10402884/1"/>
<part name="R7" library="WET_Platine" deviceset="R_TRIM_DUAL" device=""/>
<part name="R8" library="RobticArm" deviceset="GEIER-R" device="0805" package3d_urn="urn:adsk.eagle:package:7158853/1"/>
<part name="R9" library="RobticArm" deviceset="GEIER-R" device="0805" package3d_urn="urn:adsk.eagle:package:7158853/1"/>
<part name="C2" library="RobticArm" deviceset="GEIER-C" device="0805" package3d_urn="urn:adsk.eagle:package:7158867/1"/>
<part name="D1" library="RobticArm" deviceset="GEIER-D" device="1N4007" package3d_urn="urn:adsk.eagle:package:7188975/1"/>
<part name="GND1" library="supply1" library_urn="urn:adsk.eagle:library:371" deviceset="GND" device=""/>
<part name="P+3" library="supply1" library_urn="urn:adsk.eagle:library:371" deviceset="+12V" device=""/>
<part name="P+5" library="supply1" library_urn="urn:adsk.eagle:library:371" deviceset="+12V" device=""/>
<part name="P+6" library="supply1" library_urn="urn:adsk.eagle:library:371" deviceset="+12V" device=""/>
<part name="GND2" library="supply1" library_urn="urn:adsk.eagle:library:371" deviceset="GND" device=""/>
<part name="P-1" library="supply1" library_urn="urn:adsk.eagle:library:371" deviceset="-12V" device=""/>
<part name="P+1" library="supply1" library_urn="urn:adsk.eagle:library:371" deviceset="+12V" device=""/>
<part name="X3" library="RobticArm" deviceset="GEIER-X2" device="" package3d_urn="urn:adsk.eagle:package:9320/1"/>
<part name="R10" library="RobticArm" deviceset="GEIER-R" device="0805" package3d_urn="urn:adsk.eagle:package:7158853/1"/>
<part name="R11" library="RobticArm" deviceset="GEIER-R" device="0805" package3d_urn="urn:adsk.eagle:package:7158853/1"/>
<part name="RED" library="RobticArm" deviceset="GEIER-LED" device="0805" package3d_urn="urn:adsk.eagle:package:7159533/1"/>
<part name="GRN" library="RobticArm" deviceset="GEIER-LED" device="0805" package3d_urn="urn:adsk.eagle:package:7159533/1"/>
<part name="C3" library="RobticArm" deviceset="GEIER-C" device="0805" package3d_urn="urn:adsk.eagle:package:7158867/1"/>
<part name="C4" library="RobticArm" deviceset="GEIER-C" device="0805" package3d_urn="urn:adsk.eagle:package:7158867/1"/>
<part name="C5" library="RobticArm" deviceset="GEIER-C" device="0805" package3d_urn="urn:adsk.eagle:package:7158867/1"/>
<part name="P+2" library="supply1" library_urn="urn:adsk.eagle:library:371" deviceset="+12V" device=""/>
<part name="P-2" library="supply1" library_urn="urn:adsk.eagle:library:371" deviceset="-12V" device=""/>
<part name="GND3" library="supply1" library_urn="urn:adsk.eagle:library:371" deviceset="GND" device=""/>
<part name="X1" library="RobticArm" deviceset="GEIER-X2" device="" package3d_urn="urn:adsk.eagle:package:9320/1"/>
</parts>
<sheets>
<sheet>
<plain>
</plain>
<instances>
<instance part="FRAME1" gate="G$1" x="0" y="0" smashed="yes">
<attribute name="DRAWING_NAME" x="343.535" y="15.24" size="2.54" layer="94" font="vector"/>
<attribute name="SHEET" x="356.87" y="5.08" size="2.54" layer="94" font="vector"/>
<attribute name="LAST_DATE_TIME" x="343.535" y="10.16" size="2.54" layer="94" font="vector"/>
</instance>
<instance part="IC1" gate="G$2" x="124.46" y="106.68" smashed="yes">
<attribute name="NAME" x="116.84" y="111.76" size="1.27" layer="95"/>
</instance>
<instance part="FET1" gate="G$1" x="175.26" y="144.78" smashed="yes">
<attribute name="VALUE" x="181.61" y="142.24" size="0.8128" layer="96" rot="R90"/>
<attribute name="NAME" x="173.99" y="142.24" size="0.8128" layer="95" rot="R90"/>
</instance>
<instance part="FET2" gate="G$1" x="215.9" y="144.78" smashed="yes" rot="MR0">
<attribute name="VALUE" x="209.55" y="142.24" size="0.8128" layer="96" rot="MR90"/>
<attribute name="NAME" x="217.17" y="142.24" size="0.8128" layer="95" rot="MR90"/>
</instance>
<instance part="FET3" gate="G$1" x="175.26" y="121.92" smashed="yes">
<attribute name="VALUE" x="181.61" y="120.65" size="0.8128" layer="96" rot="R90"/>
<attribute name="NAME" x="172.72" y="120.65" size="0.8128" layer="95" rot="R90"/>
</instance>
<instance part="FET4" gate="G$1" x="215.9" y="121.92" smashed="yes" rot="MR0">
<attribute name="VALUE" x="209.55" y="120.65" size="0.8128" layer="96" rot="MR90"/>
<attribute name="NAME" x="218.44" y="120.65" size="0.8128" layer="95" rot="MR90"/>
</instance>
<instance part="IC2" gate="G$2" x="124.46" y="91.44" smashed="yes">
<attribute name="NAME" x="116.84" y="96.52" size="1.27" layer="95"/>
</instance>
<instance part="X2" gate="G$1" x="195.58" y="129.54" smashed="yes" rot="R90">
<attribute name="NAME" x="191.135" y="127" size="0.8128" layer="95" font="vector" rot="R90"/>
</instance>
<instance part="C1" gate="G$1" x="185.42" y="137.16" smashed="yes" rot="R180">
<attribute name="NAME" x="185.42" y="134.62" size="0.8128" layer="95" font="vector" rot="R180"/>
<attribute name="VALUE" x="185.42" y="140.97" size="0.8128" layer="96" font="vector" rot="R180"/>
</instance>
<instance part="R1" gate="G$1" x="104.14" y="109.22" smashed="yes" rot="R180">
<attribute name="NAME" x="106.68" y="107.95" size="0.8128" layer="95" font="vector" rot="R180"/>
<attribute name="VALUE" x="106.68" y="111.4425" size="0.8128" layer="96" font="vector" rot="R180"/>
</instance>
<instance part="R2" gate="G$1" x="104.14" y="93.98" smashed="yes" rot="R180">
<attribute name="NAME" x="106.68" y="92.71" size="0.8128" layer="95" font="vector" rot="R180"/>
<attribute name="VALUE" x="106.68" y="96.2025" size="0.8128" layer="96" font="vector" rot="R180"/>
</instance>
<instance part="R3" gate="G$1" x="165.1" y="147.32" smashed="yes" rot="R180">
<attribute name="NAME" x="167.64" y="146.05" size="0.8128" layer="95" font="vector" rot="R180"/>
<attribute name="VALUE" x="167.64" y="149.5425" size="0.8128" layer="96" font="vector" rot="R180"/>
</instance>
<instance part="R4" gate="G$1" x="162.56" y="119.38" smashed="yes" rot="R180">
<attribute name="NAME" x="165.1" y="118.11" size="0.8128" layer="95" font="vector" rot="R180"/>
<attribute name="VALUE" x="165.1" y="121.6025" size="0.8128" layer="96" font="vector" rot="R180"/>
</instance>
<instance part="R5" gate="G$1" x="228.6" y="119.38" smashed="yes" rot="R180">
<attribute name="NAME" x="231.14" y="118.11" size="0.8128" layer="95" font="vector" rot="R180"/>
<attribute name="VALUE" x="231.14" y="121.6025" size="0.8128" layer="96" font="vector" rot="R180"/>
</instance>
<instance part="R6" gate="G$1" x="226.06" y="147.32" smashed="yes" rot="R180">
<attribute name="NAME" x="228.6" y="146.05" size="0.8128" layer="95" font="vector" rot="R180"/>
<attribute name="VALUE" x="228.6" y="149.5425" size="0.8128" layer="96" font="vector" rot="R180"/>
</instance>
<instance part="IC3" gate="G$1" x="76.2" y="132.08" smashed="yes">
<attribute name="NAME" x="68.58" y="139.7" size="1.778" layer="95"/>
</instance>
<instance part="R7" gate="INNER" x="43.18" y="127" smashed="yes" rot="R90">
<attribute name="NAME" x="41.91" y="124.46" size="0.8128" layer="95" font="vector" rot="R90"/>
<attribute name="VALUE" x="45.4025" y="127.3175" size="0.8128" layer="96" font="vector" rot="R90"/>
</instance>
<instance part="R7" gate="OUTER" x="43.18" y="144.78" smashed="yes" rot="R90">
<attribute name="NAME" x="41.91" y="142.24" size="0.8128" layer="95" font="vector" rot="R90"/>
<attribute name="VALUE" x="45.4025" y="145.0975" size="0.8128" layer="96" font="vector" rot="R90"/>
</instance>
<instance part="R8" gate="G$1" x="43.18" y="157.48" smashed="yes" rot="R90">
<attribute name="NAME" x="41.91" y="154.94" size="0.8128" layer="95" font="vector" rot="R90"/>
<attribute name="VALUE" x="45.4025" y="154.94" size="0.8128" layer="96" font="vector" rot="R90"/>
</instance>
<instance part="R9" gate="G$1" x="43.18" y="111.76" smashed="yes" rot="R90">
<attribute name="NAME" x="41.91" y="109.22" size="0.8128" layer="95" font="vector" rot="R90"/>
<attribute name="VALUE" x="45.4025" y="109.22" size="0.8128" layer="96" font="vector" rot="R90"/>
</instance>
<instance part="C2" gate="G$1" x="43.18" y="96.52" smashed="yes" rot="R90">
<attribute name="NAME" x="40.64" y="96.52" size="0.8128" layer="95" font="vector" rot="R90"/>
<attribute name="VALUE" x="46.99" y="96.52" size="0.8128" layer="96" font="vector" rot="R90"/>
</instance>
<instance part="D1" gate="G$1" x="33.02" y="121.92" smashed="yes" rot="R270">
<attribute name="NAME" x="34.7726" y="124.46" size="0.8128" layer="95" font="vector" rot="R270"/>
<attribute name="VALUE" x="30.3276" y="124.46" size="0.8128" layer="96" font="vector" rot="R270"/>
</instance>
<instance part="GND1" gate="1" x="43.18" y="86.36" smashed="yes">
<attribute name="VALUE" x="40.64" y="83.82" size="1.778" layer="96"/>
</instance>
<instance part="P+3" gate="1" x="96.52" y="116.84" smashed="yes">
<attribute name="VALUE" x="93.98" y="111.76" size="1.778" layer="96" rot="R90"/>
</instance>
<instance part="P+5" gate="1" x="96.52" y="144.78" smashed="yes">
<attribute name="VALUE" x="93.98" y="139.7" size="1.778" layer="96" rot="R90"/>
</instance>
<instance part="P+6" gate="1" x="43.18" y="167.64" smashed="yes">
<attribute name="VALUE" x="40.64" y="162.56" size="1.778" layer="96" rot="R90"/>
</instance>
<instance part="GND2" gate="1" x="111.76" y="81.28" smashed="yes">
<attribute name="VALUE" x="109.22" y="78.74" size="1.778" layer="96"/>
</instance>
<instance part="P-1" gate="1" x="195.58" y="104.14" smashed="yes">
<attribute name="VALUE" x="193.04" y="101.6" size="1.778" layer="96" rot="R90"/>
</instance>
<instance part="P+1" gate="1" x="195.58" y="157.48" smashed="yes">
<attribute name="VALUE" x="193.04" y="152.4" size="1.778" layer="96" rot="R90"/>
</instance>
<instance part="X3" gate="G$1" x="17.78" y="182.88" smashed="yes">
<attribute name="NAME" x="15.24" y="187.325" size="0.8128" layer="95" font="vector"/>
</instance>
<instance part="IC3" gate="PWR" x="53.34" y="210.82" smashed="yes">
<attribute name="NAME" x="50.8" y="210.82" size="0.8128" layer="95"/>
</instance>
<instance part="IC1" gate="PWR" x="78.74" y="210.82" smashed="yes">
<attribute name="NAME" x="76.2" y="210.82" size="0.8128" layer="95"/>
</instance>
<instance part="IC2" gate="PWR" x="99.06" y="210.82" smashed="yes">
<attribute name="NAME" x="96.52" y="210.82" size="0.8128" layer="95"/>
</instance>
<instance part="R10" gate="G$1" x="116.84" y="213.36" smashed="yes" rot="R90">
<attribute name="NAME" x="115.57" y="210.82" size="0.8128" layer="95" font="vector" rot="R90"/>
<attribute name="VALUE" x="119.0625" y="210.82" size="0.8128" layer="96" font="vector" rot="R90"/>
</instance>
<instance part="R11" gate="G$1" x="116.84" y="182.88" smashed="yes" rot="R90">
<attribute name="NAME" x="115.57" y="180.34" size="0.8128" layer="95" font="vector" rot="R90"/>
<attribute name="VALUE" x="119.0625" y="180.34" size="0.8128" layer="96" font="vector" rot="R90"/>
</instance>
<instance part="RED" gate="G$1" x="116.84" y="193.04" smashed="yes" rot="R90">
<attribute name="NAME" x="115.0874" y="190.5" size="0.8128" layer="95" font="vector" rot="R90"/>
<attribute name="VALUE" x="119.5324" y="190.5" size="0.8128" layer="96" font="vector" rot="R90"/>
</instance>
<instance part="GRN" gate="G$1" x="116.84" y="203.2" smashed="yes" rot="R270">
<attribute name="NAME" x="118.5926" y="205.74" size="0.8128" layer="95" font="vector" rot="R270"/>
<attribute name="VALUE" x="114.1476" y="205.74" size="0.8128" layer="96" font="vector" rot="R270"/>
</instance>
<instance part="C3" gate="G$1" x="45.72" y="210.82" smashed="yes" rot="R90">
<attribute name="NAME" x="43.18" y="210.82" size="0.8128" layer="95" font="vector" rot="R90"/>
<attribute name="VALUE" x="49.53" y="210.82" size="0.8128" layer="96" font="vector" rot="R90"/>
</instance>
<instance part="C4" gate="G$1" x="71.12" y="210.82" smashed="yes" rot="R90">
<attribute name="NAME" x="68.58" y="210.82" size="0.8128" layer="95" font="vector" rot="R90"/>
<attribute name="VALUE" x="74.93" y="210.82" size="0.8128" layer="96" font="vector" rot="R90"/>
</instance>
<instance part="C5" gate="G$1" x="91.44" y="210.82" smashed="yes" rot="R90">
<attribute name="NAME" x="88.9" y="210.82" size="0.8128" layer="95" font="vector" rot="R90"/>
<attribute name="VALUE" x="95.25" y="210.82" size="0.8128" layer="96" font="vector" rot="R90"/>
</instance>
<instance part="P+2" gate="1" x="116.84" y="228.6" smashed="yes">
<attribute name="VALUE" x="114.3" y="223.52" size="1.778" layer="96" rot="R90"/>
</instance>
<instance part="P-2" gate="1" x="116.84" y="167.64" smashed="yes">
<attribute name="VALUE" x="114.3" y="165.1" size="1.778" layer="96" rot="R90"/>
</instance>
<instance part="GND3" gate="1" x="124.46" y="193.04" smashed="yes">
<attribute name="VALUE" x="121.92" y="190.5" size="1.778" layer="96"/>
</instance>
<instance part="X1" gate="G$1" x="17.78" y="213.36" smashed="yes">
<attribute name="NAME" x="15.24" y="217.805" size="0.8128" layer="95" font="vector"/>
</instance>
</instances>
<busses>
</busses>
<nets>
<net name="N$1" class="0">
<segment>
<pinref part="R8" gate="G$1" pin="P$1"/>
<pinref part="R7" gate="OUTER" pin="3"/>
<wire x1="43.18" y1="152.4" x2="43.18" y2="149.86" width="0.1524" layer="91"/>
</segment>
</net>
<net name="N$2" class="0">
<segment>
<pinref part="R7" gate="OUTER" pin="2"/>
<wire x1="48.26" y1="144.78" x2="50.8" y2="144.78" width="0.1524" layer="91"/>
<wire x1="50.8" y1="144.78" x2="50.8" y2="137.16" width="0.1524" layer="91"/>
<wire x1="50.8" y1="137.16" x2="43.18" y2="137.16" width="0.1524" layer="91"/>
<pinref part="R7" gate="OUTER" pin="1"/>
<wire x1="43.18" y1="137.16" x2="43.18" y2="139.7" width="0.1524" layer="91"/>
<pinref part="R7" gate="INNER" pin="3"/>
<wire x1="43.18" y1="137.16" x2="43.18" y2="134.62" width="0.1524" layer="91"/>
<junction x="43.18" y="137.16"/>
<pinref part="D1" gate="G$1" pin="A"/>
<wire x1="43.18" y1="134.62" x2="43.18" y2="132.08" width="0.1524" layer="91"/>
<wire x1="43.18" y1="137.16" x2="33.02" y2="137.16" width="0.1524" layer="91"/>
<wire x1="33.02" y1="137.16" x2="33.02" y2="124.46" width="0.1524" layer="91"/>
<pinref part="IC3" gate="G$1" pin="DIS"/>
<wire x1="66.04" y1="127" x2="53.34" y2="127" width="0.1524" layer="91"/>
<wire x1="53.34" y1="127" x2="53.34" y2="134.62" width="0.1524" layer="91"/>
<wire x1="53.34" y1="134.62" x2="43.18" y2="134.62" width="0.1524" layer="91"/>
<junction x="43.18" y="134.62"/>
</segment>
</net>
<net name="N$3" class="0">
<segment>
<pinref part="R7" gate="INNER" pin="2"/>
<wire x1="48.26" y1="127" x2="50.8" y2="127" width="0.1524" layer="91"/>
<wire x1="50.8" y1="127" x2="50.8" y2="119.38" width="0.1524" layer="91"/>
<wire x1="50.8" y1="119.38" x2="43.18" y2="119.38" width="0.1524" layer="91"/>
<pinref part="R7" gate="INNER" pin="1"/>
<wire x1="43.18" y1="119.38" x2="43.18" y2="121.92" width="0.1524" layer="91"/>
<pinref part="R9" gate="G$1" pin="P$2"/>
<wire x1="43.18" y1="119.38" x2="43.18" y2="116.84" width="0.1524" layer="91"/>
<junction x="43.18" y="119.38"/>
</segment>
</net>
<net name="N$4" class="0">
<segment>
<pinref part="R9" gate="G$1" pin="P$1"/>
<pinref part="C2" gate="G$1" pin="P$2"/>
<wire x1="43.18" y1="106.68" x2="43.18" y2="104.14" width="0.1524" layer="91"/>
<pinref part="D1" gate="G$1" pin="C"/>
<wire x1="43.18" y1="104.14" x2="43.18" y2="101.6" width="0.1524" layer="91"/>
<wire x1="33.02" y1="119.38" x2="33.02" y2="104.14" width="0.1524" layer="91"/>
<wire x1="33.02" y1="104.14" x2="43.18" y2="104.14" width="0.1524" layer="91"/>
<junction x="43.18" y="104.14"/>
<wire x1="43.18" y1="104.14" x2="60.96" y2="104.14" width="0.1524" layer="91"/>
<wire x1="60.96" y1="104.14" x2="60.96" y2="132.08" width="0.1524" layer="91"/>
<pinref part="IC3" gate="G$1" pin="TRIG"/>
<wire x1="60.96" y1="132.08" x2="60.96" y2="137.16" width="0.1524" layer="91"/>
<wire x1="60.96" y1="137.16" x2="66.04" y2="137.16" width="0.1524" layer="91"/>
<pinref part="IC3" gate="G$1" pin="THR"/>
<wire x1="66.04" y1="132.08" x2="60.96" y2="132.08" width="0.1524" layer="91"/>
<junction x="60.96" y="132.08"/>
</segment>
</net>
<net name="GND" class="0">
<segment>
<pinref part="GND1" gate="1" pin="GND"/>
<pinref part="C2" gate="G$1" pin="P$1"/>
<wire x1="43.18" y1="88.9" x2="43.18" y2="91.44" width="0.1524" layer="91"/>
</segment>
<segment>
<pinref part="IC2" gate="G$2" pin="CA"/>
<pinref part="GND2" gate="1" pin="GND"/>
<wire x1="114.3" y1="88.9" x2="111.76" y2="88.9" width="0.1524" layer="91"/>
<wire x1="111.76" y1="88.9" x2="111.76" y2="83.82" width="0.1524" layer="91"/>
</segment>
<segment>
<pinref part="IC2" gate="PWR" pin="-"/>
<wire x1="99.06" y1="203.2" x2="99.06" y2="200.66" width="0.1524" layer="91"/>
<wire x1="99.06" y1="200.66" x2="91.44" y2="200.66" width="0.1524" layer="91"/>
<pinref part="C5" gate="G$1" pin="P$1"/>
<wire x1="91.44" y1="200.66" x2="91.44" y2="205.74" width="0.1524" layer="91"/>
<pinref part="C4" gate="G$1" pin="P$1"/>
<wire x1="71.12" y1="205.74" x2="71.12" y2="200.66" width="0.1524" layer="91"/>
<pinref part="IC1" gate="PWR" pin="-"/>
<wire x1="71.12" y1="200.66" x2="78.74" y2="200.66" width="0.1524" layer="91"/>
<wire x1="78.74" y1="200.66" x2="78.74" y2="203.2" width="0.1524" layer="91"/>
<pinref part="C3" gate="G$1" pin="P$1"/>
<wire x1="45.72" y1="205.74" x2="45.72" y2="200.66" width="0.1524" layer="91"/>
<wire x1="45.72" y1="200.66" x2="53.34" y2="200.66" width="0.1524" layer="91"/>
<pinref part="IC3" gate="PWR" pin="-"/>
<wire x1="53.34" y1="200.66" x2="53.34" y2="203.2" width="0.1524" layer="91"/>
<pinref part="X3" gate="G$1" pin="+"/>
<wire x1="22.86" y1="185.42" x2="25.4" y2="185.42" width="0.1524" layer="91"/>
<wire x1="25.4" y1="185.42" x2="25.4" y2="198.12" width="0.1524" layer="91"/>
<wire x1="25.4" y1="198.12" x2="25.4" y2="210.82" width="0.1524" layer="91"/>
<wire x1="25.4" y1="210.82" x2="22.86" y2="210.82" width="0.1524" layer="91"/>
<pinref part="GRN" gate="G$1" pin="C"/>
<wire x1="116.84" y1="200.66" x2="116.84" y2="198.12" width="0.1524" layer="91"/>
<pinref part="RED" gate="G$1" pin="C"/>
<wire x1="116.84" y1="198.12" x2="116.84" y2="195.58" width="0.1524" layer="91"/>
<wire x1="25.4" y1="198.12" x2="53.34" y2="198.12" width="0.1524" layer="91"/>
<junction x="25.4" y="198.12"/>
<junction x="116.84" y="198.12"/>
<wire x1="53.34" y1="198.12" x2="78.74" y2="198.12" width="0.1524" layer="91"/>
<wire x1="78.74" y1="198.12" x2="99.06" y2="198.12" width="0.1524" layer="91"/>
<wire x1="99.06" y1="198.12" x2="116.84" y2="198.12" width="0.1524" layer="91"/>
<wire x1="53.34" y1="200.66" x2="53.34" y2="198.12" width="0.1524" layer="91"/>
<junction x="53.34" y="200.66"/>
<junction x="53.34" y="198.12"/>
<wire x1="78.74" y1="200.66" x2="78.74" y2="198.12" width="0.1524" layer="91"/>
<junction x="78.74" y="200.66"/>
<junction x="78.74" y="198.12"/>
<wire x1="99.06" y1="200.66" x2="99.06" y2="198.12" width="0.1524" layer="91"/>
<junction x="99.06" y="200.66"/>
<junction x="99.06" y="198.12"/>
<pinref part="GND3" gate="1" pin="GND"/>
<wire x1="116.84" y1="198.12" x2="124.46" y2="198.12" width="0.1524" layer="91"/>
<wire x1="124.46" y1="198.12" x2="124.46" y2="195.58" width="0.1524" layer="91"/>
<pinref part="X1" gate="G$1" pin="-"/>
</segment>
</net>
<net name="+12V" class="0">
<segment>
<pinref part="IC3" gate="G$1" pin="RST"/>
<wire x1="86.36" y1="127" x2="96.52" y2="127" width="0.1524" layer="91"/>
<wire x1="96.52" y1="127" x2="96.52" y2="142.24" width="0.1524" layer="91"/>
<pinref part="P+5" gate="1" pin="+12V"/>
</segment>
<segment>
<pinref part="R8" gate="G$1" pin="P$2"/>
<pinref part="P+6" gate="1" pin="+12V"/>
<wire x1="43.18" y1="165.1" x2="43.18" y2="162.56" width="0.1524" layer="91"/>
</segment>
<segment>
<pinref part="R1" gate="G$1" pin="P$2"/>
<pinref part="P+3" gate="1" pin="+12V"/>
<wire x1="99.06" y1="109.22" x2="96.52" y2="109.22" width="0.1524" layer="91"/>
<wire x1="96.52" y1="109.22" x2="96.52" y2="114.3" width="0.1524" layer="91"/>
</segment>
<segment>
<pinref part="FET2" gate="G$1" pin="S"/>
<wire x1="213.36" y1="149.86" x2="213.36" y2="152.4" width="0.1524" layer="91"/>
<pinref part="FET1" gate="G$1" pin="S"/>
<wire x1="213.36" y1="152.4" x2="195.58" y2="152.4" width="0.1524" layer="91"/>
<wire x1="195.58" y1="152.4" x2="177.8" y2="152.4" width="0.1524" layer="91"/>
<wire x1="177.8" y1="152.4" x2="177.8" y2="149.86" width="0.1524" layer="91"/>
<pinref part="P+1" gate="1" pin="+12V"/>
<wire x1="195.58" y1="154.94" x2="195.58" y2="152.4" width="0.1524" layer="91"/>
<junction x="195.58" y="152.4"/>
</segment>
<segment>
<pinref part="IC3" gate="PWR" pin="+"/>
<wire x1="53.34" y1="218.44" x2="53.34" y2="220.98" width="0.1524" layer="91"/>
<wire x1="53.34" y1="220.98" x2="45.72" y2="220.98" width="0.1524" layer="91"/>
<pinref part="C3" gate="G$1" pin="P$2"/>
<wire x1="45.72" y1="220.98" x2="45.72" y2="215.9" width="0.1524" layer="91"/>
<pinref part="C4" gate="G$1" pin="P$2"/>
<wire x1="71.12" y1="215.9" x2="71.12" y2="220.98" width="0.1524" layer="91"/>
<pinref part="IC1" gate="PWR" pin="+"/>
<wire x1="71.12" y1="220.98" x2="78.74" y2="220.98" width="0.1524" layer="91"/>
<wire x1="78.74" y1="220.98" x2="78.74" y2="218.44" width="0.1524" layer="91"/>
<pinref part="C5" gate="G$1" pin="P$2"/>
<wire x1="91.44" y1="215.9" x2="91.44" y2="220.98" width="0.1524" layer="91"/>
<wire x1="91.44" y1="220.98" x2="99.06" y2="220.98" width="0.1524" layer="91"/>
<pinref part="IC2" gate="PWR" pin="+"/>
<wire x1="99.06" y1="220.98" x2="99.06" y2="218.44" width="0.1524" layer="91"/>
<wire x1="99.06" y1="220.98" x2="99.06" y2="223.52" width="0.1524" layer="91"/>
<junction x="99.06" y="220.98"/>
<wire x1="99.06" y1="223.52" x2="116.84" y2="223.52" width="0.1524" layer="91"/>
<pinref part="R10" gate="G$1" pin="P$2"/>
<wire x1="116.84" y1="223.52" x2="116.84" y2="218.44" width="0.1524" layer="91"/>
<wire x1="78.74" y1="220.98" x2="78.74" y2="223.52" width="0.1524" layer="91"/>
<wire x1="78.74" y1="223.52" x2="99.06" y2="223.52" width="0.1524" layer="91"/>
<junction x="78.74" y="220.98"/>
<junction x="99.06" y="223.52"/>
<wire x1="53.34" y1="220.98" x2="53.34" y2="223.52" width="0.1524" layer="91"/>
<wire x1="53.34" y1="223.52" x2="78.74" y2="223.52" width="0.1524" layer="91"/>
<junction x="53.34" y="220.98"/>
<junction x="78.74" y="223.52"/>
<wire x1="53.34" y1="223.52" x2="25.4" y2="223.52" width="0.1524" layer="91"/>
<wire x1="25.4" y1="223.52" x2="25.4" y2="215.9" width="0.1524" layer="91"/>
<junction x="53.34" y="223.52"/>
<wire x1="25.4" y1="215.9" x2="22.86" y2="215.9" width="0.1524" layer="91"/>
<pinref part="P+2" gate="1" pin="+12V"/>
<wire x1="116.84" y1="226.06" x2="116.84" y2="223.52" width="0.1524" layer="91"/>
<junction x="116.84" y="223.52"/>
<pinref part="X1" gate="G$1" pin="+"/>
</segment>
</net>
<net name="N$6" class="0">
<segment>
<pinref part="R2" gate="G$1" pin="P$1"/>
<pinref part="IC2" gate="G$2" pin="AN"/>
<wire x1="114.3" y1="93.98" x2="109.22" y2="93.98" width="0.1524" layer="91"/>
</segment>
</net>
<net name="N$7" class="0">
<segment>
<pinref part="R1" gate="G$1" pin="P$1"/>
<pinref part="IC1" gate="G$2" pin="AN"/>
<wire x1="109.22" y1="109.22" x2="114.3" y2="109.22" width="0.1524" layer="91"/>
</segment>
</net>
<net name="N$5" class="0">
<segment>
<pinref part="IC3" gate="G$1" pin="OUT"/>
<wire x1="86.36" y1="137.16" x2="88.9" y2="137.16" width="0.1524" layer="91"/>
<wire x1="88.9" y1="137.16" x2="88.9" y2="104.14" width="0.1524" layer="91"/>
<pinref part="R2" gate="G$1" pin="P$2"/>
<wire x1="88.9" y1="104.14" x2="88.9" y2="93.98" width="0.1524" layer="91"/>
<wire x1="88.9" y1="93.98" x2="99.06" y2="93.98" width="0.1524" layer="91"/>
<pinref part="IC1" gate="G$2" pin="CA"/>
<wire x1="114.3" y1="104.14" x2="88.9" y2="104.14" width="0.1524" layer="91"/>
<junction x="88.9" y="104.14"/>
</segment>
</net>
<net name="N$8" class="0">
<segment>
<pinref part="IC1" gate="G$2" pin="VO1"/>
<wire x1="134.62" y1="109.22" x2="144.78" y2="109.22" width="0.1524" layer="91"/>
<wire x1="144.78" y1="109.22" x2="144.78" y2="119.38" width="0.1524" layer="91"/>
<pinref part="R3" gate="G$1" pin="P$2"/>
<wire x1="144.78" y1="119.38" x2="144.78" y2="147.32" width="0.1524" layer="91"/>
<wire x1="144.78" y1="147.32" x2="160.02" y2="147.32" width="0.1524" layer="91"/>
<pinref part="R4" gate="G$1" pin="P$2"/>
<wire x1="157.48" y1="119.38" x2="144.78" y2="119.38" width="0.1524" layer="91"/>
<junction x="144.78" y="119.38"/>
<pinref part="IC1" gate="G$2" pin="VO2"/>
<wire x1="144.78" y1="109.22" x2="144.78" y2="104.14" width="0.1524" layer="91"/>
<wire x1="144.78" y1="104.14" x2="134.62" y2="104.14" width="0.1524" layer="91"/>
<junction x="144.78" y="109.22"/>
</segment>
</net>
<net name="N$9" class="0">
<segment>
<pinref part="R4" gate="G$1" pin="P$1"/>
<pinref part="FET3" gate="G$1" pin="G"/>
<wire x1="167.64" y1="119.38" x2="170.18" y2="119.38" width="0.1524" layer="91"/>
</segment>
</net>
<net name="N$10" class="0">
<segment>
<pinref part="FET1" gate="G$1" pin="G"/>
<pinref part="R3" gate="G$1" pin="P$1"/>
<wire x1="172.72" y1="147.32" x2="170.18" y2="147.32" width="0.1524" layer="91"/>
</segment>
</net>
<net name="N$11" class="0">
<segment>
<pinref part="IC2" gate="G$2" pin="VO1"/>
<wire x1="134.62" y1="93.98" x2="144.78" y2="93.98" width="0.1524" layer="91"/>
<wire x1="144.78" y1="93.98" x2="238.76" y2="93.98" width="0.1524" layer="91"/>
<wire x1="238.76" y1="93.98" x2="238.76" y2="119.38" width="0.1524" layer="91"/>
<pinref part="R6" gate="G$1" pin="P$1"/>
<wire x1="238.76" y1="119.38" x2="238.76" y2="147.32" width="0.1524" layer="91"/>
<wire x1="238.76" y1="147.32" x2="231.14" y2="147.32" width="0.1524" layer="91"/>
<pinref part="R5" gate="G$1" pin="P$1"/>
<wire x1="233.68" y1="119.38" x2="238.76" y2="119.38" width="0.1524" layer="91"/>
<pinref part="IC2" gate="G$2" pin="VO2"/>
<wire x1="134.62" y1="88.9" x2="144.78" y2="88.9" width="0.1524" layer="91"/>
<wire x1="144.78" y1="88.9" x2="144.78" y2="93.98" width="0.1524" layer="91"/>
<junction x="144.78" y="93.98"/>
<junction x="238.76" y="119.38"/>
</segment>
</net>
<net name="N$12" class="0">
<segment>
<pinref part="R5" gate="G$1" pin="P$2"/>
<pinref part="FET4" gate="G$1" pin="G"/>
<wire x1="220.98" y1="119.38" x2="223.52" y2="119.38" width="0.1524" layer="91"/>
</segment>
</net>
<net name="N$13" class="0">
<segment>
<pinref part="R6" gate="G$1" pin="P$2"/>
<pinref part="FET2" gate="G$1" pin="G"/>
<wire x1="218.44" y1="147.32" x2="220.98" y2="147.32" width="0.1524" layer="91"/>
</segment>
</net>
<net name="N$15" class="0">
<segment>
<pinref part="FET4" gate="G$1" pin="D"/>
<pinref part="FET2" gate="G$1" pin="D"/>
<wire x1="213.36" y1="127" x2="213.36" y2="137.16" width="0.1524" layer="91"/>
<pinref part="X2" gate="G$1" pin="-"/>
<wire x1="213.36" y1="137.16" x2="213.36" y2="139.7" width="0.1524" layer="91"/>
<wire x1="198.12" y1="134.62" x2="198.12" y2="137.16" width="0.1524" layer="91"/>
<wire x1="198.12" y1="137.16" x2="213.36" y2="137.16" width="0.1524" layer="91"/>
<junction x="213.36" y="137.16"/>
</segment>
</net>
<net name="-12V" class="0">
<segment>
<pinref part="FET3" gate="G$1" pin="S"/>
<wire x1="177.8" y1="116.84" x2="177.8" y2="111.76" width="0.1524" layer="91"/>
<wire x1="177.8" y1="111.76" x2="195.58" y2="111.76" width="0.1524" layer="91"/>
<pinref part="FET4" gate="G$1" pin="S"/>
<wire x1="195.58" y1="111.76" x2="213.36" y2="111.76" width="0.1524" layer="91"/>
<wire x1="213.36" y1="111.76" x2="213.36" y2="116.84" width="0.1524" layer="91"/>
<pinref part="P-1" gate="1" pin="-12V"/>
<wire x1="195.58" y1="106.68" x2="195.58" y2="111.76" width="0.1524" layer="91"/>
<junction x="195.58" y="111.76"/>
</segment>
<segment>
<pinref part="R11" gate="G$1" pin="P$1"/>
<wire x1="116.84" y1="177.8" x2="116.84" y2="172.72" width="0.1524" layer="91"/>
<wire x1="116.84" y1="172.72" x2="25.4" y2="172.72" width="0.1524" layer="91"/>
<wire x1="25.4" y1="172.72" x2="25.4" y2="180.34" width="0.1524" layer="91"/>
<wire x1="25.4" y1="180.34" x2="22.86" y2="180.34" width="0.1524" layer="91"/>
<pinref part="X3" gate="G$1" pin="-"/>
<pinref part="P-2" gate="1" pin="-12V"/>
<wire x1="116.84" y1="170.18" x2="116.84" y2="172.72" width="0.1524" layer="91"/>
<junction x="116.84" y="172.72"/>
</segment>
</net>
<net name="N$14" class="0">
<segment>
<pinref part="FET3" gate="G$1" pin="D"/>
<pinref part="FET1" gate="G$1" pin="D"/>
<wire x1="177.8" y1="127" x2="177.8" y2="137.16" width="0.1524" layer="91"/>
<pinref part="C1" gate="G$1" pin="P$2"/>
<wire x1="177.8" y1="137.16" x2="177.8" y2="139.7" width="0.1524" layer="91"/>
<wire x1="180.34" y1="137.16" x2="177.8" y2="137.16" width="0.1524" layer="91"/>
<junction x="177.8" y="137.16"/>
</segment>
</net>
<net name="N$16" class="0">
<segment>
<pinref part="C1" gate="G$1" pin="P$1"/>
<pinref part="X2" gate="G$1" pin="+"/>
<wire x1="190.5" y1="137.16" x2="193.04" y2="137.16" width="0.1524" layer="91"/>
<wire x1="193.04" y1="137.16" x2="193.04" y2="134.62" width="0.1524" layer="91"/>
</segment>
</net>
<net name="N$23" class="0">
<segment>
<pinref part="R10" gate="G$1" pin="P$1"/>
<pinref part="GRN" gate="G$1" pin="A"/>
<wire x1="116.84" y1="208.28" x2="116.84" y2="205.74" width="0.1524" layer="91"/>
</segment>
</net>
<net name="N$25" class="0">
<segment>
<pinref part="RED" gate="G$1" pin="A"/>
<pinref part="R11" gate="G$1" pin="P$2"/>
<wire x1="116.84" y1="190.5" x2="116.84" y2="187.96" width="0.1524" layer="91"/>
</segment>
</net>
</nets>
</sheet>
</sheets>
</schematic>
</drawing>
<compatibility>
<note version="8.2" severity="warning">
Since Version 8.2, EAGLE supports online libraries. The ids
of those online libraries will not be understood (or retained)
with this version.
</note>
<note version="8.3" severity="warning">
Since Version 8.3, EAGLE supports URNs for individual library
assets (packages, symbols, and devices). The URNs of those assets
will not be understood (or retained) with this version.
</note>
<note version="8.3" severity="warning">
Since Version 8.3, EAGLE supports the association of 3D packages
with devices in libraries, schematics, and board files. Those 3D
packages will not be understood (or retained) with this version.
</note>
</compatibility>
</eagle>
