G04 EAGLE Gerber RS-274X export*
G75*
%MOMM*%
%FSLAX34Y34*%
%LPD*%
%IN*%
%IPPOS*%
%AMOC8*
5,1,8,0,0,1.08239X$1,22.5*%
G01*
%ADD10C,0.000000*%
%ADD11C,0.200000*%


D10*
X15875Y9525D02*
X193475Y9525D01*
X193475Y218950D01*
X15875Y218950D01*
X15875Y9525D01*
X23050Y32700D02*
X23055Y33093D01*
X23069Y33485D01*
X23093Y33877D01*
X23127Y34268D01*
X23170Y34659D01*
X23223Y35048D01*
X23286Y35435D01*
X23357Y35821D01*
X23439Y36206D01*
X23529Y36588D01*
X23630Y36967D01*
X23739Y37345D01*
X23858Y37719D01*
X23985Y38090D01*
X24122Y38458D01*
X24268Y38823D01*
X24423Y39184D01*
X24586Y39541D01*
X24758Y39894D01*
X24939Y40242D01*
X25129Y40586D01*
X25326Y40926D01*
X25532Y41260D01*
X25746Y41589D01*
X25969Y41913D01*
X26199Y42231D01*
X26436Y42544D01*
X26682Y42850D01*
X26935Y43151D01*
X27195Y43445D01*
X27462Y43733D01*
X27736Y44014D01*
X28017Y44288D01*
X28305Y44555D01*
X28599Y44815D01*
X28900Y45068D01*
X29206Y45314D01*
X29519Y45551D01*
X29837Y45781D01*
X30161Y46004D01*
X30490Y46218D01*
X30824Y46424D01*
X31164Y46621D01*
X31508Y46811D01*
X31856Y46992D01*
X32209Y47164D01*
X32566Y47327D01*
X32927Y47482D01*
X33292Y47628D01*
X33660Y47765D01*
X34031Y47892D01*
X34405Y48011D01*
X34783Y48120D01*
X35162Y48221D01*
X35544Y48311D01*
X35929Y48393D01*
X36315Y48464D01*
X36702Y48527D01*
X37091Y48580D01*
X37482Y48623D01*
X37873Y48657D01*
X38265Y48681D01*
X38657Y48695D01*
X39050Y48700D01*
X39443Y48695D01*
X39835Y48681D01*
X40227Y48657D01*
X40618Y48623D01*
X41009Y48580D01*
X41398Y48527D01*
X41785Y48464D01*
X42171Y48393D01*
X42556Y48311D01*
X42938Y48221D01*
X43317Y48120D01*
X43695Y48011D01*
X44069Y47892D01*
X44440Y47765D01*
X44808Y47628D01*
X45173Y47482D01*
X45534Y47327D01*
X45891Y47164D01*
X46244Y46992D01*
X46592Y46811D01*
X46936Y46621D01*
X47276Y46424D01*
X47610Y46218D01*
X47939Y46004D01*
X48263Y45781D01*
X48581Y45551D01*
X48894Y45314D01*
X49200Y45068D01*
X49501Y44815D01*
X49795Y44555D01*
X50083Y44288D01*
X50364Y44014D01*
X50638Y43733D01*
X50905Y43445D01*
X51165Y43151D01*
X51418Y42850D01*
X51664Y42544D01*
X51901Y42231D01*
X52131Y41913D01*
X52354Y41589D01*
X52568Y41260D01*
X52774Y40926D01*
X52971Y40586D01*
X53161Y40242D01*
X53342Y39894D01*
X53514Y39541D01*
X53677Y39184D01*
X53832Y38823D01*
X53978Y38458D01*
X54115Y38090D01*
X54242Y37719D01*
X54361Y37345D01*
X54470Y36967D01*
X54571Y36588D01*
X54661Y36206D01*
X54743Y35821D01*
X54814Y35435D01*
X54877Y35048D01*
X54930Y34659D01*
X54973Y34268D01*
X55007Y33877D01*
X55031Y33485D01*
X55045Y33093D01*
X55050Y32700D01*
X55045Y32307D01*
X55031Y31915D01*
X55007Y31523D01*
X54973Y31132D01*
X54930Y30741D01*
X54877Y30352D01*
X54814Y29965D01*
X54743Y29579D01*
X54661Y29194D01*
X54571Y28812D01*
X54470Y28433D01*
X54361Y28055D01*
X54242Y27681D01*
X54115Y27310D01*
X53978Y26942D01*
X53832Y26577D01*
X53677Y26216D01*
X53514Y25859D01*
X53342Y25506D01*
X53161Y25158D01*
X52971Y24814D01*
X52774Y24474D01*
X52568Y24140D01*
X52354Y23811D01*
X52131Y23487D01*
X51901Y23169D01*
X51664Y22856D01*
X51418Y22550D01*
X51165Y22249D01*
X50905Y21955D01*
X50638Y21667D01*
X50364Y21386D01*
X50083Y21112D01*
X49795Y20845D01*
X49501Y20585D01*
X49200Y20332D01*
X48894Y20086D01*
X48581Y19849D01*
X48263Y19619D01*
X47939Y19396D01*
X47610Y19182D01*
X47276Y18976D01*
X46936Y18779D01*
X46592Y18589D01*
X46244Y18408D01*
X45891Y18236D01*
X45534Y18073D01*
X45173Y17918D01*
X44808Y17772D01*
X44440Y17635D01*
X44069Y17508D01*
X43695Y17389D01*
X43317Y17280D01*
X42938Y17179D01*
X42556Y17089D01*
X42171Y17007D01*
X41785Y16936D01*
X41398Y16873D01*
X41009Y16820D01*
X40618Y16777D01*
X40227Y16743D01*
X39835Y16719D01*
X39443Y16705D01*
X39050Y16700D01*
X38657Y16705D01*
X38265Y16719D01*
X37873Y16743D01*
X37482Y16777D01*
X37091Y16820D01*
X36702Y16873D01*
X36315Y16936D01*
X35929Y17007D01*
X35544Y17089D01*
X35162Y17179D01*
X34783Y17280D01*
X34405Y17389D01*
X34031Y17508D01*
X33660Y17635D01*
X33292Y17772D01*
X32927Y17918D01*
X32566Y18073D01*
X32209Y18236D01*
X31856Y18408D01*
X31508Y18589D01*
X31164Y18779D01*
X30824Y18976D01*
X30490Y19182D01*
X30161Y19396D01*
X29837Y19619D01*
X29519Y19849D01*
X29206Y20086D01*
X28900Y20332D01*
X28599Y20585D01*
X28305Y20845D01*
X28017Y21112D01*
X27736Y21386D01*
X27462Y21667D01*
X27195Y21955D01*
X26935Y22249D01*
X26682Y22550D01*
X26436Y22856D01*
X26199Y23169D01*
X25969Y23487D01*
X25746Y23811D01*
X25532Y24140D01*
X25326Y24474D01*
X25129Y24814D01*
X24939Y25158D01*
X24758Y25506D01*
X24586Y25859D01*
X24423Y26216D01*
X24268Y26577D01*
X24122Y26942D01*
X23985Y27310D01*
X23858Y27681D01*
X23739Y28055D01*
X23630Y28433D01*
X23529Y28812D01*
X23439Y29194D01*
X23357Y29579D01*
X23286Y29965D01*
X23223Y30352D01*
X23170Y30741D01*
X23127Y31132D01*
X23093Y31523D01*
X23069Y31915D01*
X23055Y32307D01*
X23050Y32700D01*
X153050Y32700D02*
X153055Y33093D01*
X153069Y33485D01*
X153093Y33877D01*
X153127Y34268D01*
X153170Y34659D01*
X153223Y35048D01*
X153286Y35435D01*
X153357Y35821D01*
X153439Y36206D01*
X153529Y36588D01*
X153630Y36967D01*
X153739Y37345D01*
X153858Y37719D01*
X153985Y38090D01*
X154122Y38458D01*
X154268Y38823D01*
X154423Y39184D01*
X154586Y39541D01*
X154758Y39894D01*
X154939Y40242D01*
X155129Y40586D01*
X155326Y40926D01*
X155532Y41260D01*
X155746Y41589D01*
X155969Y41913D01*
X156199Y42231D01*
X156436Y42544D01*
X156682Y42850D01*
X156935Y43151D01*
X157195Y43445D01*
X157462Y43733D01*
X157736Y44014D01*
X158017Y44288D01*
X158305Y44555D01*
X158599Y44815D01*
X158900Y45068D01*
X159206Y45314D01*
X159519Y45551D01*
X159837Y45781D01*
X160161Y46004D01*
X160490Y46218D01*
X160824Y46424D01*
X161164Y46621D01*
X161508Y46811D01*
X161856Y46992D01*
X162209Y47164D01*
X162566Y47327D01*
X162927Y47482D01*
X163292Y47628D01*
X163660Y47765D01*
X164031Y47892D01*
X164405Y48011D01*
X164783Y48120D01*
X165162Y48221D01*
X165544Y48311D01*
X165929Y48393D01*
X166315Y48464D01*
X166702Y48527D01*
X167091Y48580D01*
X167482Y48623D01*
X167873Y48657D01*
X168265Y48681D01*
X168657Y48695D01*
X169050Y48700D01*
X169443Y48695D01*
X169835Y48681D01*
X170227Y48657D01*
X170618Y48623D01*
X171009Y48580D01*
X171398Y48527D01*
X171785Y48464D01*
X172171Y48393D01*
X172556Y48311D01*
X172938Y48221D01*
X173317Y48120D01*
X173695Y48011D01*
X174069Y47892D01*
X174440Y47765D01*
X174808Y47628D01*
X175173Y47482D01*
X175534Y47327D01*
X175891Y47164D01*
X176244Y46992D01*
X176592Y46811D01*
X176936Y46621D01*
X177276Y46424D01*
X177610Y46218D01*
X177939Y46004D01*
X178263Y45781D01*
X178581Y45551D01*
X178894Y45314D01*
X179200Y45068D01*
X179501Y44815D01*
X179795Y44555D01*
X180083Y44288D01*
X180364Y44014D01*
X180638Y43733D01*
X180905Y43445D01*
X181165Y43151D01*
X181418Y42850D01*
X181664Y42544D01*
X181901Y42231D01*
X182131Y41913D01*
X182354Y41589D01*
X182568Y41260D01*
X182774Y40926D01*
X182971Y40586D01*
X183161Y40242D01*
X183342Y39894D01*
X183514Y39541D01*
X183677Y39184D01*
X183832Y38823D01*
X183978Y38458D01*
X184115Y38090D01*
X184242Y37719D01*
X184361Y37345D01*
X184470Y36967D01*
X184571Y36588D01*
X184661Y36206D01*
X184743Y35821D01*
X184814Y35435D01*
X184877Y35048D01*
X184930Y34659D01*
X184973Y34268D01*
X185007Y33877D01*
X185031Y33485D01*
X185045Y33093D01*
X185050Y32700D01*
X185045Y32307D01*
X185031Y31915D01*
X185007Y31523D01*
X184973Y31132D01*
X184930Y30741D01*
X184877Y30352D01*
X184814Y29965D01*
X184743Y29579D01*
X184661Y29194D01*
X184571Y28812D01*
X184470Y28433D01*
X184361Y28055D01*
X184242Y27681D01*
X184115Y27310D01*
X183978Y26942D01*
X183832Y26577D01*
X183677Y26216D01*
X183514Y25859D01*
X183342Y25506D01*
X183161Y25158D01*
X182971Y24814D01*
X182774Y24474D01*
X182568Y24140D01*
X182354Y23811D01*
X182131Y23487D01*
X181901Y23169D01*
X181664Y22856D01*
X181418Y22550D01*
X181165Y22249D01*
X180905Y21955D01*
X180638Y21667D01*
X180364Y21386D01*
X180083Y21112D01*
X179795Y20845D01*
X179501Y20585D01*
X179200Y20332D01*
X178894Y20086D01*
X178581Y19849D01*
X178263Y19619D01*
X177939Y19396D01*
X177610Y19182D01*
X177276Y18976D01*
X176936Y18779D01*
X176592Y18589D01*
X176244Y18408D01*
X175891Y18236D01*
X175534Y18073D01*
X175173Y17918D01*
X174808Y17772D01*
X174440Y17635D01*
X174069Y17508D01*
X173695Y17389D01*
X173317Y17280D01*
X172938Y17179D01*
X172556Y17089D01*
X172171Y17007D01*
X171785Y16936D01*
X171398Y16873D01*
X171009Y16820D01*
X170618Y16777D01*
X170227Y16743D01*
X169835Y16719D01*
X169443Y16705D01*
X169050Y16700D01*
X168657Y16705D01*
X168265Y16719D01*
X167873Y16743D01*
X167482Y16777D01*
X167091Y16820D01*
X166702Y16873D01*
X166315Y16936D01*
X165929Y17007D01*
X165544Y17089D01*
X165162Y17179D01*
X164783Y17280D01*
X164405Y17389D01*
X164031Y17508D01*
X163660Y17635D01*
X163292Y17772D01*
X162927Y17918D01*
X162566Y18073D01*
X162209Y18236D01*
X161856Y18408D01*
X161508Y18589D01*
X161164Y18779D01*
X160824Y18976D01*
X160490Y19182D01*
X160161Y19396D01*
X159837Y19619D01*
X159519Y19849D01*
X159206Y20086D01*
X158900Y20332D01*
X158599Y20585D01*
X158305Y20845D01*
X158017Y21112D01*
X157736Y21386D01*
X157462Y21667D01*
X157195Y21955D01*
X156935Y22249D01*
X156682Y22550D01*
X156436Y22856D01*
X156199Y23169D01*
X155969Y23487D01*
X155746Y23811D01*
X155532Y24140D01*
X155326Y24474D01*
X155129Y24814D01*
X154939Y25158D01*
X154758Y25506D01*
X154586Y25859D01*
X154423Y26216D01*
X154268Y26577D01*
X154122Y26942D01*
X153985Y27310D01*
X153858Y27681D01*
X153739Y28055D01*
X153630Y28433D01*
X153529Y28812D01*
X153439Y29194D01*
X153357Y29579D01*
X153286Y29965D01*
X153223Y30352D01*
X153170Y30741D01*
X153127Y31132D01*
X153093Y31523D01*
X153069Y31915D01*
X153055Y32307D01*
X153050Y32700D01*
X153050Y194600D02*
X153055Y194993D01*
X153069Y195385D01*
X153093Y195777D01*
X153127Y196168D01*
X153170Y196559D01*
X153223Y196948D01*
X153286Y197335D01*
X153357Y197721D01*
X153439Y198106D01*
X153529Y198488D01*
X153630Y198867D01*
X153739Y199245D01*
X153858Y199619D01*
X153985Y199990D01*
X154122Y200358D01*
X154268Y200723D01*
X154423Y201084D01*
X154586Y201441D01*
X154758Y201794D01*
X154939Y202142D01*
X155129Y202486D01*
X155326Y202826D01*
X155532Y203160D01*
X155746Y203489D01*
X155969Y203813D01*
X156199Y204131D01*
X156436Y204444D01*
X156682Y204750D01*
X156935Y205051D01*
X157195Y205345D01*
X157462Y205633D01*
X157736Y205914D01*
X158017Y206188D01*
X158305Y206455D01*
X158599Y206715D01*
X158900Y206968D01*
X159206Y207214D01*
X159519Y207451D01*
X159837Y207681D01*
X160161Y207904D01*
X160490Y208118D01*
X160824Y208324D01*
X161164Y208521D01*
X161508Y208711D01*
X161856Y208892D01*
X162209Y209064D01*
X162566Y209227D01*
X162927Y209382D01*
X163292Y209528D01*
X163660Y209665D01*
X164031Y209792D01*
X164405Y209911D01*
X164783Y210020D01*
X165162Y210121D01*
X165544Y210211D01*
X165929Y210293D01*
X166315Y210364D01*
X166702Y210427D01*
X167091Y210480D01*
X167482Y210523D01*
X167873Y210557D01*
X168265Y210581D01*
X168657Y210595D01*
X169050Y210600D01*
X169443Y210595D01*
X169835Y210581D01*
X170227Y210557D01*
X170618Y210523D01*
X171009Y210480D01*
X171398Y210427D01*
X171785Y210364D01*
X172171Y210293D01*
X172556Y210211D01*
X172938Y210121D01*
X173317Y210020D01*
X173695Y209911D01*
X174069Y209792D01*
X174440Y209665D01*
X174808Y209528D01*
X175173Y209382D01*
X175534Y209227D01*
X175891Y209064D01*
X176244Y208892D01*
X176592Y208711D01*
X176936Y208521D01*
X177276Y208324D01*
X177610Y208118D01*
X177939Y207904D01*
X178263Y207681D01*
X178581Y207451D01*
X178894Y207214D01*
X179200Y206968D01*
X179501Y206715D01*
X179795Y206455D01*
X180083Y206188D01*
X180364Y205914D01*
X180638Y205633D01*
X180905Y205345D01*
X181165Y205051D01*
X181418Y204750D01*
X181664Y204444D01*
X181901Y204131D01*
X182131Y203813D01*
X182354Y203489D01*
X182568Y203160D01*
X182774Y202826D01*
X182971Y202486D01*
X183161Y202142D01*
X183342Y201794D01*
X183514Y201441D01*
X183677Y201084D01*
X183832Y200723D01*
X183978Y200358D01*
X184115Y199990D01*
X184242Y199619D01*
X184361Y199245D01*
X184470Y198867D01*
X184571Y198488D01*
X184661Y198106D01*
X184743Y197721D01*
X184814Y197335D01*
X184877Y196948D01*
X184930Y196559D01*
X184973Y196168D01*
X185007Y195777D01*
X185031Y195385D01*
X185045Y194993D01*
X185050Y194600D01*
X185045Y194207D01*
X185031Y193815D01*
X185007Y193423D01*
X184973Y193032D01*
X184930Y192641D01*
X184877Y192252D01*
X184814Y191865D01*
X184743Y191479D01*
X184661Y191094D01*
X184571Y190712D01*
X184470Y190333D01*
X184361Y189955D01*
X184242Y189581D01*
X184115Y189210D01*
X183978Y188842D01*
X183832Y188477D01*
X183677Y188116D01*
X183514Y187759D01*
X183342Y187406D01*
X183161Y187058D01*
X182971Y186714D01*
X182774Y186374D01*
X182568Y186040D01*
X182354Y185711D01*
X182131Y185387D01*
X181901Y185069D01*
X181664Y184756D01*
X181418Y184450D01*
X181165Y184149D01*
X180905Y183855D01*
X180638Y183567D01*
X180364Y183286D01*
X180083Y183012D01*
X179795Y182745D01*
X179501Y182485D01*
X179200Y182232D01*
X178894Y181986D01*
X178581Y181749D01*
X178263Y181519D01*
X177939Y181296D01*
X177610Y181082D01*
X177276Y180876D01*
X176936Y180679D01*
X176592Y180489D01*
X176244Y180308D01*
X175891Y180136D01*
X175534Y179973D01*
X175173Y179818D01*
X174808Y179672D01*
X174440Y179535D01*
X174069Y179408D01*
X173695Y179289D01*
X173317Y179180D01*
X172938Y179079D01*
X172556Y178989D01*
X172171Y178907D01*
X171785Y178836D01*
X171398Y178773D01*
X171009Y178720D01*
X170618Y178677D01*
X170227Y178643D01*
X169835Y178619D01*
X169443Y178605D01*
X169050Y178600D01*
X168657Y178605D01*
X168265Y178619D01*
X167873Y178643D01*
X167482Y178677D01*
X167091Y178720D01*
X166702Y178773D01*
X166315Y178836D01*
X165929Y178907D01*
X165544Y178989D01*
X165162Y179079D01*
X164783Y179180D01*
X164405Y179289D01*
X164031Y179408D01*
X163660Y179535D01*
X163292Y179672D01*
X162927Y179818D01*
X162566Y179973D01*
X162209Y180136D01*
X161856Y180308D01*
X161508Y180489D01*
X161164Y180679D01*
X160824Y180876D01*
X160490Y181082D01*
X160161Y181296D01*
X159837Y181519D01*
X159519Y181749D01*
X159206Y181986D01*
X158900Y182232D01*
X158599Y182485D01*
X158305Y182745D01*
X158017Y183012D01*
X157736Y183286D01*
X157462Y183567D01*
X157195Y183855D01*
X156935Y184149D01*
X156682Y184450D01*
X156436Y184756D01*
X156199Y185069D01*
X155969Y185387D01*
X155746Y185711D01*
X155532Y186040D01*
X155326Y186374D01*
X155129Y186714D01*
X154939Y187058D01*
X154758Y187406D01*
X154586Y187759D01*
X154423Y188116D01*
X154268Y188477D01*
X154122Y188842D01*
X153985Y189210D01*
X153858Y189581D01*
X153739Y189955D01*
X153630Y190333D01*
X153529Y190712D01*
X153439Y191094D01*
X153357Y191479D01*
X153286Y191865D01*
X153223Y192252D01*
X153170Y192641D01*
X153127Y193032D01*
X153093Y193423D01*
X153069Y193815D01*
X153055Y194207D01*
X153050Y194600D01*
X23050Y194600D02*
X23055Y194993D01*
X23069Y195385D01*
X23093Y195777D01*
X23127Y196168D01*
X23170Y196559D01*
X23223Y196948D01*
X23286Y197335D01*
X23357Y197721D01*
X23439Y198106D01*
X23529Y198488D01*
X23630Y198867D01*
X23739Y199245D01*
X23858Y199619D01*
X23985Y199990D01*
X24122Y200358D01*
X24268Y200723D01*
X24423Y201084D01*
X24586Y201441D01*
X24758Y201794D01*
X24939Y202142D01*
X25129Y202486D01*
X25326Y202826D01*
X25532Y203160D01*
X25746Y203489D01*
X25969Y203813D01*
X26199Y204131D01*
X26436Y204444D01*
X26682Y204750D01*
X26935Y205051D01*
X27195Y205345D01*
X27462Y205633D01*
X27736Y205914D01*
X28017Y206188D01*
X28305Y206455D01*
X28599Y206715D01*
X28900Y206968D01*
X29206Y207214D01*
X29519Y207451D01*
X29837Y207681D01*
X30161Y207904D01*
X30490Y208118D01*
X30824Y208324D01*
X31164Y208521D01*
X31508Y208711D01*
X31856Y208892D01*
X32209Y209064D01*
X32566Y209227D01*
X32927Y209382D01*
X33292Y209528D01*
X33660Y209665D01*
X34031Y209792D01*
X34405Y209911D01*
X34783Y210020D01*
X35162Y210121D01*
X35544Y210211D01*
X35929Y210293D01*
X36315Y210364D01*
X36702Y210427D01*
X37091Y210480D01*
X37482Y210523D01*
X37873Y210557D01*
X38265Y210581D01*
X38657Y210595D01*
X39050Y210600D01*
X39443Y210595D01*
X39835Y210581D01*
X40227Y210557D01*
X40618Y210523D01*
X41009Y210480D01*
X41398Y210427D01*
X41785Y210364D01*
X42171Y210293D01*
X42556Y210211D01*
X42938Y210121D01*
X43317Y210020D01*
X43695Y209911D01*
X44069Y209792D01*
X44440Y209665D01*
X44808Y209528D01*
X45173Y209382D01*
X45534Y209227D01*
X45891Y209064D01*
X46244Y208892D01*
X46592Y208711D01*
X46936Y208521D01*
X47276Y208324D01*
X47610Y208118D01*
X47939Y207904D01*
X48263Y207681D01*
X48581Y207451D01*
X48894Y207214D01*
X49200Y206968D01*
X49501Y206715D01*
X49795Y206455D01*
X50083Y206188D01*
X50364Y205914D01*
X50638Y205633D01*
X50905Y205345D01*
X51165Y205051D01*
X51418Y204750D01*
X51664Y204444D01*
X51901Y204131D01*
X52131Y203813D01*
X52354Y203489D01*
X52568Y203160D01*
X52774Y202826D01*
X52971Y202486D01*
X53161Y202142D01*
X53342Y201794D01*
X53514Y201441D01*
X53677Y201084D01*
X53832Y200723D01*
X53978Y200358D01*
X54115Y199990D01*
X54242Y199619D01*
X54361Y199245D01*
X54470Y198867D01*
X54571Y198488D01*
X54661Y198106D01*
X54743Y197721D01*
X54814Y197335D01*
X54877Y196948D01*
X54930Y196559D01*
X54973Y196168D01*
X55007Y195777D01*
X55031Y195385D01*
X55045Y194993D01*
X55050Y194600D01*
X55045Y194207D01*
X55031Y193815D01*
X55007Y193423D01*
X54973Y193032D01*
X54930Y192641D01*
X54877Y192252D01*
X54814Y191865D01*
X54743Y191479D01*
X54661Y191094D01*
X54571Y190712D01*
X54470Y190333D01*
X54361Y189955D01*
X54242Y189581D01*
X54115Y189210D01*
X53978Y188842D01*
X53832Y188477D01*
X53677Y188116D01*
X53514Y187759D01*
X53342Y187406D01*
X53161Y187058D01*
X52971Y186714D01*
X52774Y186374D01*
X52568Y186040D01*
X52354Y185711D01*
X52131Y185387D01*
X51901Y185069D01*
X51664Y184756D01*
X51418Y184450D01*
X51165Y184149D01*
X50905Y183855D01*
X50638Y183567D01*
X50364Y183286D01*
X50083Y183012D01*
X49795Y182745D01*
X49501Y182485D01*
X49200Y182232D01*
X48894Y181986D01*
X48581Y181749D01*
X48263Y181519D01*
X47939Y181296D01*
X47610Y181082D01*
X47276Y180876D01*
X46936Y180679D01*
X46592Y180489D01*
X46244Y180308D01*
X45891Y180136D01*
X45534Y179973D01*
X45173Y179818D01*
X44808Y179672D01*
X44440Y179535D01*
X44069Y179408D01*
X43695Y179289D01*
X43317Y179180D01*
X42938Y179079D01*
X42556Y178989D01*
X42171Y178907D01*
X41785Y178836D01*
X41398Y178773D01*
X41009Y178720D01*
X40618Y178677D01*
X40227Y178643D01*
X39835Y178619D01*
X39443Y178605D01*
X39050Y178600D01*
X38657Y178605D01*
X38265Y178619D01*
X37873Y178643D01*
X37482Y178677D01*
X37091Y178720D01*
X36702Y178773D01*
X36315Y178836D01*
X35929Y178907D01*
X35544Y178989D01*
X35162Y179079D01*
X34783Y179180D01*
X34405Y179289D01*
X34031Y179408D01*
X33660Y179535D01*
X33292Y179672D01*
X32927Y179818D01*
X32566Y179973D01*
X32209Y180136D01*
X31856Y180308D01*
X31508Y180489D01*
X31164Y180679D01*
X30824Y180876D01*
X30490Y181082D01*
X30161Y181296D01*
X29837Y181519D01*
X29519Y181749D01*
X29206Y181986D01*
X28900Y182232D01*
X28599Y182485D01*
X28305Y182745D01*
X28017Y183012D01*
X27736Y183286D01*
X27462Y183567D01*
X27195Y183855D01*
X26935Y184149D01*
X26682Y184450D01*
X26436Y184756D01*
X26199Y185069D01*
X25969Y185387D01*
X25746Y185711D01*
X25532Y186040D01*
X25326Y186374D01*
X25129Y186714D01*
X24939Y187058D01*
X24758Y187406D01*
X24586Y187759D01*
X24423Y188116D01*
X24268Y188477D01*
X24122Y188842D01*
X23985Y189210D01*
X23858Y189581D01*
X23739Y189955D01*
X23630Y190333D01*
X23529Y190712D01*
X23439Y191094D01*
X23357Y191479D01*
X23286Y191865D01*
X23223Y192252D01*
X23170Y192641D01*
X23127Y193032D01*
X23093Y193423D01*
X23069Y193815D01*
X23055Y194207D01*
X23050Y194600D01*
X412441Y176451D02*
X412441Y26451D01*
X259706Y26451D01*
X259706Y176451D01*
X404148Y176451D02*
X412441Y176451D01*
X404148Y176451D02*
X403544Y176458D01*
X402940Y176480D01*
X402337Y176517D01*
X401735Y176568D01*
X401135Y176633D01*
X400536Y176713D01*
X399939Y176808D01*
X399345Y176917D01*
X398753Y177040D01*
X398165Y177177D01*
X397580Y177329D01*
X396999Y177495D01*
X396423Y177675D01*
X395850Y177868D01*
X395283Y178076D01*
X394721Y178297D01*
X394164Y178531D01*
X393613Y178779D01*
X393068Y179040D01*
X392530Y179315D01*
X391998Y179602D01*
X391474Y179902D01*
X390957Y180214D01*
X390448Y180539D01*
X389946Y180876D01*
X389453Y181226D01*
X388969Y181587D01*
X388493Y181959D01*
X388027Y182343D01*
X387570Y182738D01*
X387123Y183144D01*
X386685Y183561D01*
X386258Y183988D01*
X385841Y184426D01*
X385435Y184873D01*
X385040Y185330D01*
X384656Y185796D01*
X384284Y186272D01*
X383923Y186756D01*
X383573Y187249D01*
X383236Y187751D01*
X382911Y188260D01*
X382599Y188777D01*
X382299Y189301D01*
X382012Y189833D01*
X381737Y190371D01*
X381476Y190916D01*
X381228Y191467D01*
X380994Y192024D01*
X380773Y192586D01*
X380565Y193153D01*
X380372Y193726D01*
X380192Y194302D01*
X380026Y194883D01*
X379874Y195468D01*
X379737Y196056D01*
X379614Y196648D01*
X379505Y197242D01*
X379410Y197839D01*
X379330Y198438D01*
X379265Y199038D01*
X379214Y199640D01*
X379177Y200243D01*
X379155Y200847D01*
X379148Y201451D01*
X289939Y201451D01*
X289932Y200847D01*
X289910Y200243D01*
X289873Y199640D01*
X289822Y199038D01*
X289757Y198438D01*
X289677Y197839D01*
X289582Y197242D01*
X289473Y196648D01*
X289350Y196056D01*
X289213Y195468D01*
X289061Y194883D01*
X288895Y194302D01*
X288715Y193726D01*
X288522Y193153D01*
X288314Y192586D01*
X288093Y192024D01*
X287859Y191467D01*
X287611Y190916D01*
X287350Y190371D01*
X287075Y189833D01*
X286788Y189301D01*
X286488Y188777D01*
X286176Y188260D01*
X285851Y187751D01*
X285514Y187249D01*
X285164Y186756D01*
X284803Y186272D01*
X284431Y185796D01*
X284047Y185330D01*
X283652Y184873D01*
X283246Y184426D01*
X282829Y183988D01*
X282402Y183561D01*
X281964Y183144D01*
X281517Y182738D01*
X281060Y182343D01*
X280594Y181959D01*
X280118Y181587D01*
X279634Y181226D01*
X279141Y180876D01*
X278639Y180539D01*
X278130Y180214D01*
X277613Y179902D01*
X277089Y179602D01*
X276557Y179315D01*
X276019Y179040D01*
X275474Y178779D01*
X274923Y178531D01*
X274366Y178297D01*
X273804Y178076D01*
X273237Y177868D01*
X272664Y177675D01*
X272088Y177495D01*
X271507Y177329D01*
X270922Y177177D01*
X270334Y177040D01*
X269742Y176917D01*
X269148Y176808D01*
X268551Y176713D01*
X267952Y176633D01*
X267352Y176568D01*
X266750Y176517D01*
X266147Y176480D01*
X265543Y176458D01*
X264939Y176451D01*
X259706Y176451D01*
X425141Y229651D02*
X425141Y379651D01*
X425141Y229651D02*
X272406Y229651D01*
X272406Y379651D01*
X416848Y379651D02*
X425141Y379651D01*
X416848Y379651D02*
X416244Y379658D01*
X415640Y379680D01*
X415037Y379717D01*
X414435Y379768D01*
X413835Y379833D01*
X413236Y379913D01*
X412639Y380008D01*
X412045Y380117D01*
X411453Y380240D01*
X410865Y380377D01*
X410280Y380529D01*
X409699Y380695D01*
X409123Y380875D01*
X408550Y381068D01*
X407983Y381276D01*
X407421Y381497D01*
X406864Y381731D01*
X406313Y381979D01*
X405768Y382240D01*
X405230Y382515D01*
X404698Y382802D01*
X404174Y383102D01*
X403657Y383414D01*
X403148Y383739D01*
X402646Y384076D01*
X402153Y384426D01*
X401669Y384787D01*
X401193Y385159D01*
X400727Y385543D01*
X400270Y385938D01*
X399823Y386344D01*
X399385Y386761D01*
X398958Y387188D01*
X398541Y387626D01*
X398135Y388073D01*
X397740Y388530D01*
X397356Y388996D01*
X396984Y389472D01*
X396623Y389956D01*
X396273Y390449D01*
X395936Y390951D01*
X395611Y391460D01*
X395299Y391977D01*
X394999Y392501D01*
X394712Y393033D01*
X394437Y393571D01*
X394176Y394116D01*
X393928Y394667D01*
X393694Y395224D01*
X393473Y395786D01*
X393265Y396353D01*
X393072Y396926D01*
X392892Y397502D01*
X392726Y398083D01*
X392574Y398668D01*
X392437Y399256D01*
X392314Y399848D01*
X392205Y400442D01*
X392110Y401039D01*
X392030Y401638D01*
X391965Y402238D01*
X391914Y402840D01*
X391877Y403443D01*
X391855Y404047D01*
X391848Y404651D01*
X302639Y404651D01*
X302632Y404047D01*
X302610Y403443D01*
X302573Y402840D01*
X302522Y402238D01*
X302457Y401638D01*
X302377Y401039D01*
X302282Y400442D01*
X302173Y399848D01*
X302050Y399256D01*
X301913Y398668D01*
X301761Y398083D01*
X301595Y397502D01*
X301415Y396926D01*
X301222Y396353D01*
X301014Y395786D01*
X300793Y395224D01*
X300559Y394667D01*
X300311Y394116D01*
X300050Y393571D01*
X299775Y393033D01*
X299488Y392501D01*
X299188Y391977D01*
X298876Y391460D01*
X298551Y390951D01*
X298214Y390449D01*
X297864Y389956D01*
X297503Y389472D01*
X297131Y388996D01*
X296747Y388530D01*
X296352Y388073D01*
X295946Y387626D01*
X295529Y387188D01*
X295102Y386761D01*
X294664Y386344D01*
X294217Y385938D01*
X293760Y385543D01*
X293294Y385159D01*
X292818Y384787D01*
X292334Y384426D01*
X291841Y384076D01*
X291339Y383739D01*
X290830Y383414D01*
X290313Y383102D01*
X289789Y382802D01*
X289257Y382515D01*
X288719Y382240D01*
X288174Y381979D01*
X287623Y381731D01*
X287066Y381497D01*
X286504Y381276D01*
X285937Y381068D01*
X285364Y380875D01*
X284788Y380695D01*
X284207Y380529D01*
X283622Y380377D01*
X283034Y380240D01*
X282442Y380117D01*
X281848Y380008D01*
X281251Y379913D01*
X280652Y379833D01*
X280052Y379768D01*
X279450Y379717D01*
X278847Y379680D01*
X278243Y379658D01*
X277639Y379651D01*
X272406Y379651D01*
X425141Y432851D02*
X425141Y582851D01*
X425141Y432851D02*
X272406Y432851D01*
X272406Y582851D01*
X416848Y582851D02*
X425141Y582851D01*
X416848Y582851D02*
X416244Y582858D01*
X415640Y582880D01*
X415037Y582917D01*
X414435Y582968D01*
X413835Y583033D01*
X413236Y583113D01*
X412639Y583208D01*
X412045Y583317D01*
X411453Y583440D01*
X410865Y583577D01*
X410280Y583729D01*
X409699Y583895D01*
X409123Y584075D01*
X408550Y584268D01*
X407983Y584476D01*
X407421Y584697D01*
X406864Y584931D01*
X406313Y585179D01*
X405768Y585440D01*
X405230Y585715D01*
X404698Y586002D01*
X404174Y586302D01*
X403657Y586614D01*
X403148Y586939D01*
X402646Y587276D01*
X402153Y587626D01*
X401669Y587987D01*
X401193Y588359D01*
X400727Y588743D01*
X400270Y589138D01*
X399823Y589544D01*
X399385Y589961D01*
X398958Y590388D01*
X398541Y590826D01*
X398135Y591273D01*
X397740Y591730D01*
X397356Y592196D01*
X396984Y592672D01*
X396623Y593156D01*
X396273Y593649D01*
X395936Y594151D01*
X395611Y594660D01*
X395299Y595177D01*
X394999Y595701D01*
X394712Y596233D01*
X394437Y596771D01*
X394176Y597316D01*
X393928Y597867D01*
X393694Y598424D01*
X393473Y598986D01*
X393265Y599553D01*
X393072Y600126D01*
X392892Y600702D01*
X392726Y601283D01*
X392574Y601868D01*
X392437Y602456D01*
X392314Y603048D01*
X392205Y603642D01*
X392110Y604239D01*
X392030Y604838D01*
X391965Y605438D01*
X391914Y606040D01*
X391877Y606643D01*
X391855Y607247D01*
X391848Y607851D01*
X302639Y607851D01*
X302632Y607247D01*
X302610Y606643D01*
X302573Y606040D01*
X302522Y605438D01*
X302457Y604838D01*
X302377Y604239D01*
X302282Y603642D01*
X302173Y603048D01*
X302050Y602456D01*
X301913Y601868D01*
X301761Y601283D01*
X301595Y600702D01*
X301415Y600126D01*
X301222Y599553D01*
X301014Y598986D01*
X300793Y598424D01*
X300559Y597867D01*
X300311Y597316D01*
X300050Y596771D01*
X299775Y596233D01*
X299488Y595701D01*
X299188Y595177D01*
X298876Y594660D01*
X298551Y594151D01*
X298214Y593649D01*
X297864Y593156D01*
X297503Y592672D01*
X297131Y592196D01*
X296747Y591730D01*
X296352Y591273D01*
X295946Y590826D01*
X295529Y590388D01*
X295102Y589961D01*
X294664Y589544D01*
X294217Y589138D01*
X293760Y588743D01*
X293294Y588359D01*
X292818Y587987D01*
X292334Y587626D01*
X291841Y587276D01*
X291339Y586939D01*
X290830Y586614D01*
X290313Y586302D01*
X289789Y586002D01*
X289257Y585715D01*
X288719Y585440D01*
X288174Y585179D01*
X287623Y584931D01*
X287066Y584697D01*
X286504Y584476D01*
X285937Y584268D01*
X285364Y584075D01*
X284788Y583895D01*
X284207Y583729D01*
X283622Y583577D01*
X283034Y583440D01*
X282442Y583317D01*
X281848Y583208D01*
X281251Y583113D01*
X280652Y583033D01*
X280052Y582968D01*
X279450Y582917D01*
X278847Y582880D01*
X278243Y582858D01*
X277639Y582851D01*
X272406Y582851D01*
D11*
X446588Y302350D02*
X446588Y42350D01*
X446588Y302350D02*
X447465Y302361D01*
X448341Y302393D01*
X449216Y302446D01*
X450089Y302521D01*
X450961Y302617D01*
X451830Y302734D01*
X452695Y302872D01*
X453558Y303031D01*
X454415Y303211D01*
X455269Y303412D01*
X456117Y303634D01*
X456960Y303876D01*
X457796Y304139D01*
X458626Y304422D01*
X459448Y304725D01*
X460263Y305049D01*
X461070Y305391D01*
X461868Y305754D01*
X462658Y306136D01*
X463437Y306536D01*
X464207Y306956D01*
X464966Y307395D01*
X465715Y307851D01*
X466452Y308326D01*
X467177Y308819D01*
X467890Y309329D01*
X468590Y309856D01*
X469278Y310400D01*
X469951Y310961D01*
X470611Y311538D01*
X471257Y312131D01*
X471888Y312740D01*
X472505Y313363D01*
X473105Y314002D01*
X473690Y314655D01*
X474259Y315322D01*
X474812Y316002D01*
X475348Y316696D01*
X475866Y317403D01*
X476368Y318122D01*
X476852Y318853D01*
X477317Y319596D01*
X477765Y320350D01*
X478194Y321115D01*
X478604Y321889D01*
X478996Y322674D01*
X479368Y323468D01*
X479720Y324270D01*
X480053Y325081D01*
X480367Y325900D01*
X480660Y326726D01*
X480933Y327559D01*
X481185Y328399D01*
X481417Y329244D01*
X481629Y330095D01*
X481819Y330951D01*
X481989Y331811D01*
X482138Y332675D01*
X482266Y333542D01*
X482372Y334413D01*
X482457Y335285D01*
X482521Y336160D01*
X482564Y337035D01*
X482585Y337912D01*
X482585Y338788D01*
X482564Y339665D01*
X482521Y340540D01*
X482457Y341415D01*
X482372Y342287D01*
X482266Y343158D01*
X482138Y344025D01*
X481989Y344889D01*
X481819Y345749D01*
X481629Y346605D01*
X481417Y347456D01*
X481185Y348301D01*
X480933Y349141D01*
X480660Y349974D01*
X480367Y350800D01*
X480053Y351619D01*
X479720Y352430D01*
X479368Y353232D01*
X478996Y354026D01*
X478604Y354811D01*
X478194Y355585D01*
X477765Y356350D01*
X477317Y357104D01*
X476852Y357847D01*
X476368Y358578D01*
X475866Y359297D01*
X475348Y360004D01*
X474812Y360698D01*
X474259Y361378D01*
X473690Y362045D01*
X473105Y362698D01*
X472505Y363337D01*
X471888Y363960D01*
X471257Y364569D01*
X470611Y365162D01*
X469951Y365739D01*
X469278Y366300D01*
X468590Y366844D01*
X467890Y367371D01*
X467177Y367881D01*
X466452Y368374D01*
X465715Y368849D01*
X464966Y369305D01*
X464207Y369744D01*
X463437Y370164D01*
X462658Y370564D01*
X461868Y370946D01*
X461070Y371309D01*
X460263Y371651D01*
X459448Y371975D01*
X458626Y372278D01*
X457796Y372561D01*
X456960Y372824D01*
X456117Y373066D01*
X455269Y373288D01*
X454415Y373489D01*
X453558Y373669D01*
X452695Y373828D01*
X451830Y373966D01*
X450961Y374083D01*
X450089Y374179D01*
X449216Y374254D01*
X448341Y374307D01*
X447465Y374339D01*
X446588Y374350D01*
X446588Y42350D02*
X447447Y42334D01*
X448306Y42296D01*
X449164Y42238D01*
X450020Y42159D01*
X450874Y42059D01*
X451725Y41938D01*
X452573Y41796D01*
X453417Y41634D01*
X454257Y41451D01*
X455092Y41248D01*
X455922Y41025D01*
X456747Y40781D01*
X457565Y40517D01*
X458376Y40234D01*
X459181Y39930D01*
X459977Y39608D01*
X460766Y39266D01*
X461546Y38904D01*
X462317Y38524D01*
X463079Y38125D01*
X463830Y37708D01*
X464571Y37272D01*
X465302Y36819D01*
X466021Y36348D01*
X466728Y35859D01*
X467423Y35354D01*
X468106Y34831D01*
X468776Y34292D01*
X469432Y33737D01*
X470075Y33166D01*
X470704Y32580D01*
X471318Y31978D01*
X471917Y31362D01*
X472501Y30731D01*
X473069Y30086D01*
X473622Y29428D01*
X474158Y28756D01*
X474678Y28071D01*
X475181Y27374D01*
X475667Y26665D01*
X476135Y25944D01*
X476586Y25212D01*
X477019Y24469D01*
X477433Y23716D01*
X477829Y22953D01*
X478207Y22181D01*
X478565Y21399D01*
X478904Y20609D01*
X479224Y19811D01*
X479524Y19006D01*
X479804Y18193D01*
X480065Y17374D01*
X480306Y16549D01*
X480526Y15718D01*
X480726Y14882D01*
X480906Y14041D01*
X481065Y13196D01*
X481203Y12348D01*
X481321Y11496D01*
X481417Y10642D01*
X481493Y9786D01*
X481548Y8928D01*
X481583Y8069D01*
X481596Y7209D01*
X481588Y6350D01*
X446588Y466350D02*
X446624Y469272D01*
X446730Y472193D01*
X446908Y475109D01*
X447157Y478021D01*
X447477Y480926D01*
X447867Y483822D01*
X448327Y486708D01*
X448858Y489582D01*
X449459Y492442D01*
X450129Y495286D01*
X450868Y498113D01*
X451676Y500922D01*
X452552Y503710D01*
X453495Y506476D01*
X454506Y509218D01*
X455583Y511934D01*
X456726Y514624D01*
X457934Y517285D01*
X459207Y519916D01*
X460543Y522514D01*
X461942Y525080D01*
X463403Y527611D01*
X464926Y530105D01*
X466508Y532562D01*
X468150Y534980D01*
X469851Y537356D01*
X471608Y539691D01*
X473423Y541982D01*
X475292Y544228D01*
X477215Y546428D01*
X479192Y548581D01*
X481220Y550685D01*
X483299Y552738D01*
X485427Y554741D01*
X487604Y556691D01*
X489827Y558588D01*
X492096Y560430D01*
X494409Y562216D01*
X496765Y563945D01*
X499162Y565616D01*
X501599Y567229D01*
X504075Y568781D01*
X506588Y570273D01*
X509136Y571703D01*
X511719Y573071D01*
X514334Y574376D01*
X516980Y575616D01*
X519655Y576792D01*
X522359Y577902D01*
X525088Y578946D01*
X527842Y579923D01*
X530619Y580833D01*
X533418Y581675D01*
X536236Y582448D01*
X539072Y583153D01*
X541925Y583788D01*
X544792Y584354D01*
X547672Y584850D01*
X550563Y585275D01*
X553463Y585630D01*
X556372Y585914D01*
X559286Y586128D01*
X562205Y586270D01*
X565127Y586341D01*
X568049Y586341D01*
X570971Y586270D01*
X573890Y586128D01*
X576804Y585914D01*
X579713Y585630D01*
X582613Y585275D01*
X585504Y584850D01*
X588384Y584354D01*
X591251Y583788D01*
X594104Y583153D01*
X596940Y582448D01*
X599758Y581675D01*
X602557Y580833D01*
X605334Y579923D01*
X608088Y578946D01*
X610817Y577902D01*
X613521Y576792D01*
X616196Y575616D01*
X618842Y574376D01*
X621457Y573071D01*
X624040Y571703D01*
X626588Y570273D01*
X629101Y568781D01*
X631577Y567229D01*
X634014Y565616D01*
X636411Y563945D01*
X638767Y562216D01*
X641080Y560430D01*
X643349Y558588D01*
X645572Y556691D01*
X647749Y554741D01*
X649877Y552738D01*
X651956Y550685D01*
X653984Y548581D01*
X655961Y546428D01*
X657884Y544228D01*
X659753Y541982D01*
X661568Y539691D01*
X663325Y537356D01*
X665026Y534980D01*
X666668Y532562D01*
X668250Y530105D01*
X669773Y527611D01*
X671234Y525080D01*
X672633Y522514D01*
X673969Y519916D01*
X675242Y517285D01*
X676450Y514624D01*
X677593Y511934D01*
X678670Y509218D01*
X679681Y506476D01*
X680624Y503710D01*
X681500Y500922D01*
X682308Y498113D01*
X683047Y495286D01*
X683717Y492442D01*
X684318Y489582D01*
X684849Y486708D01*
X685309Y483822D01*
X685699Y480926D01*
X686019Y478021D01*
X686268Y475109D01*
X686446Y472193D01*
X686552Y469272D01*
X686588Y466350D01*
D10*
X521588Y466350D02*
X521602Y467454D01*
X521642Y468558D01*
X521710Y469660D01*
X521805Y470761D01*
X521926Y471858D01*
X522075Y472953D01*
X522251Y474043D01*
X522453Y475129D01*
X522681Y476210D01*
X522937Y477284D01*
X523218Y478352D01*
X523526Y479413D01*
X523859Y480466D01*
X524219Y481510D01*
X524603Y482545D01*
X525013Y483571D01*
X525449Y484586D01*
X525908Y485590D01*
X526393Y486583D01*
X526902Y487563D01*
X527434Y488530D01*
X527990Y489485D01*
X528570Y490425D01*
X529172Y491351D01*
X529797Y492261D01*
X530444Y493156D01*
X531112Y494035D01*
X531803Y494898D01*
X532514Y495743D01*
X533245Y496570D01*
X533997Y497379D01*
X534768Y498170D01*
X535559Y498941D01*
X536368Y499693D01*
X537195Y500424D01*
X538040Y501135D01*
X538903Y501826D01*
X539782Y502494D01*
X540677Y503141D01*
X541587Y503766D01*
X542513Y504368D01*
X543453Y504948D01*
X544408Y505504D01*
X545375Y506036D01*
X546355Y506545D01*
X547348Y507030D01*
X548352Y507489D01*
X549367Y507925D01*
X550393Y508335D01*
X551428Y508719D01*
X552472Y509079D01*
X553525Y509412D01*
X554586Y509720D01*
X555654Y510001D01*
X556728Y510257D01*
X557809Y510485D01*
X558895Y510687D01*
X559985Y510863D01*
X561080Y511012D01*
X562177Y511133D01*
X563278Y511228D01*
X564380Y511296D01*
X565484Y511336D01*
X566588Y511350D01*
X567692Y511336D01*
X568796Y511296D01*
X569898Y511228D01*
X570999Y511133D01*
X572096Y511012D01*
X573191Y510863D01*
X574281Y510687D01*
X575367Y510485D01*
X576448Y510257D01*
X577522Y510001D01*
X578590Y509720D01*
X579651Y509412D01*
X580704Y509079D01*
X581748Y508719D01*
X582783Y508335D01*
X583809Y507925D01*
X584824Y507489D01*
X585828Y507030D01*
X586821Y506545D01*
X587801Y506036D01*
X588768Y505504D01*
X589723Y504948D01*
X590663Y504368D01*
X591589Y503766D01*
X592499Y503141D01*
X593394Y502494D01*
X594273Y501826D01*
X595136Y501135D01*
X595981Y500424D01*
X596808Y499693D01*
X597617Y498941D01*
X598408Y498170D01*
X599179Y497379D01*
X599931Y496570D01*
X600662Y495743D01*
X601373Y494898D01*
X602064Y494035D01*
X602732Y493156D01*
X603379Y492261D01*
X604004Y491351D01*
X604606Y490425D01*
X605186Y489485D01*
X605742Y488530D01*
X606274Y487563D01*
X606783Y486583D01*
X607268Y485590D01*
X607727Y484586D01*
X608163Y483571D01*
X608573Y482545D01*
X608957Y481510D01*
X609317Y480466D01*
X609650Y479413D01*
X609958Y478352D01*
X610239Y477284D01*
X610495Y476210D01*
X610723Y475129D01*
X610925Y474043D01*
X611101Y472953D01*
X611250Y471858D01*
X611371Y470761D01*
X611466Y469660D01*
X611534Y468558D01*
X611574Y467454D01*
X611588Y466350D01*
X611574Y465246D01*
X611534Y464142D01*
X611466Y463040D01*
X611371Y461939D01*
X611250Y460842D01*
X611101Y459747D01*
X610925Y458657D01*
X610723Y457571D01*
X610495Y456490D01*
X610239Y455416D01*
X609958Y454348D01*
X609650Y453287D01*
X609317Y452234D01*
X608957Y451190D01*
X608573Y450155D01*
X608163Y449129D01*
X607727Y448114D01*
X607268Y447110D01*
X606783Y446117D01*
X606274Y445137D01*
X605742Y444170D01*
X605186Y443215D01*
X604606Y442275D01*
X604004Y441349D01*
X603379Y440439D01*
X602732Y439544D01*
X602064Y438665D01*
X601373Y437802D01*
X600662Y436957D01*
X599931Y436130D01*
X599179Y435321D01*
X598408Y434530D01*
X597617Y433759D01*
X596808Y433007D01*
X595981Y432276D01*
X595136Y431565D01*
X594273Y430874D01*
X593394Y430206D01*
X592499Y429559D01*
X591589Y428934D01*
X590663Y428332D01*
X589723Y427752D01*
X588768Y427196D01*
X587801Y426664D01*
X586821Y426155D01*
X585828Y425670D01*
X584824Y425211D01*
X583809Y424775D01*
X582783Y424365D01*
X581748Y423981D01*
X580704Y423621D01*
X579651Y423288D01*
X578590Y422980D01*
X577522Y422699D01*
X576448Y422443D01*
X575367Y422215D01*
X574281Y422013D01*
X573191Y421837D01*
X572096Y421688D01*
X570999Y421567D01*
X569898Y421472D01*
X568796Y421404D01*
X567692Y421364D01*
X566588Y421350D01*
X565484Y421364D01*
X564380Y421404D01*
X563278Y421472D01*
X562177Y421567D01*
X561080Y421688D01*
X559985Y421837D01*
X558895Y422013D01*
X557809Y422215D01*
X556728Y422443D01*
X555654Y422699D01*
X554586Y422980D01*
X553525Y423288D01*
X552472Y423621D01*
X551428Y423981D01*
X550393Y424365D01*
X549367Y424775D01*
X548352Y425211D01*
X547348Y425670D01*
X546355Y426155D01*
X545375Y426664D01*
X544408Y427196D01*
X543453Y427752D01*
X542513Y428332D01*
X541587Y428934D01*
X540677Y429559D01*
X539782Y430206D01*
X538903Y430874D01*
X538040Y431565D01*
X537195Y432276D01*
X536368Y433007D01*
X535559Y433759D01*
X534768Y434530D01*
X533997Y435321D01*
X533245Y436130D01*
X532514Y436957D01*
X531803Y437802D01*
X531112Y438665D01*
X530444Y439544D01*
X529797Y440439D01*
X529172Y441349D01*
X528570Y442275D01*
X527990Y443215D01*
X527434Y444170D01*
X526902Y445137D01*
X526393Y446117D01*
X525908Y447110D01*
X525449Y448114D01*
X525013Y449129D01*
X524603Y450155D01*
X524219Y451190D01*
X523859Y452234D01*
X523526Y453287D01*
X523218Y454348D01*
X522937Y455416D01*
X522681Y456490D01*
X522453Y457571D01*
X522251Y458657D01*
X522075Y459747D01*
X521926Y460842D01*
X521805Y461939D01*
X521710Y463040D01*
X521642Y464142D01*
X521602Y465246D01*
X521588Y466350D01*
D11*
X446588Y465350D02*
X446588Y374350D01*
X686588Y302350D02*
X686588Y42350D01*
X686588Y302350D02*
X685711Y302361D01*
X684835Y302393D01*
X683960Y302446D01*
X683087Y302521D01*
X682215Y302617D01*
X681346Y302734D01*
X680481Y302872D01*
X679618Y303031D01*
X678761Y303211D01*
X677907Y303412D01*
X677059Y303634D01*
X676216Y303876D01*
X675380Y304139D01*
X674550Y304422D01*
X673728Y304725D01*
X672913Y305049D01*
X672106Y305391D01*
X671308Y305754D01*
X670518Y306136D01*
X669739Y306536D01*
X668969Y306956D01*
X668210Y307395D01*
X667461Y307851D01*
X666724Y308326D01*
X665999Y308819D01*
X665286Y309329D01*
X664586Y309856D01*
X663898Y310400D01*
X663225Y310961D01*
X662565Y311538D01*
X661919Y312131D01*
X661288Y312740D01*
X660671Y313363D01*
X660071Y314002D01*
X659486Y314655D01*
X658917Y315322D01*
X658364Y316002D01*
X657828Y316696D01*
X657310Y317403D01*
X656808Y318122D01*
X656324Y318853D01*
X655859Y319596D01*
X655411Y320350D01*
X654982Y321115D01*
X654572Y321889D01*
X654180Y322674D01*
X653808Y323468D01*
X653456Y324270D01*
X653123Y325081D01*
X652809Y325900D01*
X652516Y326726D01*
X652243Y327559D01*
X651991Y328399D01*
X651759Y329244D01*
X651547Y330095D01*
X651357Y330951D01*
X651187Y331811D01*
X651038Y332675D01*
X650910Y333542D01*
X650804Y334413D01*
X650719Y335285D01*
X650655Y336160D01*
X650612Y337035D01*
X650591Y337912D01*
X650591Y338788D01*
X650612Y339665D01*
X650655Y340540D01*
X650719Y341415D01*
X650804Y342287D01*
X650910Y343158D01*
X651038Y344025D01*
X651187Y344889D01*
X651357Y345749D01*
X651547Y346605D01*
X651759Y347456D01*
X651991Y348301D01*
X652243Y349141D01*
X652516Y349974D01*
X652809Y350800D01*
X653123Y351619D01*
X653456Y352430D01*
X653808Y353232D01*
X654180Y354026D01*
X654572Y354811D01*
X654982Y355585D01*
X655411Y356350D01*
X655859Y357104D01*
X656324Y357847D01*
X656808Y358578D01*
X657310Y359297D01*
X657828Y360004D01*
X658364Y360698D01*
X658917Y361378D01*
X659486Y362045D01*
X660071Y362698D01*
X660671Y363337D01*
X661288Y363960D01*
X661919Y364569D01*
X662565Y365162D01*
X663225Y365739D01*
X663898Y366300D01*
X664586Y366844D01*
X665286Y367371D01*
X665999Y367881D01*
X666724Y368374D01*
X667461Y368849D01*
X668210Y369305D01*
X668969Y369744D01*
X669739Y370164D01*
X670518Y370564D01*
X671308Y370946D01*
X672106Y371309D01*
X672913Y371651D01*
X673728Y371975D01*
X674550Y372278D01*
X675380Y372561D01*
X676216Y372824D01*
X677059Y373066D01*
X677907Y373288D01*
X678761Y373489D01*
X679618Y373669D01*
X680481Y373828D01*
X681346Y373966D01*
X682215Y374083D01*
X683087Y374179D01*
X683960Y374254D01*
X684835Y374307D01*
X685711Y374339D01*
X686588Y374350D01*
X686587Y42350D02*
X685728Y42334D01*
X684869Y42296D01*
X684011Y42238D01*
X683155Y42159D01*
X682301Y42059D01*
X681450Y41938D01*
X680602Y41796D01*
X679758Y41634D01*
X678918Y41451D01*
X678083Y41248D01*
X677253Y41025D01*
X676428Y40781D01*
X675610Y40517D01*
X674799Y40234D01*
X673994Y39930D01*
X673198Y39608D01*
X672409Y39266D01*
X671629Y38904D01*
X670858Y38524D01*
X670096Y38125D01*
X669345Y37708D01*
X668604Y37272D01*
X667873Y36819D01*
X667154Y36348D01*
X666447Y35859D01*
X665752Y35354D01*
X665069Y34831D01*
X664399Y34292D01*
X663743Y33737D01*
X663100Y33166D01*
X662471Y32580D01*
X661857Y31978D01*
X661258Y31362D01*
X660674Y30731D01*
X660106Y30086D01*
X659553Y29428D01*
X659017Y28756D01*
X658497Y28071D01*
X657994Y27374D01*
X657508Y26665D01*
X657040Y25944D01*
X656589Y25212D01*
X656156Y24469D01*
X655742Y23716D01*
X655346Y22953D01*
X654968Y22181D01*
X654610Y21399D01*
X654271Y20609D01*
X653951Y19811D01*
X653651Y19006D01*
X653371Y18193D01*
X653110Y17374D01*
X652869Y16549D01*
X652649Y15718D01*
X652449Y14882D01*
X652269Y14041D01*
X652110Y13196D01*
X651972Y12348D01*
X651854Y11496D01*
X651758Y10642D01*
X651682Y9786D01*
X651627Y8928D01*
X651592Y8069D01*
X651579Y7209D01*
X651587Y6350D01*
X686588Y374350D02*
X686588Y465350D01*
X651588Y6350D02*
X481588Y6350D01*
X2088Y296350D02*
X2088Y556350D01*
X2965Y556361D01*
X3841Y556393D01*
X4716Y556446D01*
X5589Y556521D01*
X6461Y556617D01*
X7330Y556734D01*
X8195Y556872D01*
X9058Y557031D01*
X9915Y557211D01*
X10769Y557412D01*
X11617Y557634D01*
X12460Y557876D01*
X13296Y558139D01*
X14126Y558422D01*
X14948Y558725D01*
X15763Y559049D01*
X16570Y559391D01*
X17368Y559754D01*
X18158Y560136D01*
X18937Y560536D01*
X19707Y560956D01*
X20466Y561395D01*
X21215Y561851D01*
X21952Y562326D01*
X22677Y562819D01*
X23390Y563329D01*
X24090Y563856D01*
X24778Y564400D01*
X25451Y564961D01*
X26111Y565538D01*
X26757Y566131D01*
X27388Y566740D01*
X28005Y567363D01*
X28605Y568002D01*
X29190Y568655D01*
X29759Y569322D01*
X30312Y570002D01*
X30848Y570696D01*
X31366Y571403D01*
X31868Y572122D01*
X32352Y572853D01*
X32817Y573596D01*
X33265Y574350D01*
X33694Y575115D01*
X34104Y575889D01*
X34496Y576674D01*
X34868Y577468D01*
X35220Y578270D01*
X35553Y579081D01*
X35867Y579900D01*
X36160Y580726D01*
X36433Y581559D01*
X36685Y582399D01*
X36917Y583244D01*
X37129Y584095D01*
X37319Y584951D01*
X37489Y585811D01*
X37638Y586675D01*
X37766Y587542D01*
X37872Y588413D01*
X37957Y589285D01*
X38021Y590160D01*
X38064Y591035D01*
X38085Y591912D01*
X38085Y592788D01*
X38064Y593665D01*
X38021Y594540D01*
X37957Y595415D01*
X37872Y596287D01*
X37766Y597158D01*
X37638Y598025D01*
X37489Y598889D01*
X37319Y599749D01*
X37129Y600605D01*
X36917Y601456D01*
X36685Y602301D01*
X36433Y603141D01*
X36160Y603974D01*
X35867Y604800D01*
X35553Y605619D01*
X35220Y606430D01*
X34868Y607232D01*
X34496Y608026D01*
X34104Y608811D01*
X33694Y609585D01*
X33265Y610350D01*
X32817Y611104D01*
X32352Y611847D01*
X31868Y612578D01*
X31366Y613297D01*
X30848Y614004D01*
X30312Y614698D01*
X29759Y615378D01*
X29190Y616045D01*
X28605Y616698D01*
X28005Y617337D01*
X27388Y617960D01*
X26757Y618569D01*
X26111Y619162D01*
X25451Y619739D01*
X24778Y620300D01*
X24090Y620844D01*
X23390Y621371D01*
X22677Y621881D01*
X21952Y622374D01*
X21215Y622849D01*
X20466Y623305D01*
X19707Y623744D01*
X18937Y624164D01*
X18158Y624564D01*
X17368Y624946D01*
X16570Y625309D01*
X15763Y625651D01*
X14948Y625975D01*
X14126Y626278D01*
X13296Y626561D01*
X12460Y626824D01*
X11617Y627066D01*
X10769Y627288D01*
X9915Y627489D01*
X9058Y627669D01*
X8195Y627828D01*
X7330Y627966D01*
X6461Y628083D01*
X5589Y628179D01*
X4716Y628254D01*
X3841Y628307D01*
X2965Y628339D01*
X2088Y628350D01*
X2088Y296350D02*
X2947Y296334D01*
X3806Y296296D01*
X4664Y296238D01*
X5520Y296159D01*
X6374Y296059D01*
X7225Y295938D01*
X8073Y295796D01*
X8917Y295634D01*
X9757Y295451D01*
X10592Y295248D01*
X11422Y295025D01*
X12247Y294781D01*
X13065Y294517D01*
X13876Y294234D01*
X14681Y293930D01*
X15477Y293608D01*
X16266Y293266D01*
X17046Y292904D01*
X17817Y292524D01*
X18579Y292125D01*
X19330Y291708D01*
X20071Y291272D01*
X20802Y290819D01*
X21521Y290348D01*
X22228Y289859D01*
X22923Y289354D01*
X23606Y288831D01*
X24276Y288292D01*
X24932Y287737D01*
X25575Y287166D01*
X26204Y286580D01*
X26818Y285978D01*
X27417Y285362D01*
X28001Y284731D01*
X28569Y284086D01*
X29122Y283428D01*
X29658Y282756D01*
X30178Y282071D01*
X30681Y281374D01*
X31167Y280665D01*
X31635Y279944D01*
X32086Y279212D01*
X32519Y278469D01*
X32933Y277716D01*
X33329Y276953D01*
X33707Y276181D01*
X34065Y275399D01*
X34404Y274609D01*
X34724Y273811D01*
X35024Y273006D01*
X35304Y272193D01*
X35565Y271374D01*
X35806Y270549D01*
X36026Y269718D01*
X36226Y268882D01*
X36406Y268041D01*
X36565Y267196D01*
X36703Y266348D01*
X36821Y265496D01*
X36917Y264642D01*
X36993Y263786D01*
X37048Y262928D01*
X37083Y262069D01*
X37096Y261209D01*
X37088Y260350D01*
X2088Y720350D02*
X2124Y723272D01*
X2230Y726193D01*
X2408Y729109D01*
X2657Y732021D01*
X2977Y734926D01*
X3367Y737822D01*
X3827Y740708D01*
X4358Y743582D01*
X4959Y746442D01*
X5629Y749286D01*
X6368Y752113D01*
X7176Y754922D01*
X8052Y757710D01*
X8995Y760476D01*
X10006Y763218D01*
X11083Y765934D01*
X12226Y768624D01*
X13434Y771285D01*
X14707Y773916D01*
X16043Y776514D01*
X17442Y779080D01*
X18903Y781611D01*
X20426Y784105D01*
X22008Y786562D01*
X23650Y788980D01*
X25351Y791356D01*
X27108Y793691D01*
X28923Y795982D01*
X30792Y798228D01*
X32715Y800428D01*
X34692Y802581D01*
X36720Y804685D01*
X38799Y806738D01*
X40927Y808741D01*
X43104Y810691D01*
X45327Y812588D01*
X47596Y814430D01*
X49909Y816216D01*
X52265Y817945D01*
X54662Y819616D01*
X57099Y821229D01*
X59575Y822781D01*
X62088Y824273D01*
X64636Y825703D01*
X67219Y827071D01*
X69834Y828376D01*
X72480Y829616D01*
X75155Y830792D01*
X77859Y831902D01*
X80588Y832946D01*
X83342Y833923D01*
X86119Y834833D01*
X88918Y835675D01*
X91736Y836448D01*
X94572Y837153D01*
X97425Y837788D01*
X100292Y838354D01*
X103172Y838850D01*
X106063Y839275D01*
X108963Y839630D01*
X111872Y839914D01*
X114786Y840128D01*
X117705Y840270D01*
X120627Y840341D01*
X123549Y840341D01*
X126471Y840270D01*
X129390Y840128D01*
X132304Y839914D01*
X135213Y839630D01*
X138113Y839275D01*
X141004Y838850D01*
X143884Y838354D01*
X146751Y837788D01*
X149604Y837153D01*
X152440Y836448D01*
X155258Y835675D01*
X158057Y834833D01*
X160834Y833923D01*
X163588Y832946D01*
X166317Y831902D01*
X169021Y830792D01*
X171696Y829616D01*
X174342Y828376D01*
X176957Y827071D01*
X179540Y825703D01*
X182088Y824273D01*
X184601Y822781D01*
X187077Y821229D01*
X189514Y819616D01*
X191911Y817945D01*
X194267Y816216D01*
X196580Y814430D01*
X198849Y812588D01*
X201072Y810691D01*
X203249Y808741D01*
X205377Y806738D01*
X207456Y804685D01*
X209484Y802581D01*
X211461Y800428D01*
X213384Y798228D01*
X215253Y795982D01*
X217068Y793691D01*
X218825Y791356D01*
X220526Y788980D01*
X222168Y786562D01*
X223750Y784105D01*
X225273Y781611D01*
X226734Y779080D01*
X228133Y776514D01*
X229469Y773916D01*
X230742Y771285D01*
X231950Y768624D01*
X233093Y765934D01*
X234170Y763218D01*
X235181Y760476D01*
X236124Y757710D01*
X237000Y754922D01*
X237808Y752113D01*
X238547Y749286D01*
X239217Y746442D01*
X239818Y743582D01*
X240349Y740708D01*
X240809Y737822D01*
X241199Y734926D01*
X241519Y732021D01*
X241768Y729109D01*
X241946Y726193D01*
X242052Y723272D01*
X242088Y720350D01*
D10*
X77088Y720350D02*
X77102Y721454D01*
X77142Y722558D01*
X77210Y723660D01*
X77305Y724761D01*
X77426Y725858D01*
X77575Y726953D01*
X77751Y728043D01*
X77953Y729129D01*
X78181Y730210D01*
X78437Y731284D01*
X78718Y732352D01*
X79026Y733413D01*
X79359Y734466D01*
X79719Y735510D01*
X80103Y736545D01*
X80513Y737571D01*
X80949Y738586D01*
X81408Y739590D01*
X81893Y740583D01*
X82402Y741563D01*
X82934Y742530D01*
X83490Y743485D01*
X84070Y744425D01*
X84672Y745351D01*
X85297Y746261D01*
X85944Y747156D01*
X86612Y748035D01*
X87303Y748898D01*
X88014Y749743D01*
X88745Y750570D01*
X89497Y751379D01*
X90268Y752170D01*
X91059Y752941D01*
X91868Y753693D01*
X92695Y754424D01*
X93540Y755135D01*
X94403Y755826D01*
X95282Y756494D01*
X96177Y757141D01*
X97087Y757766D01*
X98013Y758368D01*
X98953Y758948D01*
X99908Y759504D01*
X100875Y760036D01*
X101855Y760545D01*
X102848Y761030D01*
X103852Y761489D01*
X104867Y761925D01*
X105893Y762335D01*
X106928Y762719D01*
X107972Y763079D01*
X109025Y763412D01*
X110086Y763720D01*
X111154Y764001D01*
X112228Y764257D01*
X113309Y764485D01*
X114395Y764687D01*
X115485Y764863D01*
X116580Y765012D01*
X117677Y765133D01*
X118778Y765228D01*
X119880Y765296D01*
X120984Y765336D01*
X122088Y765350D01*
X123192Y765336D01*
X124296Y765296D01*
X125398Y765228D01*
X126499Y765133D01*
X127596Y765012D01*
X128691Y764863D01*
X129781Y764687D01*
X130867Y764485D01*
X131948Y764257D01*
X133022Y764001D01*
X134090Y763720D01*
X135151Y763412D01*
X136204Y763079D01*
X137248Y762719D01*
X138283Y762335D01*
X139309Y761925D01*
X140324Y761489D01*
X141328Y761030D01*
X142321Y760545D01*
X143301Y760036D01*
X144268Y759504D01*
X145223Y758948D01*
X146163Y758368D01*
X147089Y757766D01*
X147999Y757141D01*
X148894Y756494D01*
X149773Y755826D01*
X150636Y755135D01*
X151481Y754424D01*
X152308Y753693D01*
X153117Y752941D01*
X153908Y752170D01*
X154679Y751379D01*
X155431Y750570D01*
X156162Y749743D01*
X156873Y748898D01*
X157564Y748035D01*
X158232Y747156D01*
X158879Y746261D01*
X159504Y745351D01*
X160106Y744425D01*
X160686Y743485D01*
X161242Y742530D01*
X161774Y741563D01*
X162283Y740583D01*
X162768Y739590D01*
X163227Y738586D01*
X163663Y737571D01*
X164073Y736545D01*
X164457Y735510D01*
X164817Y734466D01*
X165150Y733413D01*
X165458Y732352D01*
X165739Y731284D01*
X165995Y730210D01*
X166223Y729129D01*
X166425Y728043D01*
X166601Y726953D01*
X166750Y725858D01*
X166871Y724761D01*
X166966Y723660D01*
X167034Y722558D01*
X167074Y721454D01*
X167088Y720350D01*
X167074Y719246D01*
X167034Y718142D01*
X166966Y717040D01*
X166871Y715939D01*
X166750Y714842D01*
X166601Y713747D01*
X166425Y712657D01*
X166223Y711571D01*
X165995Y710490D01*
X165739Y709416D01*
X165458Y708348D01*
X165150Y707287D01*
X164817Y706234D01*
X164457Y705190D01*
X164073Y704155D01*
X163663Y703129D01*
X163227Y702114D01*
X162768Y701110D01*
X162283Y700117D01*
X161774Y699137D01*
X161242Y698170D01*
X160686Y697215D01*
X160106Y696275D01*
X159504Y695349D01*
X158879Y694439D01*
X158232Y693544D01*
X157564Y692665D01*
X156873Y691802D01*
X156162Y690957D01*
X155431Y690130D01*
X154679Y689321D01*
X153908Y688530D01*
X153117Y687759D01*
X152308Y687007D01*
X151481Y686276D01*
X150636Y685565D01*
X149773Y684874D01*
X148894Y684206D01*
X147999Y683559D01*
X147089Y682934D01*
X146163Y682332D01*
X145223Y681752D01*
X144268Y681196D01*
X143301Y680664D01*
X142321Y680155D01*
X141328Y679670D01*
X140324Y679211D01*
X139309Y678775D01*
X138283Y678365D01*
X137248Y677981D01*
X136204Y677621D01*
X135151Y677288D01*
X134090Y676980D01*
X133022Y676699D01*
X131948Y676443D01*
X130867Y676215D01*
X129781Y676013D01*
X128691Y675837D01*
X127596Y675688D01*
X126499Y675567D01*
X125398Y675472D01*
X124296Y675404D01*
X123192Y675364D01*
X122088Y675350D01*
X120984Y675364D01*
X119880Y675404D01*
X118778Y675472D01*
X117677Y675567D01*
X116580Y675688D01*
X115485Y675837D01*
X114395Y676013D01*
X113309Y676215D01*
X112228Y676443D01*
X111154Y676699D01*
X110086Y676980D01*
X109025Y677288D01*
X107972Y677621D01*
X106928Y677981D01*
X105893Y678365D01*
X104867Y678775D01*
X103852Y679211D01*
X102848Y679670D01*
X101855Y680155D01*
X100875Y680664D01*
X99908Y681196D01*
X98953Y681752D01*
X98013Y682332D01*
X97087Y682934D01*
X96177Y683559D01*
X95282Y684206D01*
X94403Y684874D01*
X93540Y685565D01*
X92695Y686276D01*
X91868Y687007D01*
X91059Y687759D01*
X90268Y688530D01*
X89497Y689321D01*
X88745Y690130D01*
X88014Y690957D01*
X87303Y691802D01*
X86612Y692665D01*
X85944Y693544D01*
X85297Y694439D01*
X84672Y695349D01*
X84070Y696275D01*
X83490Y697215D01*
X82934Y698170D01*
X82402Y699137D01*
X81893Y700117D01*
X81408Y701110D01*
X80949Y702114D01*
X80513Y703129D01*
X80103Y704155D01*
X79719Y705190D01*
X79359Y706234D01*
X79026Y707287D01*
X78718Y708348D01*
X78437Y709416D01*
X78181Y710490D01*
X77953Y711571D01*
X77751Y712657D01*
X77575Y713747D01*
X77426Y714842D01*
X77305Y715939D01*
X77210Y717040D01*
X77142Y718142D01*
X77102Y719246D01*
X77088Y720350D01*
D11*
X2088Y719350D02*
X2088Y628350D01*
X242088Y556350D02*
X242088Y296350D01*
X242088Y556350D02*
X241211Y556361D01*
X240335Y556393D01*
X239460Y556446D01*
X238587Y556521D01*
X237715Y556617D01*
X236846Y556734D01*
X235981Y556872D01*
X235118Y557031D01*
X234261Y557211D01*
X233407Y557412D01*
X232559Y557634D01*
X231716Y557876D01*
X230880Y558139D01*
X230050Y558422D01*
X229228Y558725D01*
X228413Y559049D01*
X227606Y559391D01*
X226808Y559754D01*
X226018Y560136D01*
X225239Y560536D01*
X224469Y560956D01*
X223710Y561395D01*
X222961Y561851D01*
X222224Y562326D01*
X221499Y562819D01*
X220786Y563329D01*
X220086Y563856D01*
X219398Y564400D01*
X218725Y564961D01*
X218065Y565538D01*
X217419Y566131D01*
X216788Y566740D01*
X216171Y567363D01*
X215571Y568002D01*
X214986Y568655D01*
X214417Y569322D01*
X213864Y570002D01*
X213328Y570696D01*
X212810Y571403D01*
X212308Y572122D01*
X211824Y572853D01*
X211359Y573596D01*
X210911Y574350D01*
X210482Y575115D01*
X210072Y575889D01*
X209680Y576674D01*
X209308Y577468D01*
X208956Y578270D01*
X208623Y579081D01*
X208309Y579900D01*
X208016Y580726D01*
X207743Y581559D01*
X207491Y582399D01*
X207259Y583244D01*
X207047Y584095D01*
X206857Y584951D01*
X206687Y585811D01*
X206538Y586675D01*
X206410Y587542D01*
X206304Y588413D01*
X206219Y589285D01*
X206155Y590160D01*
X206112Y591035D01*
X206091Y591912D01*
X206091Y592788D01*
X206112Y593665D01*
X206155Y594540D01*
X206219Y595415D01*
X206304Y596287D01*
X206410Y597158D01*
X206538Y598025D01*
X206687Y598889D01*
X206857Y599749D01*
X207047Y600605D01*
X207259Y601456D01*
X207491Y602301D01*
X207743Y603141D01*
X208016Y603974D01*
X208309Y604800D01*
X208623Y605619D01*
X208956Y606430D01*
X209308Y607232D01*
X209680Y608026D01*
X210072Y608811D01*
X210482Y609585D01*
X210911Y610350D01*
X211359Y611104D01*
X211824Y611847D01*
X212308Y612578D01*
X212810Y613297D01*
X213328Y614004D01*
X213864Y614698D01*
X214417Y615378D01*
X214986Y616045D01*
X215571Y616698D01*
X216171Y617337D01*
X216788Y617960D01*
X217419Y618569D01*
X218065Y619162D01*
X218725Y619739D01*
X219398Y620300D01*
X220086Y620844D01*
X220786Y621371D01*
X221499Y621881D01*
X222224Y622374D01*
X222961Y622849D01*
X223710Y623305D01*
X224469Y623744D01*
X225239Y624164D01*
X226018Y624564D01*
X226808Y624946D01*
X227606Y625309D01*
X228413Y625651D01*
X229228Y625975D01*
X230050Y626278D01*
X230880Y626561D01*
X231716Y626824D01*
X232559Y627066D01*
X233407Y627288D01*
X234261Y627489D01*
X235118Y627669D01*
X235981Y627828D01*
X236846Y627966D01*
X237715Y628083D01*
X238587Y628179D01*
X239460Y628254D01*
X240335Y628307D01*
X241211Y628339D01*
X242088Y628350D01*
X242087Y296350D02*
X241228Y296334D01*
X240369Y296296D01*
X239511Y296238D01*
X238655Y296159D01*
X237801Y296059D01*
X236950Y295938D01*
X236102Y295796D01*
X235258Y295634D01*
X234418Y295451D01*
X233583Y295248D01*
X232753Y295025D01*
X231928Y294781D01*
X231110Y294517D01*
X230299Y294234D01*
X229494Y293930D01*
X228698Y293608D01*
X227909Y293266D01*
X227129Y292904D01*
X226358Y292524D01*
X225596Y292125D01*
X224845Y291708D01*
X224104Y291272D01*
X223373Y290819D01*
X222654Y290348D01*
X221947Y289859D01*
X221252Y289354D01*
X220569Y288831D01*
X219899Y288292D01*
X219243Y287737D01*
X218600Y287166D01*
X217971Y286580D01*
X217357Y285978D01*
X216758Y285362D01*
X216174Y284731D01*
X215606Y284086D01*
X215053Y283428D01*
X214517Y282756D01*
X213997Y282071D01*
X213494Y281374D01*
X213008Y280665D01*
X212540Y279944D01*
X212089Y279212D01*
X211656Y278469D01*
X211242Y277716D01*
X210846Y276953D01*
X210468Y276181D01*
X210110Y275399D01*
X209771Y274609D01*
X209451Y273811D01*
X209151Y273006D01*
X208871Y272193D01*
X208610Y271374D01*
X208369Y270549D01*
X208149Y269718D01*
X207949Y268882D01*
X207769Y268041D01*
X207610Y267196D01*
X207472Y266348D01*
X207354Y265496D01*
X207258Y264642D01*
X207182Y263786D01*
X207127Y262928D01*
X207092Y262069D01*
X207079Y261209D01*
X207087Y260350D01*
X242088Y628350D02*
X242088Y719350D01*
X207088Y260350D02*
X37088Y260350D01*
X561250Y624388D02*
X821250Y624388D01*
X561250Y624388D02*
X561239Y625265D01*
X561207Y626141D01*
X561154Y627016D01*
X561079Y627889D01*
X560983Y628761D01*
X560866Y629630D01*
X560728Y630495D01*
X560569Y631358D01*
X560389Y632215D01*
X560188Y633069D01*
X559966Y633917D01*
X559724Y634760D01*
X559461Y635596D01*
X559178Y636426D01*
X558875Y637248D01*
X558551Y638063D01*
X558209Y638870D01*
X557846Y639668D01*
X557464Y640458D01*
X557064Y641237D01*
X556644Y642007D01*
X556205Y642766D01*
X555749Y643515D01*
X555274Y644252D01*
X554781Y644977D01*
X554271Y645690D01*
X553744Y646390D01*
X553200Y647078D01*
X552639Y647751D01*
X552062Y648411D01*
X551469Y649057D01*
X550860Y649688D01*
X550237Y650305D01*
X549598Y650905D01*
X548945Y651490D01*
X548278Y652059D01*
X547598Y652612D01*
X546904Y653148D01*
X546197Y653666D01*
X545478Y654168D01*
X544747Y654652D01*
X544004Y655117D01*
X543250Y655565D01*
X542485Y655994D01*
X541711Y656404D01*
X540926Y656796D01*
X540132Y657168D01*
X539330Y657520D01*
X538519Y657853D01*
X537700Y658167D01*
X536874Y658460D01*
X536041Y658733D01*
X535201Y658985D01*
X534356Y659217D01*
X533505Y659429D01*
X532649Y659619D01*
X531789Y659789D01*
X530925Y659938D01*
X530058Y660066D01*
X529187Y660172D01*
X528315Y660257D01*
X527440Y660321D01*
X526565Y660364D01*
X525688Y660385D01*
X524812Y660385D01*
X523935Y660364D01*
X523060Y660321D01*
X522185Y660257D01*
X521313Y660172D01*
X520442Y660066D01*
X519575Y659938D01*
X518711Y659789D01*
X517851Y659619D01*
X516995Y659429D01*
X516144Y659217D01*
X515299Y658985D01*
X514459Y658733D01*
X513626Y658460D01*
X512800Y658167D01*
X511981Y657853D01*
X511170Y657520D01*
X510368Y657168D01*
X509574Y656796D01*
X508789Y656404D01*
X508015Y655994D01*
X507250Y655565D01*
X506496Y655117D01*
X505753Y654652D01*
X505022Y654168D01*
X504303Y653666D01*
X503596Y653148D01*
X502902Y652612D01*
X502222Y652059D01*
X501555Y651490D01*
X500902Y650905D01*
X500263Y650305D01*
X499640Y649688D01*
X499031Y649057D01*
X498438Y648411D01*
X497861Y647751D01*
X497300Y647078D01*
X496756Y646390D01*
X496229Y645690D01*
X495719Y644977D01*
X495226Y644252D01*
X494751Y643515D01*
X494295Y642766D01*
X493856Y642007D01*
X493436Y641237D01*
X493036Y640458D01*
X492654Y639668D01*
X492291Y638870D01*
X491949Y638063D01*
X491625Y637248D01*
X491322Y636426D01*
X491039Y635596D01*
X490776Y634760D01*
X490534Y633917D01*
X490312Y633069D01*
X490111Y632215D01*
X489931Y631358D01*
X489772Y630495D01*
X489634Y629630D01*
X489517Y628761D01*
X489421Y627889D01*
X489346Y627016D01*
X489293Y626141D01*
X489261Y625265D01*
X489250Y624388D01*
X821250Y624388D02*
X821266Y625247D01*
X821304Y626106D01*
X821362Y626964D01*
X821441Y627820D01*
X821541Y628674D01*
X821662Y629525D01*
X821804Y630373D01*
X821966Y631217D01*
X822149Y632057D01*
X822352Y632892D01*
X822575Y633722D01*
X822819Y634547D01*
X823083Y635365D01*
X823366Y636176D01*
X823670Y636981D01*
X823992Y637777D01*
X824334Y638566D01*
X824696Y639346D01*
X825076Y640117D01*
X825475Y640879D01*
X825892Y641630D01*
X826328Y642371D01*
X826781Y643102D01*
X827252Y643821D01*
X827741Y644528D01*
X828246Y645223D01*
X828769Y645906D01*
X829308Y646576D01*
X829863Y647232D01*
X830434Y647875D01*
X831020Y648504D01*
X831622Y649118D01*
X832238Y649717D01*
X832869Y650301D01*
X833514Y650869D01*
X834172Y651422D01*
X834844Y651958D01*
X835529Y652478D01*
X836226Y652981D01*
X836935Y653467D01*
X837656Y653935D01*
X838388Y654386D01*
X839131Y654819D01*
X839884Y655233D01*
X840647Y655629D01*
X841419Y656007D01*
X842201Y656365D01*
X842991Y656704D01*
X843789Y657024D01*
X844594Y657324D01*
X845407Y657604D01*
X846226Y657865D01*
X847051Y658106D01*
X847882Y658326D01*
X848718Y658526D01*
X849559Y658706D01*
X850404Y658865D01*
X851252Y659003D01*
X852104Y659121D01*
X852958Y659217D01*
X853814Y659293D01*
X854672Y659348D01*
X855531Y659383D01*
X856391Y659396D01*
X857250Y659388D01*
X397250Y624388D02*
X394328Y624424D01*
X391407Y624530D01*
X388491Y624708D01*
X385579Y624957D01*
X382674Y625277D01*
X379778Y625667D01*
X376892Y626127D01*
X374018Y626658D01*
X371158Y627259D01*
X368314Y627929D01*
X365487Y628668D01*
X362678Y629476D01*
X359890Y630352D01*
X357124Y631295D01*
X354382Y632306D01*
X351666Y633383D01*
X348976Y634526D01*
X346315Y635734D01*
X343684Y637007D01*
X341086Y638343D01*
X338520Y639742D01*
X335989Y641203D01*
X333495Y642726D01*
X331038Y644308D01*
X328620Y645950D01*
X326244Y647651D01*
X323909Y649408D01*
X321618Y651223D01*
X319372Y653092D01*
X317172Y655015D01*
X315019Y656992D01*
X312915Y659020D01*
X310862Y661099D01*
X308859Y663227D01*
X306909Y665404D01*
X305012Y667627D01*
X303170Y669896D01*
X301384Y672209D01*
X299655Y674565D01*
X297984Y676962D01*
X296371Y679399D01*
X294819Y681875D01*
X293327Y684388D01*
X291897Y686936D01*
X290529Y689519D01*
X289224Y692134D01*
X287984Y694780D01*
X286808Y697455D01*
X285698Y700159D01*
X284654Y702888D01*
X283677Y705642D01*
X282767Y708419D01*
X281925Y711218D01*
X281152Y714036D01*
X280447Y716872D01*
X279812Y719725D01*
X279246Y722592D01*
X278750Y725472D01*
X278325Y728363D01*
X277970Y731263D01*
X277686Y734172D01*
X277472Y737086D01*
X277330Y740005D01*
X277259Y742927D01*
X277259Y745849D01*
X277330Y748771D01*
X277472Y751690D01*
X277686Y754604D01*
X277970Y757513D01*
X278325Y760413D01*
X278750Y763304D01*
X279246Y766184D01*
X279812Y769051D01*
X280447Y771904D01*
X281152Y774740D01*
X281925Y777558D01*
X282767Y780357D01*
X283677Y783134D01*
X284654Y785888D01*
X285698Y788617D01*
X286808Y791321D01*
X287984Y793996D01*
X289224Y796642D01*
X290529Y799257D01*
X291897Y801840D01*
X293327Y804388D01*
X294819Y806901D01*
X296371Y809377D01*
X297984Y811814D01*
X299655Y814211D01*
X301384Y816567D01*
X303170Y818880D01*
X305012Y821149D01*
X306909Y823372D01*
X308859Y825549D01*
X310862Y827677D01*
X312915Y829756D01*
X315019Y831784D01*
X317172Y833761D01*
X319372Y835684D01*
X321618Y837553D01*
X323909Y839368D01*
X326244Y841125D01*
X328620Y842826D01*
X331038Y844468D01*
X333495Y846050D01*
X335989Y847573D01*
X338520Y849034D01*
X341086Y850433D01*
X343684Y851769D01*
X346315Y853042D01*
X348976Y854250D01*
X351666Y855393D01*
X354382Y856470D01*
X357124Y857481D01*
X359890Y858424D01*
X362678Y859300D01*
X365487Y860108D01*
X368314Y860847D01*
X371158Y861517D01*
X374018Y862118D01*
X376892Y862649D01*
X379778Y863109D01*
X382674Y863499D01*
X385579Y863819D01*
X388491Y864068D01*
X391407Y864246D01*
X394328Y864352D01*
X397250Y864388D01*
D10*
X352250Y744388D02*
X352264Y745492D01*
X352304Y746596D01*
X352372Y747698D01*
X352467Y748799D01*
X352588Y749896D01*
X352737Y750991D01*
X352913Y752081D01*
X353115Y753167D01*
X353343Y754248D01*
X353599Y755322D01*
X353880Y756390D01*
X354188Y757451D01*
X354521Y758504D01*
X354881Y759548D01*
X355265Y760583D01*
X355675Y761609D01*
X356111Y762624D01*
X356570Y763628D01*
X357055Y764621D01*
X357564Y765601D01*
X358096Y766568D01*
X358652Y767523D01*
X359232Y768463D01*
X359834Y769389D01*
X360459Y770299D01*
X361106Y771194D01*
X361774Y772073D01*
X362465Y772936D01*
X363176Y773781D01*
X363907Y774608D01*
X364659Y775417D01*
X365430Y776208D01*
X366221Y776979D01*
X367030Y777731D01*
X367857Y778462D01*
X368702Y779173D01*
X369565Y779864D01*
X370444Y780532D01*
X371339Y781179D01*
X372249Y781804D01*
X373175Y782406D01*
X374115Y782986D01*
X375070Y783542D01*
X376037Y784074D01*
X377017Y784583D01*
X378010Y785068D01*
X379014Y785527D01*
X380029Y785963D01*
X381055Y786373D01*
X382090Y786757D01*
X383134Y787117D01*
X384187Y787450D01*
X385248Y787758D01*
X386316Y788039D01*
X387390Y788295D01*
X388471Y788523D01*
X389557Y788725D01*
X390647Y788901D01*
X391742Y789050D01*
X392839Y789171D01*
X393940Y789266D01*
X395042Y789334D01*
X396146Y789374D01*
X397250Y789388D01*
X398354Y789374D01*
X399458Y789334D01*
X400560Y789266D01*
X401661Y789171D01*
X402758Y789050D01*
X403853Y788901D01*
X404943Y788725D01*
X406029Y788523D01*
X407110Y788295D01*
X408184Y788039D01*
X409252Y787758D01*
X410313Y787450D01*
X411366Y787117D01*
X412410Y786757D01*
X413445Y786373D01*
X414471Y785963D01*
X415486Y785527D01*
X416490Y785068D01*
X417483Y784583D01*
X418463Y784074D01*
X419430Y783542D01*
X420385Y782986D01*
X421325Y782406D01*
X422251Y781804D01*
X423161Y781179D01*
X424056Y780532D01*
X424935Y779864D01*
X425798Y779173D01*
X426643Y778462D01*
X427470Y777731D01*
X428279Y776979D01*
X429070Y776208D01*
X429841Y775417D01*
X430593Y774608D01*
X431324Y773781D01*
X432035Y772936D01*
X432726Y772073D01*
X433394Y771194D01*
X434041Y770299D01*
X434666Y769389D01*
X435268Y768463D01*
X435848Y767523D01*
X436404Y766568D01*
X436936Y765601D01*
X437445Y764621D01*
X437930Y763628D01*
X438389Y762624D01*
X438825Y761609D01*
X439235Y760583D01*
X439619Y759548D01*
X439979Y758504D01*
X440312Y757451D01*
X440620Y756390D01*
X440901Y755322D01*
X441157Y754248D01*
X441385Y753167D01*
X441587Y752081D01*
X441763Y750991D01*
X441912Y749896D01*
X442033Y748799D01*
X442128Y747698D01*
X442196Y746596D01*
X442236Y745492D01*
X442250Y744388D01*
X442236Y743284D01*
X442196Y742180D01*
X442128Y741078D01*
X442033Y739977D01*
X441912Y738880D01*
X441763Y737785D01*
X441587Y736695D01*
X441385Y735609D01*
X441157Y734528D01*
X440901Y733454D01*
X440620Y732386D01*
X440312Y731325D01*
X439979Y730272D01*
X439619Y729228D01*
X439235Y728193D01*
X438825Y727167D01*
X438389Y726152D01*
X437930Y725148D01*
X437445Y724155D01*
X436936Y723175D01*
X436404Y722208D01*
X435848Y721253D01*
X435268Y720313D01*
X434666Y719387D01*
X434041Y718477D01*
X433394Y717582D01*
X432726Y716703D01*
X432035Y715840D01*
X431324Y714995D01*
X430593Y714168D01*
X429841Y713359D01*
X429070Y712568D01*
X428279Y711797D01*
X427470Y711045D01*
X426643Y710314D01*
X425798Y709603D01*
X424935Y708912D01*
X424056Y708244D01*
X423161Y707597D01*
X422251Y706972D01*
X421325Y706370D01*
X420385Y705790D01*
X419430Y705234D01*
X418463Y704702D01*
X417483Y704193D01*
X416490Y703708D01*
X415486Y703249D01*
X414471Y702813D01*
X413445Y702403D01*
X412410Y702019D01*
X411366Y701659D01*
X410313Y701326D01*
X409252Y701018D01*
X408184Y700737D01*
X407110Y700481D01*
X406029Y700253D01*
X404943Y700051D01*
X403853Y699875D01*
X402758Y699726D01*
X401661Y699605D01*
X400560Y699510D01*
X399458Y699442D01*
X398354Y699402D01*
X397250Y699388D01*
X396146Y699402D01*
X395042Y699442D01*
X393940Y699510D01*
X392839Y699605D01*
X391742Y699726D01*
X390647Y699875D01*
X389557Y700051D01*
X388471Y700253D01*
X387390Y700481D01*
X386316Y700737D01*
X385248Y701018D01*
X384187Y701326D01*
X383134Y701659D01*
X382090Y702019D01*
X381055Y702403D01*
X380029Y702813D01*
X379014Y703249D01*
X378010Y703708D01*
X377017Y704193D01*
X376037Y704702D01*
X375070Y705234D01*
X374115Y705790D01*
X373175Y706370D01*
X372249Y706972D01*
X371339Y707597D01*
X370444Y708244D01*
X369565Y708912D01*
X368702Y709603D01*
X367857Y710314D01*
X367030Y711045D01*
X366221Y711797D01*
X365430Y712568D01*
X364659Y713359D01*
X363907Y714168D01*
X363176Y714995D01*
X362465Y715840D01*
X361774Y716703D01*
X361106Y717582D01*
X360459Y718477D01*
X359834Y719387D01*
X359232Y720313D01*
X358652Y721253D01*
X358096Y722208D01*
X357564Y723175D01*
X357055Y724155D01*
X356570Y725148D01*
X356111Y726152D01*
X355675Y727167D01*
X355265Y728193D01*
X354881Y729228D01*
X354521Y730272D01*
X354188Y731325D01*
X353880Y732386D01*
X353599Y733454D01*
X353343Y734528D01*
X353115Y735609D01*
X352913Y736695D01*
X352737Y737785D01*
X352588Y738880D01*
X352467Y739977D01*
X352372Y741078D01*
X352304Y742180D01*
X352264Y743284D01*
X352250Y744388D01*
D11*
X398250Y624388D02*
X489250Y624388D01*
X561250Y864388D02*
X821250Y864388D01*
X561250Y864388D02*
X561239Y863511D01*
X561207Y862635D01*
X561154Y861760D01*
X561079Y860887D01*
X560983Y860015D01*
X560866Y859146D01*
X560728Y858281D01*
X560569Y857418D01*
X560389Y856561D01*
X560188Y855707D01*
X559966Y854859D01*
X559724Y854016D01*
X559461Y853180D01*
X559178Y852350D01*
X558875Y851528D01*
X558551Y850713D01*
X558209Y849906D01*
X557846Y849108D01*
X557464Y848318D01*
X557064Y847539D01*
X556644Y846769D01*
X556205Y846010D01*
X555749Y845261D01*
X555274Y844524D01*
X554781Y843799D01*
X554271Y843086D01*
X553744Y842386D01*
X553200Y841698D01*
X552639Y841025D01*
X552062Y840365D01*
X551469Y839719D01*
X550860Y839088D01*
X550237Y838471D01*
X549598Y837871D01*
X548945Y837286D01*
X548278Y836717D01*
X547598Y836164D01*
X546904Y835628D01*
X546197Y835110D01*
X545478Y834608D01*
X544747Y834124D01*
X544004Y833659D01*
X543250Y833211D01*
X542485Y832782D01*
X541711Y832372D01*
X540926Y831980D01*
X540132Y831608D01*
X539330Y831256D01*
X538519Y830923D01*
X537700Y830609D01*
X536874Y830316D01*
X536041Y830043D01*
X535201Y829791D01*
X534356Y829559D01*
X533505Y829347D01*
X532649Y829157D01*
X531789Y828987D01*
X530925Y828838D01*
X530058Y828710D01*
X529187Y828604D01*
X528315Y828519D01*
X527440Y828455D01*
X526565Y828412D01*
X525688Y828391D01*
X524812Y828391D01*
X523935Y828412D01*
X523060Y828455D01*
X522185Y828519D01*
X521313Y828604D01*
X520442Y828710D01*
X519575Y828838D01*
X518711Y828987D01*
X517851Y829157D01*
X516995Y829347D01*
X516144Y829559D01*
X515299Y829791D01*
X514459Y830043D01*
X513626Y830316D01*
X512800Y830609D01*
X511981Y830923D01*
X511170Y831256D01*
X510368Y831608D01*
X509574Y831980D01*
X508789Y832372D01*
X508015Y832782D01*
X507250Y833211D01*
X506496Y833659D01*
X505753Y834124D01*
X505022Y834608D01*
X504303Y835110D01*
X503596Y835628D01*
X502902Y836164D01*
X502222Y836717D01*
X501555Y837286D01*
X500902Y837871D01*
X500263Y838471D01*
X499640Y839088D01*
X499031Y839719D01*
X498438Y840365D01*
X497861Y841025D01*
X497300Y841698D01*
X496756Y842386D01*
X496229Y843086D01*
X495719Y843799D01*
X495226Y844524D01*
X494751Y845261D01*
X494295Y846010D01*
X493856Y846769D01*
X493436Y847539D01*
X493036Y848318D01*
X492654Y849108D01*
X492291Y849906D01*
X491949Y850713D01*
X491625Y851528D01*
X491322Y852350D01*
X491039Y853180D01*
X490776Y854016D01*
X490534Y854859D01*
X490312Y855707D01*
X490111Y856561D01*
X489931Y857418D01*
X489772Y858281D01*
X489634Y859146D01*
X489517Y860015D01*
X489421Y860887D01*
X489346Y861760D01*
X489293Y862635D01*
X489261Y863511D01*
X489250Y864388D01*
X821250Y864387D02*
X821266Y863528D01*
X821304Y862669D01*
X821362Y861811D01*
X821441Y860955D01*
X821541Y860101D01*
X821662Y859250D01*
X821804Y858402D01*
X821966Y857558D01*
X822149Y856718D01*
X822352Y855883D01*
X822575Y855053D01*
X822819Y854228D01*
X823083Y853410D01*
X823366Y852599D01*
X823670Y851794D01*
X823992Y850998D01*
X824334Y850209D01*
X824696Y849429D01*
X825076Y848658D01*
X825475Y847896D01*
X825892Y847145D01*
X826328Y846404D01*
X826781Y845673D01*
X827252Y844954D01*
X827741Y844247D01*
X828246Y843552D01*
X828769Y842869D01*
X829308Y842199D01*
X829863Y841543D01*
X830434Y840900D01*
X831020Y840271D01*
X831622Y839657D01*
X832238Y839058D01*
X832869Y838474D01*
X833514Y837906D01*
X834172Y837353D01*
X834844Y836817D01*
X835529Y836297D01*
X836226Y835794D01*
X836935Y835308D01*
X837656Y834840D01*
X838388Y834389D01*
X839131Y833956D01*
X839884Y833542D01*
X840647Y833146D01*
X841419Y832768D01*
X842201Y832410D01*
X842991Y832071D01*
X843789Y831751D01*
X844594Y831451D01*
X845407Y831171D01*
X846226Y830910D01*
X847051Y830669D01*
X847882Y830449D01*
X848718Y830249D01*
X849559Y830069D01*
X850404Y829910D01*
X851252Y829772D01*
X852104Y829654D01*
X852958Y829558D01*
X853814Y829482D01*
X854672Y829427D01*
X855531Y829392D01*
X856391Y829379D01*
X857250Y829387D01*
X489250Y864388D02*
X398250Y864388D01*
X857250Y829388D02*
X857250Y659388D01*
X700588Y302350D02*
X700588Y42350D01*
X700588Y302350D02*
X701465Y302361D01*
X702341Y302393D01*
X703216Y302446D01*
X704089Y302521D01*
X704961Y302617D01*
X705830Y302734D01*
X706695Y302872D01*
X707558Y303031D01*
X708415Y303211D01*
X709269Y303412D01*
X710117Y303634D01*
X710960Y303876D01*
X711796Y304139D01*
X712626Y304422D01*
X713448Y304725D01*
X714263Y305049D01*
X715070Y305391D01*
X715868Y305754D01*
X716658Y306136D01*
X717437Y306536D01*
X718207Y306956D01*
X718966Y307395D01*
X719715Y307851D01*
X720452Y308326D01*
X721177Y308819D01*
X721890Y309329D01*
X722590Y309856D01*
X723278Y310400D01*
X723951Y310961D01*
X724611Y311538D01*
X725257Y312131D01*
X725888Y312740D01*
X726505Y313363D01*
X727105Y314002D01*
X727690Y314655D01*
X728259Y315322D01*
X728812Y316002D01*
X729348Y316696D01*
X729866Y317403D01*
X730368Y318122D01*
X730852Y318853D01*
X731317Y319596D01*
X731765Y320350D01*
X732194Y321115D01*
X732604Y321889D01*
X732996Y322674D01*
X733368Y323468D01*
X733720Y324270D01*
X734053Y325081D01*
X734367Y325900D01*
X734660Y326726D01*
X734933Y327559D01*
X735185Y328399D01*
X735417Y329244D01*
X735629Y330095D01*
X735819Y330951D01*
X735989Y331811D01*
X736138Y332675D01*
X736266Y333542D01*
X736372Y334413D01*
X736457Y335285D01*
X736521Y336160D01*
X736564Y337035D01*
X736585Y337912D01*
X736585Y338788D01*
X736564Y339665D01*
X736521Y340540D01*
X736457Y341415D01*
X736372Y342287D01*
X736266Y343158D01*
X736138Y344025D01*
X735989Y344889D01*
X735819Y345749D01*
X735629Y346605D01*
X735417Y347456D01*
X735185Y348301D01*
X734933Y349141D01*
X734660Y349974D01*
X734367Y350800D01*
X734053Y351619D01*
X733720Y352430D01*
X733368Y353232D01*
X732996Y354026D01*
X732604Y354811D01*
X732194Y355585D01*
X731765Y356350D01*
X731317Y357104D01*
X730852Y357847D01*
X730368Y358578D01*
X729866Y359297D01*
X729348Y360004D01*
X728812Y360698D01*
X728259Y361378D01*
X727690Y362045D01*
X727105Y362698D01*
X726505Y363337D01*
X725888Y363960D01*
X725257Y364569D01*
X724611Y365162D01*
X723951Y365739D01*
X723278Y366300D01*
X722590Y366844D01*
X721890Y367371D01*
X721177Y367881D01*
X720452Y368374D01*
X719715Y368849D01*
X718966Y369305D01*
X718207Y369744D01*
X717437Y370164D01*
X716658Y370564D01*
X715868Y370946D01*
X715070Y371309D01*
X714263Y371651D01*
X713448Y371975D01*
X712626Y372278D01*
X711796Y372561D01*
X710960Y372824D01*
X710117Y373066D01*
X709269Y373288D01*
X708415Y373489D01*
X707558Y373669D01*
X706695Y373828D01*
X705830Y373966D01*
X704961Y374083D01*
X704089Y374179D01*
X703216Y374254D01*
X702341Y374307D01*
X701465Y374339D01*
X700588Y374350D01*
X700588Y42350D02*
X701447Y42334D01*
X702306Y42296D01*
X703164Y42238D01*
X704020Y42159D01*
X704874Y42059D01*
X705725Y41938D01*
X706573Y41796D01*
X707417Y41634D01*
X708257Y41451D01*
X709092Y41248D01*
X709922Y41025D01*
X710747Y40781D01*
X711565Y40517D01*
X712376Y40234D01*
X713181Y39930D01*
X713977Y39608D01*
X714766Y39266D01*
X715546Y38904D01*
X716317Y38524D01*
X717079Y38125D01*
X717830Y37708D01*
X718571Y37272D01*
X719302Y36819D01*
X720021Y36348D01*
X720728Y35859D01*
X721423Y35354D01*
X722106Y34831D01*
X722776Y34292D01*
X723432Y33737D01*
X724075Y33166D01*
X724704Y32580D01*
X725318Y31978D01*
X725917Y31362D01*
X726501Y30731D01*
X727069Y30086D01*
X727622Y29428D01*
X728158Y28756D01*
X728678Y28071D01*
X729181Y27374D01*
X729667Y26665D01*
X730135Y25944D01*
X730586Y25212D01*
X731019Y24469D01*
X731433Y23716D01*
X731829Y22953D01*
X732207Y22181D01*
X732565Y21399D01*
X732904Y20609D01*
X733224Y19811D01*
X733524Y19006D01*
X733804Y18193D01*
X734065Y17374D01*
X734306Y16549D01*
X734526Y15718D01*
X734726Y14882D01*
X734906Y14041D01*
X735065Y13196D01*
X735203Y12348D01*
X735321Y11496D01*
X735417Y10642D01*
X735493Y9786D01*
X735548Y8928D01*
X735583Y8069D01*
X735596Y7209D01*
X735588Y6350D01*
X700588Y466350D02*
X700624Y469272D01*
X700730Y472193D01*
X700908Y475109D01*
X701157Y478021D01*
X701477Y480926D01*
X701867Y483822D01*
X702327Y486708D01*
X702858Y489582D01*
X703459Y492442D01*
X704129Y495286D01*
X704868Y498113D01*
X705676Y500922D01*
X706552Y503710D01*
X707495Y506476D01*
X708506Y509218D01*
X709583Y511934D01*
X710726Y514624D01*
X711934Y517285D01*
X713207Y519916D01*
X714543Y522514D01*
X715942Y525080D01*
X717403Y527611D01*
X718926Y530105D01*
X720508Y532562D01*
X722150Y534980D01*
X723851Y537356D01*
X725608Y539691D01*
X727423Y541982D01*
X729292Y544228D01*
X731215Y546428D01*
X733192Y548581D01*
X735220Y550685D01*
X737299Y552738D01*
X739427Y554741D01*
X741604Y556691D01*
X743827Y558588D01*
X746096Y560430D01*
X748409Y562216D01*
X750765Y563945D01*
X753162Y565616D01*
X755599Y567229D01*
X758075Y568781D01*
X760588Y570273D01*
X763136Y571703D01*
X765719Y573071D01*
X768334Y574376D01*
X770980Y575616D01*
X773655Y576792D01*
X776359Y577902D01*
X779088Y578946D01*
X781842Y579923D01*
X784619Y580833D01*
X787418Y581675D01*
X790236Y582448D01*
X793072Y583153D01*
X795925Y583788D01*
X798792Y584354D01*
X801672Y584850D01*
X804563Y585275D01*
X807463Y585630D01*
X810372Y585914D01*
X813286Y586128D01*
X816205Y586270D01*
X819127Y586341D01*
X822049Y586341D01*
X824971Y586270D01*
X827890Y586128D01*
X830804Y585914D01*
X833713Y585630D01*
X836613Y585275D01*
X839504Y584850D01*
X842384Y584354D01*
X845251Y583788D01*
X848104Y583153D01*
X850940Y582448D01*
X853758Y581675D01*
X856557Y580833D01*
X859334Y579923D01*
X862088Y578946D01*
X864817Y577902D01*
X867521Y576792D01*
X870196Y575616D01*
X872842Y574376D01*
X875457Y573071D01*
X878040Y571703D01*
X880588Y570273D01*
X883101Y568781D01*
X885577Y567229D01*
X888014Y565616D01*
X890411Y563945D01*
X892767Y562216D01*
X895080Y560430D01*
X897349Y558588D01*
X899572Y556691D01*
X901749Y554741D01*
X903877Y552738D01*
X905956Y550685D01*
X907984Y548581D01*
X909961Y546428D01*
X911884Y544228D01*
X913753Y541982D01*
X915568Y539691D01*
X917325Y537356D01*
X919026Y534980D01*
X920668Y532562D01*
X922250Y530105D01*
X923773Y527611D01*
X925234Y525080D01*
X926633Y522514D01*
X927969Y519916D01*
X929242Y517285D01*
X930450Y514624D01*
X931593Y511934D01*
X932670Y509218D01*
X933681Y506476D01*
X934624Y503710D01*
X935500Y500922D01*
X936308Y498113D01*
X937047Y495286D01*
X937717Y492442D01*
X938318Y489582D01*
X938849Y486708D01*
X939309Y483822D01*
X939699Y480926D01*
X940019Y478021D01*
X940268Y475109D01*
X940446Y472193D01*
X940552Y469272D01*
X940588Y466350D01*
D10*
X775588Y466350D02*
X775602Y467454D01*
X775642Y468558D01*
X775710Y469660D01*
X775805Y470761D01*
X775926Y471858D01*
X776075Y472953D01*
X776251Y474043D01*
X776453Y475129D01*
X776681Y476210D01*
X776937Y477284D01*
X777218Y478352D01*
X777526Y479413D01*
X777859Y480466D01*
X778219Y481510D01*
X778603Y482545D01*
X779013Y483571D01*
X779449Y484586D01*
X779908Y485590D01*
X780393Y486583D01*
X780902Y487563D01*
X781434Y488530D01*
X781990Y489485D01*
X782570Y490425D01*
X783172Y491351D01*
X783797Y492261D01*
X784444Y493156D01*
X785112Y494035D01*
X785803Y494898D01*
X786514Y495743D01*
X787245Y496570D01*
X787997Y497379D01*
X788768Y498170D01*
X789559Y498941D01*
X790368Y499693D01*
X791195Y500424D01*
X792040Y501135D01*
X792903Y501826D01*
X793782Y502494D01*
X794677Y503141D01*
X795587Y503766D01*
X796513Y504368D01*
X797453Y504948D01*
X798408Y505504D01*
X799375Y506036D01*
X800355Y506545D01*
X801348Y507030D01*
X802352Y507489D01*
X803367Y507925D01*
X804393Y508335D01*
X805428Y508719D01*
X806472Y509079D01*
X807525Y509412D01*
X808586Y509720D01*
X809654Y510001D01*
X810728Y510257D01*
X811809Y510485D01*
X812895Y510687D01*
X813985Y510863D01*
X815080Y511012D01*
X816177Y511133D01*
X817278Y511228D01*
X818380Y511296D01*
X819484Y511336D01*
X820588Y511350D01*
X821692Y511336D01*
X822796Y511296D01*
X823898Y511228D01*
X824999Y511133D01*
X826096Y511012D01*
X827191Y510863D01*
X828281Y510687D01*
X829367Y510485D01*
X830448Y510257D01*
X831522Y510001D01*
X832590Y509720D01*
X833651Y509412D01*
X834704Y509079D01*
X835748Y508719D01*
X836783Y508335D01*
X837809Y507925D01*
X838824Y507489D01*
X839828Y507030D01*
X840821Y506545D01*
X841801Y506036D01*
X842768Y505504D01*
X843723Y504948D01*
X844663Y504368D01*
X845589Y503766D01*
X846499Y503141D01*
X847394Y502494D01*
X848273Y501826D01*
X849136Y501135D01*
X849981Y500424D01*
X850808Y499693D01*
X851617Y498941D01*
X852408Y498170D01*
X853179Y497379D01*
X853931Y496570D01*
X854662Y495743D01*
X855373Y494898D01*
X856064Y494035D01*
X856732Y493156D01*
X857379Y492261D01*
X858004Y491351D01*
X858606Y490425D01*
X859186Y489485D01*
X859742Y488530D01*
X860274Y487563D01*
X860783Y486583D01*
X861268Y485590D01*
X861727Y484586D01*
X862163Y483571D01*
X862573Y482545D01*
X862957Y481510D01*
X863317Y480466D01*
X863650Y479413D01*
X863958Y478352D01*
X864239Y477284D01*
X864495Y476210D01*
X864723Y475129D01*
X864925Y474043D01*
X865101Y472953D01*
X865250Y471858D01*
X865371Y470761D01*
X865466Y469660D01*
X865534Y468558D01*
X865574Y467454D01*
X865588Y466350D01*
X865574Y465246D01*
X865534Y464142D01*
X865466Y463040D01*
X865371Y461939D01*
X865250Y460842D01*
X865101Y459747D01*
X864925Y458657D01*
X864723Y457571D01*
X864495Y456490D01*
X864239Y455416D01*
X863958Y454348D01*
X863650Y453287D01*
X863317Y452234D01*
X862957Y451190D01*
X862573Y450155D01*
X862163Y449129D01*
X861727Y448114D01*
X861268Y447110D01*
X860783Y446117D01*
X860274Y445137D01*
X859742Y444170D01*
X859186Y443215D01*
X858606Y442275D01*
X858004Y441349D01*
X857379Y440439D01*
X856732Y439544D01*
X856064Y438665D01*
X855373Y437802D01*
X854662Y436957D01*
X853931Y436130D01*
X853179Y435321D01*
X852408Y434530D01*
X851617Y433759D01*
X850808Y433007D01*
X849981Y432276D01*
X849136Y431565D01*
X848273Y430874D01*
X847394Y430206D01*
X846499Y429559D01*
X845589Y428934D01*
X844663Y428332D01*
X843723Y427752D01*
X842768Y427196D01*
X841801Y426664D01*
X840821Y426155D01*
X839828Y425670D01*
X838824Y425211D01*
X837809Y424775D01*
X836783Y424365D01*
X835748Y423981D01*
X834704Y423621D01*
X833651Y423288D01*
X832590Y422980D01*
X831522Y422699D01*
X830448Y422443D01*
X829367Y422215D01*
X828281Y422013D01*
X827191Y421837D01*
X826096Y421688D01*
X824999Y421567D01*
X823898Y421472D01*
X822796Y421404D01*
X821692Y421364D01*
X820588Y421350D01*
X819484Y421364D01*
X818380Y421404D01*
X817278Y421472D01*
X816177Y421567D01*
X815080Y421688D01*
X813985Y421837D01*
X812895Y422013D01*
X811809Y422215D01*
X810728Y422443D01*
X809654Y422699D01*
X808586Y422980D01*
X807525Y423288D01*
X806472Y423621D01*
X805428Y423981D01*
X804393Y424365D01*
X803367Y424775D01*
X802352Y425211D01*
X801348Y425670D01*
X800355Y426155D01*
X799375Y426664D01*
X798408Y427196D01*
X797453Y427752D01*
X796513Y428332D01*
X795587Y428934D01*
X794677Y429559D01*
X793782Y430206D01*
X792903Y430874D01*
X792040Y431565D01*
X791195Y432276D01*
X790368Y433007D01*
X789559Y433759D01*
X788768Y434530D01*
X787997Y435321D01*
X787245Y436130D01*
X786514Y436957D01*
X785803Y437802D01*
X785112Y438665D01*
X784444Y439544D01*
X783797Y440439D01*
X783172Y441349D01*
X782570Y442275D01*
X781990Y443215D01*
X781434Y444170D01*
X780902Y445137D01*
X780393Y446117D01*
X779908Y447110D01*
X779449Y448114D01*
X779013Y449129D01*
X778603Y450155D01*
X778219Y451190D01*
X777859Y452234D01*
X777526Y453287D01*
X777218Y454348D01*
X776937Y455416D01*
X776681Y456490D01*
X776453Y457571D01*
X776251Y458657D01*
X776075Y459747D01*
X775926Y460842D01*
X775805Y461939D01*
X775710Y463040D01*
X775642Y464142D01*
X775602Y465246D01*
X775588Y466350D01*
D11*
X700588Y465350D02*
X700588Y374350D01*
X940588Y302350D02*
X940588Y42350D01*
X940588Y302350D02*
X939711Y302361D01*
X938835Y302393D01*
X937960Y302446D01*
X937087Y302521D01*
X936215Y302617D01*
X935346Y302734D01*
X934481Y302872D01*
X933618Y303031D01*
X932761Y303211D01*
X931907Y303412D01*
X931059Y303634D01*
X930216Y303876D01*
X929380Y304139D01*
X928550Y304422D01*
X927728Y304725D01*
X926913Y305049D01*
X926106Y305391D01*
X925308Y305754D01*
X924518Y306136D01*
X923739Y306536D01*
X922969Y306956D01*
X922210Y307395D01*
X921461Y307851D01*
X920724Y308326D01*
X919999Y308819D01*
X919286Y309329D01*
X918586Y309856D01*
X917898Y310400D01*
X917225Y310961D01*
X916565Y311538D01*
X915919Y312131D01*
X915288Y312740D01*
X914671Y313363D01*
X914071Y314002D01*
X913486Y314655D01*
X912917Y315322D01*
X912364Y316002D01*
X911828Y316696D01*
X911310Y317403D01*
X910808Y318122D01*
X910324Y318853D01*
X909859Y319596D01*
X909411Y320350D01*
X908982Y321115D01*
X908572Y321889D01*
X908180Y322674D01*
X907808Y323468D01*
X907456Y324270D01*
X907123Y325081D01*
X906809Y325900D01*
X906516Y326726D01*
X906243Y327559D01*
X905991Y328399D01*
X905759Y329244D01*
X905547Y330095D01*
X905357Y330951D01*
X905187Y331811D01*
X905038Y332675D01*
X904910Y333542D01*
X904804Y334413D01*
X904719Y335285D01*
X904655Y336160D01*
X904612Y337035D01*
X904591Y337912D01*
X904591Y338788D01*
X904612Y339665D01*
X904655Y340540D01*
X904719Y341415D01*
X904804Y342287D01*
X904910Y343158D01*
X905038Y344025D01*
X905187Y344889D01*
X905357Y345749D01*
X905547Y346605D01*
X905759Y347456D01*
X905991Y348301D01*
X906243Y349141D01*
X906516Y349974D01*
X906809Y350800D01*
X907123Y351619D01*
X907456Y352430D01*
X907808Y353232D01*
X908180Y354026D01*
X908572Y354811D01*
X908982Y355585D01*
X909411Y356350D01*
X909859Y357104D01*
X910324Y357847D01*
X910808Y358578D01*
X911310Y359297D01*
X911828Y360004D01*
X912364Y360698D01*
X912917Y361378D01*
X913486Y362045D01*
X914071Y362698D01*
X914671Y363337D01*
X915288Y363960D01*
X915919Y364569D01*
X916565Y365162D01*
X917225Y365739D01*
X917898Y366300D01*
X918586Y366844D01*
X919286Y367371D01*
X919999Y367881D01*
X920724Y368374D01*
X921461Y368849D01*
X922210Y369305D01*
X922969Y369744D01*
X923739Y370164D01*
X924518Y370564D01*
X925308Y370946D01*
X926106Y371309D01*
X926913Y371651D01*
X927728Y371975D01*
X928550Y372278D01*
X929380Y372561D01*
X930216Y372824D01*
X931059Y373066D01*
X931907Y373288D01*
X932761Y373489D01*
X933618Y373669D01*
X934481Y373828D01*
X935346Y373966D01*
X936215Y374083D01*
X937087Y374179D01*
X937960Y374254D01*
X938835Y374307D01*
X939711Y374339D01*
X940588Y374350D01*
X940587Y42350D02*
X939728Y42334D01*
X938869Y42296D01*
X938011Y42238D01*
X937155Y42159D01*
X936301Y42059D01*
X935450Y41938D01*
X934602Y41796D01*
X933758Y41634D01*
X932918Y41451D01*
X932083Y41248D01*
X931253Y41025D01*
X930428Y40781D01*
X929610Y40517D01*
X928799Y40234D01*
X927994Y39930D01*
X927198Y39608D01*
X926409Y39266D01*
X925629Y38904D01*
X924858Y38524D01*
X924096Y38125D01*
X923345Y37708D01*
X922604Y37272D01*
X921873Y36819D01*
X921154Y36348D01*
X920447Y35859D01*
X919752Y35354D01*
X919069Y34831D01*
X918399Y34292D01*
X917743Y33737D01*
X917100Y33166D01*
X916471Y32580D01*
X915857Y31978D01*
X915258Y31362D01*
X914674Y30731D01*
X914106Y30086D01*
X913553Y29428D01*
X913017Y28756D01*
X912497Y28071D01*
X911994Y27374D01*
X911508Y26665D01*
X911040Y25944D01*
X910589Y25212D01*
X910156Y24469D01*
X909742Y23716D01*
X909346Y22953D01*
X908968Y22181D01*
X908610Y21399D01*
X908271Y20609D01*
X907951Y19811D01*
X907651Y19006D01*
X907371Y18193D01*
X907110Y17374D01*
X906869Y16549D01*
X906649Y15718D01*
X906449Y14882D01*
X906269Y14041D01*
X906110Y13196D01*
X905972Y12348D01*
X905854Y11496D01*
X905758Y10642D01*
X905682Y9786D01*
X905627Y8928D01*
X905592Y8069D01*
X905579Y7209D01*
X905587Y6350D01*
X940588Y374350D02*
X940588Y465350D01*
X905588Y6350D02*
X735588Y6350D01*
M02*
