Circuit: * C:\Users\mogei\Projects\Robot\PCBs\BMS_PD\Simulations\LTSpice\CCwithADP1853\ConstantCurrent\BuckConverterTest.asc

Error on line 22 : v2 nc_04 nc_05 v
	 Unknown parameter "v"
WARNING: Node NC_05 is floating.

WARNING: Less than two connections to node NC_04.  This node is used by V2.
WARNING: Less than two connections to node NC_05.  This node is used by V2.
V2: Missing value, assumed 0V @ DC
Direct Newton iteration for .op point succeeded.
.step r=5
Heightened Def Con from 0.00027072 to 0.000270723
Heightened Def Con from 0.000416502 to 0.000416505
Heightened Def Con from 0.000416827 to 0.00041683
Heightened Def Con from 0.000540241 to 0.000540244
