<?xml version="1.0" encoding="utf-8"?>
<!DOCTYPE eagle SYSTEM "eagle.dtd">
<eagle version="9.4.2">
<drawing>
<settings>
<setting alwaysvectorfont="no"/>
<setting verticaltext="up"/>
</settings>
<grid distance="12.5" unitdist="mil" unit="mil" style="dots" multiple="1" display="yes" altdistance="5" altunitdist="mil" altunit="mil"/>
<layers>
<layer number="1" name="Top" color="4" fill="1" visible="yes" active="yes"/>
<layer number="2" name="Route2" color="16" fill="1" visible="no" active="no"/>
<layer number="3" name="Route3" color="17" fill="1" visible="no" active="no"/>
<layer number="4" name="Route4" color="18" fill="1" visible="no" active="no"/>
<layer number="5" name="Route5" color="19" fill="1" visible="no" active="no"/>
<layer number="6" name="Route6" color="25" fill="1" visible="no" active="no"/>
<layer number="7" name="Route7" color="26" fill="1" visible="no" active="no"/>
<layer number="8" name="Route8" color="27" fill="1" visible="no" active="no"/>
<layer number="9" name="Route9" color="28" fill="1" visible="no" active="no"/>
<layer number="10" name="Route10" color="29" fill="1" visible="no" active="no"/>
<layer number="11" name="Route11" color="30" fill="1" visible="no" active="no"/>
<layer number="12" name="Route12" color="20" fill="1" visible="no" active="no"/>
<layer number="13" name="Route13" color="21" fill="1" visible="no" active="no"/>
<layer number="14" name="Route14" color="22" fill="1" visible="no" active="no"/>
<layer number="15" name="Route15" color="23" fill="1" visible="no" active="no"/>
<layer number="16" name="Bottom" color="1" fill="1" visible="yes" active="yes"/>
<layer number="17" name="Pads" color="2" fill="1" visible="yes" active="yes"/>
<layer number="18" name="Vias" color="2" fill="1" visible="yes" active="yes"/>
<layer number="19" name="Unrouted" color="6" fill="1" visible="yes" active="yes"/>
<layer number="20" name="Dimension" color="24" fill="1" visible="yes" active="yes"/>
<layer number="21" name="tPlace" color="7" fill="1" visible="yes" active="yes"/>
<layer number="22" name="bPlace" color="7" fill="1" visible="yes" active="yes"/>
<layer number="23" name="tOrigins" color="15" fill="1" visible="yes" active="yes"/>
<layer number="24" name="bOrigins" color="15" fill="1" visible="yes" active="yes"/>
<layer number="25" name="tNames" color="7" fill="1" visible="yes" active="yes"/>
<layer number="26" name="bNames" color="7" fill="1" visible="yes" active="yes"/>
<layer number="27" name="tValues" color="7" fill="1" visible="yes" active="yes"/>
<layer number="28" name="bValues" color="7" fill="1" visible="yes" active="yes"/>
<layer number="29" name="tStop" color="7" fill="3" visible="no" active="yes"/>
<layer number="30" name="bStop" color="7" fill="6" visible="no" active="yes"/>
<layer number="31" name="tCream" color="7" fill="4" visible="no" active="yes"/>
<layer number="32" name="bCream" color="7" fill="5" visible="no" active="yes"/>
<layer number="33" name="tFinish" color="6" fill="3" visible="no" active="yes"/>
<layer number="34" name="bFinish" color="6" fill="6" visible="no" active="yes"/>
<layer number="35" name="tGlue" color="7" fill="4" visible="no" active="yes"/>
<layer number="36" name="bGlue" color="7" fill="5" visible="no" active="yes"/>
<layer number="37" name="tTest" color="7" fill="1" visible="no" active="yes"/>
<layer number="38" name="bTest" color="7" fill="1" visible="no" active="yes"/>
<layer number="39" name="tKeepout" color="4" fill="11" visible="yes" active="yes"/>
<layer number="40" name="bKeepout" color="1" fill="11" visible="yes" active="yes"/>
<layer number="41" name="tRestrict" color="4" fill="10" visible="yes" active="yes"/>
<layer number="42" name="bRestrict" color="1" fill="10" visible="yes" active="yes"/>
<layer number="43" name="vRestrict" color="2" fill="10" visible="yes" active="yes"/>
<layer number="44" name="Drills" color="7" fill="1" visible="no" active="yes"/>
<layer number="45" name="Holes" color="7" fill="1" visible="no" active="yes"/>
<layer number="46" name="Milling" color="3" fill="1" visible="no" active="yes"/>
<layer number="47" name="Measures" color="7" fill="1" visible="no" active="yes"/>
<layer number="48" name="Document" color="7" fill="1" visible="yes" active="yes"/>
<layer number="49" name="Reference" color="7" fill="1" visible="yes" active="yes"/>
<layer number="51" name="tDocu" color="7" fill="1" visible="yes" active="yes"/>
<layer number="52" name="bDocu" color="7" fill="1" visible="yes" active="yes"/>
<layer number="88" name="SimResults" color="9" fill="1" visible="no" active="no"/>
<layer number="89" name="SimProbes" color="9" fill="1" visible="no" active="no"/>
<layer number="90" name="Modules" color="5" fill="1" visible="no" active="no"/>
<layer number="91" name="Nets" color="2" fill="1" visible="no" active="no"/>
<layer number="92" name="Busses" color="1" fill="1" visible="no" active="no"/>
<layer number="93" name="Pins" color="2" fill="1" visible="no" active="no"/>
<layer number="94" name="Symbols" color="4" fill="1" visible="no" active="no"/>
<layer number="95" name="Names" color="7" fill="1" visible="no" active="no"/>
<layer number="96" name="Values" color="7" fill="1" visible="no" active="no"/>
<layer number="97" name="Info" color="7" fill="1" visible="no" active="no"/>
<layer number="98" name="Guide" color="6" fill="1" visible="no" active="no"/>
<layer number="99" name="SpiceOrder" color="5" fill="1" visible="no" active="no"/>
</layers>
<board>
<plain>
<wire x1="0" y1="0" x2="58.4" y2="0" width="0" layer="20"/>
<wire x1="58.4" y1="0" x2="58.4" y2="26.0225" width="0" layer="20"/>
<wire x1="58.4" y1="26.0225" x2="0" y2="26.0225" width="0" layer="20"/>
<wire x1="0" y1="26.0225" x2="0" y2="0" width="0" layer="20"/>
</plain>
<libraries>
<library name="Standard">
<packages>
<package name="CAPC2012X70N" urn="urn:adsk.eagle:footprint:13124732/1" locally_modified="yes">
<description>Chip, 2.00 X 1.25 X 0.70 mm body
&lt;p&gt;Chip package with body size 2.00 X 1.25 X 0.70 mm&lt;/p&gt;</description>
<smd name="1" x="-0.8754" y="0" dx="1.1646" dy="1.4653" layer="1"/>
<smd name="2" x="0.8754" y="0" dx="1.1646" dy="1.4653" layer="1"/>
<text x="0" y="1.6817" size="0.8128" layer="25" align="bottom-center">&gt;NAME</text>
<text x="0" y="-1.6817" size="0.8128" layer="27" align="top-center">&gt;VALUE</text>
<rectangle x1="-0.238125" y1="-0.714375" x2="0.238125" y2="0.714375" layer="21"/>
</package>
<package name="X4_SMDCOM">
<smd name="2" x="0" y="-3.81" dx="3.81" dy="3.302" layer="1"/>
<smd name="1" x="0" y="3.81" dx="3.81" dy="3.302" layer="1"/>
<text x="-1.27" y="5.715" size="0.6096" layer="25" font="vector">&gt;NAME</text>
<smd name="COM2" x="0" y="-0.9525" dx="3.81" dy="1.016" layer="1"/>
<smd name="COM1" x="0" y="0.9525" dx="3.81" dy="1.016" layer="1"/>
</package>
<package name="X2_SMD">
<smd name="2" x="0" y="-1.905" dx="3.81" dy="3.302" layer="1"/>
<smd name="1" x="0" y="1.905" dx="3.81" dy="3.302" layer="1"/>
<text x="-1.27" y="3.81" size="0.6096" layer="25" font="vector">&gt;NAME</text>
</package>
<package name="RESC2012X70N" urn="urn:adsk.eagle:footprint:13124728/1" locally_modified="yes">
<description>Chip, 2.00 X 1.25 X 0.70 mm body
&lt;p&gt;Chip package with body size 2.00 X 1.25 X 0.70 mm&lt;/p&gt;</description>
<smd name="1" x="-0.8754" y="0" dx="1.1646" dy="1.4653" layer="1"/>
<smd name="2" x="0.8754" y="0" dx="1.1646" dy="1.4653" layer="1"/>
<text x="0" y="1.6817" size="0.8128" layer="25" align="bottom-center">&gt;NAME</text>
<text x="0" y="-1.6817" size="0.8128" layer="27" align="top-center">&gt;VALUE</text>
<wire x1="-0.15875" y1="0.714375" x2="-0.15875" y2="-0.714375" width="0.127" layer="21"/>
<wire x1="-0.15875" y1="-0.714375" x2="0.15875" y2="-0.714375" width="0.127" layer="21"/>
<wire x1="0.15875" y1="-0.714375" x2="0.15875" y2="0.714375" width="0.127" layer="21"/>
<wire x1="0.15875" y1="0.714375" x2="-0.15875" y2="0.714375" width="0.127" layer="21"/>
</package>
<package name="SOT95P280X145-5" urn="urn:adsk.eagle:footprint:11372015/1" locally_modified="yes">
<description>5-SOT23, 0.95 mm pitch, 2.80 mm span, 2.90 X 1.60 X 1.45 mm body
&lt;p&gt;5-pin SOT23 package with 0.95 mm pitch, 2.80 mm span with body size 2.90 X 1.60 X 1.45 mm&lt;/p&gt;</description>
<circle x="-1.379" y="1.7941" radius="0.25" width="0" layer="21"/>
<wire x1="-0.875" y1="1.6041" x2="0.875" y2="1.6041" width="0.12" layer="21" style="shortdash"/>
<wire x1="-0.875" y1="-1.6041" x2="0.875" y2="-1.6041" width="0.12" layer="21"/>
<smd name="IN" x="-1.2533" y="0.95" dx="1.2088" dy="0.6802" layer="1"/>
<smd name="GND" x="-1.2533" y="0" dx="1.2088" dy="0.6802" layer="1"/>
<smd name="EN" x="-1.2533" y="-0.95" dx="1.2088" dy="0.6802" layer="1"/>
<smd name="NC" x="1.2533" y="-0.95" dx="1.2088" dy="0.6802" layer="1"/>
<smd name="OUT" x="1.2533" y="0.95" dx="1.2088" dy="0.6802" layer="1"/>
<text x="0" y="2.6791" size="0.6096" layer="25" font="vector" align="bottom-center">&gt;NAME</text>
<text x="0" y="-2.2391" size="0.6096" layer="27" font="vector" align="top-center">&gt;VALUE</text>
</package>
<package name="X3S_THT">
<pad name="2" x="0" y="0" drill="0.6"/>
<pad name="1" x="0" y="1.27" drill="0.6"/>
<pad name="3" x="0" y="-1.27" drill="0.6"/>
</package>
</packages>
<packages3d>
<package3d name="CAPC2012X70N" urn="urn:adsk.eagle:package:13124731/1" type="model">
<description>Chip, 2.00 X 1.25 X 0.70 mm body
&lt;p&gt;Chip package with body size 2.00 X 1.25 X 0.70 mm&lt;/p&gt;</description>
<packageinstances>
<packageinstance name="CAPC2012X70N"/>
</packageinstances>
</package3d>
<package3d name="RESC2012X70N" urn="urn:adsk.eagle:package:13124700/1" type="model">
<description>Chip, 2.00 X 1.25 X 0.70 mm body
&lt;p&gt;Chip package with body size 2.00 X 1.25 X 0.70 mm&lt;/p&gt;</description>
<packageinstances>
<packageinstance name="RESC2012X70N"/>
</packageinstances>
</package3d>
<package3d name="SOT95P280X145-5" urn="urn:adsk.eagle:package:11372008/1" type="model">
<description>5-SOT23, 0.95 mm pitch, 2.80 mm span, 2.90 X 1.60 X 1.45 mm body
&lt;p&gt;5-pin SOT23 package with 0.95 mm pitch, 2.80 mm span with body size 2.90 X 1.60 X 1.45 mm&lt;/p&gt;</description>
<packageinstances>
<packageinstance name="SOT95P280X145-5"/>
</packageinstances>
</package3d>
</packages3d>
</library>
<library name="SmartServo">
<packages>
<package name="SOIC127P600X175-8N" urn="urn:adsk.eagle:footprint:13124499/1" locally_modified="yes">
<description>8-SOIC, 1.27 mm pitch, 6.00 mm span, 4.90 X 3.90 X 1.75 mm body
&lt;p&gt;8-pin SOIC package with 1.27 mm pitch, 6.00 mm span with body size 4.90 X 3.90 X 1.75 mm&lt;/p&gt;</description>
<circle x="-2.678" y="2.7086" radius="0.25" width="0" layer="21"/>
<wire x1="-1.95" y1="2.5186" x2="1.95" y2="2.5186" width="0.12" layer="21"/>
<wire x1="-1.95" y1="-2.5186" x2="1.95" y2="-2.5186" width="0.12" layer="21"/>
<wire x1="1.95" y1="-2.45" x2="-1.95" y2="-2.45" width="0.12" layer="51"/>
<wire x1="-1.95" y1="-2.45" x2="-1.95" y2="2.45" width="0.12" layer="51"/>
<wire x1="-1.95" y1="2.45" x2="1.95" y2="2.45" width="0.12" layer="51"/>
<wire x1="1.95" y1="2.45" x2="1.95" y2="-2.45" width="0.12" layer="51"/>
<smd name="1" x="-2.4554" y="1.905" dx="1.901" dy="0.5991" layer="1"/>
<smd name="2" x="-2.4554" y="0.635" dx="1.901" dy="0.5991" layer="1"/>
<smd name="3" x="-2.4554" y="-0.635" dx="1.901" dy="0.5991" layer="1"/>
<smd name="4" x="-2.4554" y="-1.905" dx="1.901" dy="0.5991" layer="1"/>
<smd name="5" x="2.4554" y="-1.905" dx="1.901" dy="0.5991" layer="1"/>
<smd name="6" x="2.4554" y="-0.635" dx="1.901" dy="0.5991" layer="1"/>
<smd name="7" x="2.4554" y="0.635" dx="1.901" dy="0.5991" layer="1"/>
<smd name="8" x="2.4554" y="1.905" dx="1.901" dy="0.5991" layer="1"/>
<text x="0" y="3.5936" size="0.8128" layer="25" align="bottom-center">&gt;NAME</text>
<text x="0" y="-3.1536" size="0.8128" layer="27" align="top-center">&gt;VALUE</text>
</package>
<package name="QFP80P900X900X160-32N" urn="urn:adsk.eagle:footprint:13124665/1" locally_modified="yes">
<description>32-QFP, 0.80 mm pitch, 9.00 mm span, 7.00 X 7.00 X 1.60 mm body
&lt;p&gt;32-pin QFP package with 0.80 mm pitch, 9.00 mm lead span1 X 9.00 mm lead span2 with body size 7.00 X 7.00 X 1.60 mm&lt;/p&gt;</description>
<circle x="-4.2788" y="3.5775" radius="0.25" width="0" layer="21"/>
<wire x1="-3.6" y1="3.3275" x2="-3.6" y2="3.6" width="0.12" layer="21"/>
<wire x1="-3.6" y1="3.6" x2="-3.3275" y2="3.6" width="0.12" layer="21"/>
<wire x1="3.6" y1="3.3275" x2="3.6" y2="3.6" width="0.12" layer="21"/>
<wire x1="3.6" y1="3.6" x2="3.3275" y2="3.6" width="0.12" layer="21"/>
<wire x1="3.6" y1="-3.3275" x2="3.6" y2="-3.6" width="0.12" layer="21"/>
<wire x1="3.6" y1="-3.6" x2="3.3275" y2="-3.6" width="0.12" layer="21"/>
<wire x1="-3.6" y1="-3.3275" x2="-3.6" y2="-3.6" width="0.12" layer="21"/>
<wire x1="-3.6" y1="-3.6" x2="-3.3275" y2="-3.6" width="0.12" layer="21"/>
<wire x1="3.6" y1="-3.6" x2="-3.6" y2="-3.6" width="0.12" layer="51"/>
<wire x1="-3.6" y1="-3.6" x2="-3.6" y2="3.6" width="0.12" layer="51"/>
<wire x1="-3.6" y1="3.6" x2="3.6" y2="3.6" width="0.12" layer="51"/>
<wire x1="3.6" y1="3.6" x2="3.6" y2="-3.6" width="0.12" layer="51"/>
<smd name="1" x="-4.1783" y="2.8" dx="1.5588" dy="0.5471" layer="1"/>
<smd name="2" x="-4.1783" y="2" dx="1.5588" dy="0.5471" layer="1"/>
<smd name="3" x="-4.1783" y="1.2" dx="1.5588" dy="0.5471" layer="1"/>
<smd name="4" x="-4.1783" y="0.4" dx="1.5588" dy="0.5471" layer="1"/>
<smd name="5" x="-4.1783" y="-0.4" dx="1.5588" dy="0.5471" layer="1"/>
<smd name="6" x="-4.1783" y="-1.2" dx="1.5588" dy="0.5471" layer="1"/>
<smd name="7" x="-4.1783" y="-2" dx="1.5588" dy="0.5471" layer="1"/>
<smd name="8" x="-4.1783" y="-2.8" dx="1.5588" dy="0.5471" layer="1"/>
<smd name="9" x="-2.8" y="-4.1783" dx="1.5588" dy="0.5471" layer="1" rot="R90"/>
<smd name="10" x="-2" y="-4.1783" dx="1.5588" dy="0.5471" layer="1" rot="R90"/>
<smd name="11" x="-1.2" y="-4.1783" dx="1.5588" dy="0.5471" layer="1" rot="R90"/>
<smd name="12" x="-0.4" y="-4.1783" dx="1.5588" dy="0.5471" layer="1" rot="R90"/>
<smd name="13" x="0.4" y="-4.1783" dx="1.5588" dy="0.5471" layer="1" rot="R90"/>
<smd name="14" x="1.2" y="-4.1783" dx="1.5588" dy="0.5471" layer="1" rot="R90"/>
<smd name="15" x="2" y="-4.1783" dx="1.5588" dy="0.5471" layer="1" rot="R90"/>
<smd name="16" x="2.8" y="-4.1783" dx="1.5588" dy="0.5471" layer="1" rot="R90"/>
<smd name="17" x="4.1783" y="-2.8" dx="1.5588" dy="0.5471" layer="1"/>
<smd name="18" x="4.1783" y="-2" dx="1.5588" dy="0.5471" layer="1"/>
<smd name="19" x="4.1783" y="-1.2" dx="1.5588" dy="0.5471" layer="1"/>
<smd name="20" x="4.1783" y="-0.4" dx="1.5588" dy="0.5471" layer="1"/>
<smd name="21" x="4.1783" y="0.4" dx="1.5588" dy="0.5471" layer="1"/>
<smd name="22" x="4.1783" y="1.2" dx="1.5588" dy="0.5471" layer="1"/>
<smd name="23" x="4.1783" y="2" dx="1.5588" dy="0.5471" layer="1"/>
<smd name="24" x="4.1783" y="2.8" dx="1.5588" dy="0.5471" layer="1"/>
<smd name="25" x="2.8" y="4.1783" dx="1.5588" dy="0.5471" layer="1" rot="R90"/>
<smd name="26" x="2" y="4.1783" dx="1.5588" dy="0.5471" layer="1" rot="R90"/>
<smd name="27" x="1.2" y="4.1783" dx="1.5588" dy="0.5471" layer="1" rot="R90"/>
<smd name="28" x="0.4" y="4.1783" dx="1.5588" dy="0.5471" layer="1" rot="R90"/>
<smd name="29" x="-0.4" y="4.1783" dx="1.5588" dy="0.5471" layer="1" rot="R90"/>
<smd name="30" x="-1.2" y="4.1783" dx="1.5588" dy="0.5471" layer="1" rot="R90"/>
<smd name="31" x="-2" y="4.1783" dx="1.5588" dy="0.5471" layer="1" rot="R90"/>
<smd name="32" x="-2.8" y="4.1783" dx="1.5588" dy="0.5471" layer="1" rot="R90"/>
<text x="0" y="5.5927" size="0.8128" layer="25" align="bottom-center">&gt;NAME</text>
<text x="0" y="-5.5927" size="0.8128" layer="27" align="top-center">&gt;VALUE</text>
</package>
<package name="SWD" urn="urn:adsk.eagle:footprint:12074857/1">
<text x="-1.27" y="5.08" size="0.6096" layer="25" font="vector">&gt;NAME</text>
<text x="1.27" y="2.54" size="0.6096" layer="21" font="vector" align="center">+</text>
<text x="0.9525" y="0.9525" size="0.6096" layer="21" font="vector">SWC</text>
<text x="0.9525" y="-0.3175" size="0.6096" layer="21" font="vector">SWD</text>
<text x="1.27" y="-1.27" size="0.6096" layer="21" font="vector" align="center">-</text>
<text x="1.5875" y="-2.54" size="0.6096" layer="21" font="vector" align="center">!RST</text>
<pad name="VCC" x="0" y="2.54" drill="0.5"/>
<pad name="RST" x="0" y="-2.54" drill="0.5"/>
<pad name="SWC" x="0" y="1.27" drill="0.5"/>
<pad name="SWD" x="0" y="0" drill="0.5"/>
<pad name="VSS" x="0" y="-1.27" drill="0.5"/>
</package>
<package name="OSCCC200X160X65N" urn="urn:adsk.eagle:footprint:13124653/1" locally_modified="yes">
<description>Oscillator Corner Concave, 2.00 X 1.60 X 0.65 mm body
&lt;p&gt;Oscillator Corner Concave package with body size 2.00 X 1.60 X 0.65 mm&lt;/p&gt;</description>
<circle x="-1.8099" y="-0.625" radius="0.25" width="0" layer="21"/>
<wire x1="-1.3659" y1="-0.1099" x2="-1.3659" y2="0.1099" width="0.12" layer="21"/>
<wire x1="1.3659" y1="-0.1099" x2="1.3659" y2="0.1099" width="0.12" layer="21"/>
<wire x1="-0.0901" y1="1.1659" x2="0.0901" y2="1.1659" width="0.12" layer="21"/>
<wire x1="-0.0901" y1="-1.1659" x2="0.0901" y2="-1.1659" width="0.12" layer="21"/>
<wire x1="1" y1="-0.8" x2="-1" y2="-0.8" width="0.12" layer="51"/>
<wire x1="-1" y1="-0.8" x2="-1" y2="0.8" width="0.12" layer="51"/>
<wire x1="-1" y1="0.8" x2="1" y2="0.8" width="0.12" layer="51"/>
<wire x1="1" y1="0.8" x2="1" y2="-0.8" width="0.12" layer="51"/>
<smd name="1" x="-0.825" y="-0.625" dx="0.9618" dy="0.9618" layer="1"/>
<smd name="2" x="0.825" y="-0.625" dx="0.9618" dy="0.9618" layer="1"/>
<smd name="3" x="0.825" y="0.625" dx="0.9618" dy="0.9618" layer="1"/>
<smd name="4" x="-0.825" y="0.625" dx="0.9618" dy="0.9618" layer="1"/>
<text x="0" y="1.8009" size="0.8128" layer="25" align="bottom-center">&gt;NAME</text>
<text x="0" y="-1.8009" size="0.8128" layer="27" align="top-center">&gt;VALUE</text>
</package>
</packages>
<packages3d>
<package3d name="SOIC127P600X175-8N" urn="urn:adsk.eagle:package:13124496/1" type="model">
<description>8-SOIC, 1.27 mm pitch, 6.00 mm span, 4.90 X 3.90 X 1.75 mm body
&lt;p&gt;8-pin SOIC package with 1.27 mm pitch, 6.00 mm span with body size 4.90 X 3.90 X 1.75 mm&lt;/p&gt;</description>
<packageinstances>
<packageinstance name="SOIC127P600X175-8N"/>
</packageinstances>
</package3d>
<package3d name="QFP80P900X900X160-32N" urn="urn:adsk.eagle:package:13124655/1" type="model">
<description>32-QFP, 0.80 mm pitch, 9.00 mm span, 7.00 X 7.00 X 1.60 mm body
&lt;p&gt;32-pin QFP package with 0.80 mm pitch, 9.00 mm lead span1 X 9.00 mm lead span2 with body size 7.00 X 7.00 X 1.60 mm&lt;/p&gt;</description>
<packageinstances>
<packageinstance name="QFP80P900X900X160-32N"/>
</packageinstances>
</package3d>
<package3d name="SWD" urn="urn:adsk.eagle:package:12074868/1" type="box">
<packageinstances>
<packageinstance name="SWD"/>
</packageinstances>
</package3d>
<package3d name="OSCCC200X160X65N" urn="urn:adsk.eagle:package:13124650/1" type="model">
<description>Oscillator Corner Concave, 2.00 X 1.60 X 0.65 mm body
&lt;p&gt;Oscillator Corner Concave package with body size 2.00 X 1.60 X 0.65 mm&lt;/p&gt;</description>
<packageinstances>
<packageinstance name="OSCCC200X160X65N"/>
</packageinstances>
</package3d>
</packages3d>
</library>
<library name="SmartServoV2">
<packages>
<package name="SOP65P640X120-25T320X526N" urn="urn:adsk.eagle:footprint:13001293/1" locally_modified="yes">
<description>24-SOP, 0.65 mm pitch, 6.40 mm span, 7.80 X 4.40 X 1.20 mm body, 5.26 X 3.20 mm thermal pad
&lt;p&gt;24-pin SOP package with 0.65 mm pitch, 6.40 mm span with body size 7.80 X 4.40 X 1.20 mm and thermal pad size 5.26 X 3.20 mm&lt;/p&gt;</description>
<circle x="-2.9538" y="4.2824" radius="0.25" width="0" layer="21"/>
<wire x1="-2.25" y1="4.0924" x2="2.25" y2="4.0924" width="0.12" layer="21"/>
<wire x1="-2.25" y1="-4.0924" x2="2.25" y2="-4.0924" width="0.12" layer="21"/>
<wire x1="2.25" y1="-3.95" x2="-2.25" y2="-3.95" width="0.12" layer="51"/>
<wire x1="-2.25" y1="-3.95" x2="-2.25" y2="3.95" width="0.12" layer="51"/>
<wire x1="-2.25" y1="3.95" x2="2.25" y2="3.95" width="0.12" layer="51"/>
<wire x1="2.25" y1="3.95" x2="2.25" y2="-3.95" width="0.12" layer="51"/>
<smd name="1" x="-2.8717" y="3.575" dx="1.5719" dy="0.4068" layer="1"/>
<smd name="2" x="-2.8717" y="2.925" dx="1.5719" dy="0.4068" layer="1"/>
<smd name="3" x="-2.8717" y="2.275" dx="1.5719" dy="0.4068" layer="1"/>
<smd name="4" x="-2.8717" y="1.625" dx="1.5719" dy="0.4068" layer="1"/>
<smd name="5" x="-2.8717" y="0.975" dx="1.5719" dy="0.4068" layer="1"/>
<smd name="6" x="-2.8717" y="0.325" dx="1.5719" dy="0.4068" layer="1"/>
<smd name="7" x="-2.8717" y="-0.325" dx="1.5719" dy="0.4068" layer="1"/>
<smd name="8" x="-2.8717" y="-0.975" dx="1.5719" dy="0.4068" layer="1"/>
<smd name="9" x="-2.8717" y="-1.625" dx="1.5719" dy="0.4068" layer="1"/>
<smd name="10" x="-2.8717" y="-2.275" dx="1.5719" dy="0.4068" layer="1"/>
<smd name="11" x="-2.8717" y="-2.925" dx="1.5719" dy="0.4068" layer="1"/>
<smd name="12" x="-2.8717" y="-3.575" dx="1.5719" dy="0.4068" layer="1"/>
<smd name="13" x="2.8717" y="-3.575" dx="1.5719" dy="0.4068" layer="1"/>
<smd name="14" x="2.8717" y="-2.925" dx="1.5719" dy="0.4068" layer="1"/>
<smd name="15" x="2.8717" y="-2.275" dx="1.5719" dy="0.4068" layer="1"/>
<smd name="16" x="2.8717" y="-1.625" dx="1.5719" dy="0.4068" layer="1"/>
<smd name="17" x="2.8717" y="-0.975" dx="1.5719" dy="0.4068" layer="1"/>
<smd name="18" x="2.8717" y="-0.325" dx="1.5719" dy="0.4068" layer="1"/>
<smd name="19" x="2.8717" y="0.325" dx="1.5719" dy="0.4068" layer="1"/>
<smd name="20" x="2.8717" y="0.975" dx="1.5719" dy="0.4068" layer="1"/>
<smd name="21" x="2.8717" y="1.625" dx="1.5719" dy="0.4068" layer="1"/>
<smd name="22" x="2.8717" y="2.275" dx="1.5719" dy="0.4068" layer="1"/>
<smd name="23" x="2.8717" y="2.925" dx="1.5719" dy="0.4068" layer="1"/>
<smd name="24" x="2.8717" y="3.575" dx="1.5719" dy="0.4068" layer="1"/>
<smd name="25" x="0" y="0" dx="3.2" dy="5.26" layer="1" thermals="no"/>
<text x="0" y="5.1674" size="0.6096" layer="25" align="bottom-center">&gt;NAME</text>
<text x="0" y="-4.7274" size="0.6096" layer="27" align="top-center">&gt;VALUE</text>
</package>
</packages>
<packages3d>
<package3d name="SOP65P640X120-25T320X526N" urn="urn:adsk.eagle:package:13001289/1" type="model">
<description>24-SOP, 0.65 mm pitch, 6.40 mm span, 7.80 X 4.40 X 1.20 mm body, 5.26 X 3.20 mm thermal pad
&lt;p&gt;24-pin SOP package with 0.65 mm pitch, 6.40 mm span with body size 7.80 X 4.40 X 1.20 mm and thermal pad size 5.26 X 3.20 mm&lt;/p&gt;</description>
<packageinstances>
<packageinstance name="SOP65P640X120-25T320X526N"/>
</packageinstances>
</package3d>
</packages3d>
</library>
</libraries>
<attributes>
</attributes>
<variantdefs>
</variantdefs>
<classes>
<class number="0" name="default" width="0" drill="0">
</class>
</classes>
<designrules name="default *">
<description language="de">&lt;b&gt;EAGLE Design Rules&lt;/b&gt;
&lt;p&gt;
Die Standard-Design-Rules sind so gewählt, dass sie für 
die meisten Anwendungen passen. Sollte ihre Platine 
besondere Anforderungen haben, treffen Sie die erforderlichen
Einstellungen hier und speichern die Design Rules unter 
einem neuen Namen ab.</description>
<description language="en">&lt;b&gt;EAGLE Design Rules&lt;/b&gt;
&lt;p&gt;
The default Design Rules have been set to cover
a wide range of applications. Your particular design
may have different requirements, so please make the
necessary adjustments and save your customized
design rules under a new name.</description>
<param name="layerSetup" value="(1*16)"/>
<param name="mtCopper" value="0.035mm 0.035mm 0.035mm 0.035mm 0.035mm 0.035mm 0.035mm 0.035mm 0.035mm 0.035mm 0.035mm 0.035mm 0.035mm 0.035mm 0.035mm 0.035mm"/>
<param name="mtIsolate" value="1.5mm 0.15mm 0.2mm 0.15mm 0.2mm 0.15mm 0.2mm 0.15mm 0.2mm 0.15mm 0.2mm 0.15mm 0.2mm 0.15mm 0.2mm"/>
<param name="mdWireWire" value="6mil"/>
<param name="mdWirePad" value="6mil"/>
<param name="mdWireVia" value="6mil"/>
<param name="mdPadPad" value="6mil"/>
<param name="mdPadVia" value="6mil"/>
<param name="mdViaVia" value="6mil"/>
<param name="mdSmdPad" value="6mil"/>
<param name="mdSmdVia" value="6mil"/>
<param name="mdSmdSmd" value="6mil"/>
<param name="mdViaViaSameLayer" value="6mil"/>
<param name="mnLayersViaInSmd" value="2"/>
<param name="mdCopperDimension" value="40mil"/>
<param name="mdDrill" value="6mil"/>
<param name="mdSmdStop" value="0mil"/>
<param name="msWidth" value="12mil"/>
<param name="msDrill" value="0.35mm"/>
<param name="msMicroVia" value="9.99mm"/>
<param name="msBlindViaRatio" value="0.5"/>
<param name="rvPadTop" value="0.25"/>
<param name="rvPadInner" value="0.25"/>
<param name="rvPadBottom" value="0.25"/>
<param name="rvViaOuter" value="0.25"/>
<param name="rvViaInner" value="0.25"/>
<param name="rvMicroViaOuter" value="0.25"/>
<param name="rvMicroViaInner" value="0.25"/>
<param name="rlMinPadTop" value="10mil"/>
<param name="rlMaxPadTop" value="20mil"/>
<param name="rlMinPadInner" value="10mil"/>
<param name="rlMaxPadInner" value="20mil"/>
<param name="rlMinPadBottom" value="10mil"/>
<param name="rlMaxPadBottom" value="20mil"/>
<param name="rlMinViaOuter" value="8mil"/>
<param name="rlMaxViaOuter" value="20mil"/>
<param name="rlMinViaInner" value="8mil"/>
<param name="rlMaxViaInner" value="20mil"/>
<param name="rlMinMicroViaOuter" value="4mil"/>
<param name="rlMaxMicroViaOuter" value="20mil"/>
<param name="rlMinMicroViaInner" value="4mil"/>
<param name="rlMaxMicroViaInner" value="20mil"/>
<param name="psTop" value="-1"/>
<param name="psBottom" value="-1"/>
<param name="psFirst" value="-1"/>
<param name="psElongationLong" value="100"/>
<param name="psElongationOffset" value="100"/>
<param name="mvStopFrame" value="1"/>
<param name="mvCreamFrame" value="0"/>
<param name="mlMinStopFrame" value="4mil"/>
<param name="mlMaxStopFrame" value="4mil"/>
<param name="mlMinCreamFrame" value="0mil"/>
<param name="mlMaxCreamFrame" value="0mil"/>
<param name="mlViaStopLimit" value="0mil"/>
<param name="srRoundness" value="0"/>
<param name="srMinRoundness" value="0mil"/>
<param name="srMaxRoundness" value="0mil"/>
<param name="slThermalIsolate" value="10mil"/>
<param name="slThermalsForVias" value="0"/>
<param name="dpMaxLengthDifference" value="10mm"/>
<param name="dpGapFactor" value="2.5"/>
<param name="checkAngle" value="0"/>
<param name="checkFont" value="1"/>
<param name="checkRestrict" value="1"/>
<param name="checkStop" value="0"/>
<param name="checkValues" value="0"/>
<param name="checkNames" value="1"/>
<param name="checkWireStubs" value="1"/>
<param name="checkPolygonWidth" value="0"/>
<param name="useDiameter" value="13"/>
<param name="maxErrors" value="50"/>
</designrules>
<autorouter>
<pass name="Default">
<param name="RoutingGrid" value="6.25mil"/>
<param name="AutoGrid" value="1"/>
<param name="Efforts" value="2"/>
<param name="TopRouterVariant" value="1"/>
<param name="tpViaShape" value="round"/>
<param name="PrefDir.1" value="*"/>
<param name="PrefDir.2" value="0"/>
<param name="PrefDir.3" value="0"/>
<param name="PrefDir.4" value="0"/>
<param name="PrefDir.5" value="0"/>
<param name="PrefDir.6" value="0"/>
<param name="PrefDir.7" value="0"/>
<param name="PrefDir.8" value="0"/>
<param name="PrefDir.9" value="0"/>
<param name="PrefDir.10" value="0"/>
<param name="PrefDir.11" value="0"/>
<param name="PrefDir.12" value="0"/>
<param name="PrefDir.13" value="0"/>
<param name="PrefDir.14" value="0"/>
<param name="PrefDir.15" value="0"/>
<param name="PrefDir.16" value="-"/>
<param name="cfVia" value="8"/>
<param name="cfNonPref" value="5"/>
<param name="cfChangeDir" value="2"/>
<param name="cfOrthStep" value="2"/>
<param name="cfDiagStep" value="3"/>
<param name="cfExtdStep" value="0"/>
<param name="cfBonusStep" value="1"/>
<param name="cfMalusStep" value="1"/>
<param name="cfPadImpact" value="4"/>
<param name="cfSmdImpact" value="4"/>
<param name="cfBusImpact" value="0"/>
<param name="cfHugging" value="3"/>
<param name="cfAvoid" value="4"/>
<param name="cfPolygon" value="10"/>
<param name="cfBase.1" value="0"/>
<param name="cfBase.2" value="1"/>
<param name="cfBase.3" value="1"/>
<param name="cfBase.4" value="1"/>
<param name="cfBase.5" value="1"/>
<param name="cfBase.6" value="1"/>
<param name="cfBase.7" value="1"/>
<param name="cfBase.8" value="1"/>
<param name="cfBase.9" value="1"/>
<param name="cfBase.10" value="1"/>
<param name="cfBase.11" value="1"/>
<param name="cfBase.12" value="1"/>
<param name="cfBase.13" value="1"/>
<param name="cfBase.14" value="1"/>
<param name="cfBase.15" value="1"/>
<param name="cfBase.16" value="0"/>
<param name="mnVias" value="20"/>
<param name="mnSegments" value="9999"/>
<param name="mnExtdSteps" value="9999"/>
<param name="mnRipupLevel" value="10"/>
<param name="mnRipupSteps" value="100"/>
<param name="mnRipupTotal" value="100"/>
</pass>
<pass name="Follow-me" refer="Default" active="yes">
</pass>
<pass name="Busses" refer="Default" active="yes">
<param name="cfNonPref" value="4"/>
<param name="cfBusImpact" value="4"/>
<param name="cfHugging" value="0"/>
<param name="mnVias" value="0"/>
</pass>
<pass name="Route" refer="Default" active="yes">
</pass>
<pass name="Optimize1" refer="Default" active="yes">
<param name="cfVia" value="99"/>
<param name="cfExtdStep" value="10"/>
<param name="cfHugging" value="1"/>
<param name="mnExtdSteps" value="1"/>
<param name="mnRipupLevel" value="0"/>
</pass>
<pass name="Optimize2" refer="Optimize1" active="yes">
<param name="cfNonPref" value="0"/>
<param name="cfChangeDir" value="6"/>
<param name="cfExtdStep" value="0"/>
<param name="cfBonusStep" value="2"/>
<param name="cfMalusStep" value="2"/>
<param name="cfPadImpact" value="2"/>
<param name="cfSmdImpact" value="2"/>
<param name="cfHugging" value="0"/>
</pass>
<pass name="Optimize3" refer="Optimize2" active="yes">
<param name="cfChangeDir" value="8"/>
<param name="cfPadImpact" value="0"/>
<param name="cfSmdImpact" value="0"/>
</pass>
<pass name="Optimize4" refer="Optimize3" active="yes">
<param name="cfChangeDir" value="25"/>
</pass>
</autorouter>
<elements>
<element name="C1" library="Standard" package="CAPC2012X70N" package3d_urn="urn:adsk.eagle:package:13124731/1" value="1µF" x="10.16" y="22.86" smashed="yes" rot="R180">
<attribute name="NAME" x="10.16" y="21.1783" size="0.8128" layer="25" rot="R180" align="bottom-center"/>
<attribute name="VALUE" x="10.16" y="24.5417" size="0.8128" layer="27" rot="R180" align="top-center"/>
</element>
<element name="C10" library="Standard" package="CAPC2012X70N" package3d_urn="urn:adsk.eagle:package:13124731/1" value="6pF" x="45.72" y="2.54" smashed="yes" rot="R180">
<attribute name="NAME" x="45.72" y="0.8583" size="0.8128" layer="25" rot="R180" align="bottom-center"/>
<attribute name="VALUE" x="45.72" y="4.2217" size="0.8128" layer="27" rot="R180" align="top-center"/>
</element>
<element name="C11" library="Standard" package="CAPC2012X70N" package3d_urn="urn:adsk.eagle:package:13124731/1" value="1µF" x="41.91" y="20.32" smashed="yes" rot="R180">
<attribute name="NAME" x="41.91" y="18.6383" size="0.8128" layer="25" rot="R180" align="bottom-center"/>
<attribute name="VALUE" x="41.91" y="22.0017" size="0.8128" layer="27" rot="R180" align="top-center"/>
</element>
<element name="C12" library="Standard" package="CAPC2012X70N" package3d_urn="urn:adsk.eagle:package:13124731/1" value="1µF" x="52.07" y="16.51" smashed="yes" rot="R90">
<attribute name="NAME" x="50.3883" y="16.51" size="0.8128" layer="25" rot="R90" align="bottom-center"/>
<attribute name="VALUE" x="53.7517" y="16.51" size="0.8128" layer="27" rot="R90" align="top-center"/>
</element>
<element name="C13" library="Standard" package="CAPC2012X70N" package3d_urn="urn:adsk.eagle:package:13124731/1" value="6pF" x="45.72" y="5.08" smashed="yes" rot="R180">
<attribute name="NAME" x="45.72" y="3.3983" size="0.8128" layer="25" rot="R180" align="bottom-center"/>
<attribute name="VALUE" x="45.72" y="6.7617" size="0.8128" layer="27" rot="R180" align="top-center"/>
</element>
<element name="C2" library="Standard" package="CAPC2012X70N" package3d_urn="urn:adsk.eagle:package:13124731/1" value="1µF" x="15.24" y="19.05" smashed="yes" rot="R90">
<attribute name="NAME" x="13.5583" y="19.05" size="0.8128" layer="25" rot="R90" align="bottom-center"/>
<attribute name="VALUE" x="16.9217" y="19.05" size="0.8128" layer="27" rot="R90" align="top-center"/>
</element>
<element name="C3" library="Standard" package="CAPC2012X70N" package3d_urn="urn:adsk.eagle:package:13124731/1" value="1µF" x="3.81" y="15.24" smashed="yes" rot="R180">
<attribute name="NAME" x="3.81" y="13.5583" size="0.8128" layer="25" rot="R180" align="bottom-center"/>
<attribute name="VALUE" x="3.81" y="16.9217" size="0.8128" layer="27" rot="R180" align="top-center"/>
</element>
<element name="C4" library="Standard" package="CAPC2012X70N" package3d_urn="urn:adsk.eagle:package:13124731/1" value="1µF" x="7.62" y="15.24" smashed="yes" rot="R180">
<attribute name="NAME" x="7.62" y="13.5583" size="0.8128" layer="25" rot="R180" align="bottom-center"/>
<attribute name="VALUE" x="7.62" y="16.9217" size="0.8128" layer="27" rot="R180" align="top-center"/>
</element>
<element name="C5" library="Standard" package="CAPC2012X70N" package3d_urn="urn:adsk.eagle:package:13124731/1" value="100nF" x="20.32" y="12.7" smashed="yes" rot="R90">
<attribute name="NAME" x="18.6383" y="12.7" size="0.8128" layer="25" rot="R90" align="bottom-center"/>
<attribute name="VALUE" x="22.0017" y="12.7" size="0.8128" layer="27" rot="R90" align="top-center"/>
</element>
<element name="C6" library="Standard" package="CAPC2012X70N" package3d_urn="urn:adsk.eagle:package:13124731/1" value="100nF" x="19.05" y="8.89" smashed="yes" rot="R90">
<attribute name="NAME" x="17.3683" y="8.89" size="0.8128" layer="25" rot="R90" align="bottom-center"/>
<attribute name="VALUE" x="20.7317" y="8.89" size="0.8128" layer="27" rot="R90" align="top-center"/>
</element>
<element name="C7" library="Standard" package="CAPC2012X70N" package3d_urn="urn:adsk.eagle:package:13124731/1" value="100nF" x="12.7" y="12.7" smashed="yes">
<attribute name="NAME" x="12.7" y="14.3817" size="0.8128" layer="25" align="bottom-center"/>
<attribute name="VALUE" x="12.7" y="11.0183" size="0.8128" layer="27" align="top-center"/>
</element>
<element name="C8" library="Standard" package="CAPC2012X70N" package3d_urn="urn:adsk.eagle:package:13124731/1" value="1µF" x="47.244" y="9.017" smashed="yes">
<attribute name="NAME" x="47.244" y="10.6987" size="0.8128" layer="25" align="bottom-center"/>
<attribute name="VALUE" x="47.244" y="7.3353" size="0.8128" layer="27" align="top-center"/>
</element>
<element name="C9" library="Standard" package="CAPC2012X70N" package3d_urn="urn:adsk.eagle:package:13124731/1" value="47nF" x="49.2125" y="16.51" smashed="yes" rot="R270">
<attribute name="NAME" x="50.8942" y="16.51" size="0.8128" layer="25" rot="R270" align="bottom-center"/>
<attribute name="VALUE" x="47.5308" y="16.51" size="0.8128" layer="27" rot="R270" align="top-center"/>
</element>
<element name="IC1" library="SmartServo" package="SOIC127P600X175-8N" package3d_urn="urn:adsk.eagle:package:13124496/1" value="ATA6561SOIC" x="13.97" y="7.62" smashed="yes" rot="R180">
<attribute name="NAME" x="13.97" y="4.0264" size="0.8128" layer="25" rot="R180" align="bottom-center"/>
<attribute name="VALUE" x="13.97" y="10.7736" size="0.8128" layer="27" rot="R180" align="top-center"/>
</element>
<element name="IC2" library="SmartServoV2" package="SOP65P640X120-25T320X526N" package3d_urn="urn:adsk.eagle:package:13001289/1" value="DRV8873" x="43.18" y="13.97" smashed="yes">
<attribute name="NAME" x="43.18" y="19.1374" size="0.6096" layer="25" align="bottom-center"/>
<attribute name="VALUE" x="43.18" y="9.2426" size="0.6096" layer="27" align="top-center"/>
</element>
<element name="INPUT" library="Standard" package="X4_SMDCOM" value="X4SMD_COM" x="3.81" y="7.62" smashed="yes">
<attribute name="NAME" x="2.54" y="13.335" size="0.6096" layer="25" font="vector"/>
</element>
<element name="M1" library="Standard" package="X2_SMD" value="X2SMD" x="54.61" y="11.1125" smashed="yes">
<attribute name="NAME" x="53.34" y="14.9225" size="0.6096" layer="25" font="vector"/>
</element>
<element name="MCU1" library="SmartServo" package="QFP80P900X900X160-32N" package3d_urn="urn:adsk.eagle:package:13124655/1" value="STM32F042G6LQFP32" x="26.67" y="8.89" smashed="yes" rot="R180">
<attribute name="NAME" x="26.67" y="3.2973" size="0.8128" layer="25" rot="R180" align="bottom-center"/>
<attribute name="VALUE" x="26.67" y="14.4827" size="0.8128" layer="27" rot="R180" align="top-center"/>
</element>
<element name="R1" library="Standard" package="RESC2012X70N" package3d_urn="urn:adsk.eagle:package:13124700/1" value="10k" x="34.29" y="7.62" smashed="yes" rot="R270">
<attribute name="NAME" x="35.9717" y="7.62" size="0.8128" layer="25" rot="R270" align="bottom-center"/>
<attribute name="VALUE" x="32.6083" y="7.62" size="0.8128" layer="27" rot="R270" align="top-center"/>
</element>
<element name="R2" library="Standard" package="RESC2012X70N" package3d_urn="urn:adsk.eagle:package:13124700/1" value="10k" x="36.83" y="17.78" smashed="yes" rot="R270">
<attribute name="NAME" x="38.5117" y="17.78" size="0.8128" layer="25" rot="R270" align="bottom-center"/>
<attribute name="VALUE" x="35.1483" y="17.78" size="0.8128" layer="27" rot="R270" align="top-center"/>
</element>
<element name="R3" library="Standard" package="RESC2012X70N" package3d_urn="urn:adsk.eagle:package:13124700/1" value="330" x="36.83" y="13.97" smashed="yes" rot="R90">
<attribute name="NAME" x="35.1483" y="13.97" size="0.8128" layer="25" rot="R90" align="bottom-center"/>
<attribute name="VALUE" x="38.5117" y="13.97" size="0.8128" layer="27" rot="R90" align="top-center"/>
</element>
<element name="R4" library="Standard" package="RESC2012X70N" package3d_urn="urn:adsk.eagle:package:13124700/1" value="330" x="36.83" y="10.16" smashed="yes" rot="R270">
<attribute name="NAME" x="38.5117" y="10.16" size="0.8128" layer="25" rot="R270" align="bottom-center"/>
<attribute name="VALUE" x="35.1483" y="10.16" size="0.8128" layer="27" rot="R270" align="top-center"/>
</element>
<element name="SWD1" library="SmartServo" package="SWD" package3d_urn="urn:adsk.eagle:package:12074868/1" value="SWD" x="34.29" y="2.54" smashed="yes" rot="R90">
<attribute name="NAME" x="29.21" y="1.27" size="0.6096" layer="25" font="vector" rot="R90"/>
</element>
<element name="UREG1" library="Standard" package="SOT95P280X145-5" package3d_urn="urn:adsk.eagle:package:11372008/1" value="5V" x="3.81" y="19.05" smashed="yes" rot="R180">
<attribute name="NAME" x="3.81" y="16.3709" size="0.6096" layer="25" font="vector" rot="R180" align="bottom-center"/>
<attribute name="VALUE" x="3.81" y="21.2891" size="0.6096" layer="27" font="vector" rot="R180" align="top-center"/>
</element>
<element name="UREG2" library="Standard" package="SOT95P280X145-5" package3d_urn="urn:adsk.eagle:package:11372008/1" value="3V3" x="10.16" y="19.05" smashed="yes">
<attribute name="NAME" x="10.16" y="21.7291" size="0.6096" layer="25" font="vector" align="bottom-center"/>
<attribute name="VALUE" x="10.16" y="16.8109" size="0.6096" layer="27" font="vector" align="top-center"/>
</element>
<element name="X1" library="Standard" package="X3S_THT" value="X3THTSMALL" x="26.67" y="20.32" smashed="yes" rot="R90"/>
<element name="Y1" library="SmartServo" package="OSCCC200X160X65N" package3d_urn="urn:adsk.eagle:package:13124650/1" value="32MHz" x="40.64" y="3.81" smashed="yes">
<attribute name="NAME" x="40.64" y="5.6109" size="0.8128" layer="25" align="bottom-center"/>
<attribute name="VALUE" x="40.64" y="2.0091" size="0.8128" layer="27" align="top-center"/>
</element>
</elements>
<signals>
<signal name="GND">
<contactref element="INPUT" pad="2"/>
<contactref element="UREG1" pad="EN"/>
<contactref element="UREG1" pad="GND"/>
<contactref element="UREG2" pad="GND"/>
<contactref element="C4" pad="1"/>
<contactref element="C3" pad="1"/>
<contactref element="C2" pad="1"/>
<contactref element="C1" pad="1"/>
<contactref element="C5" pad="2"/>
<contactref element="MCU1" pad="16"/>
<contactref element="MCU1" pad="32"/>
<contactref element="C6" pad="2"/>
<contactref element="C7" pad="2"/>
<contactref element="IC1" pad="2"/>
<contactref element="C8" pad="2"/>
<contactref element="IC2" pad="16"/>
<contactref element="IC2" pad="17"/>
<contactref element="IC2" pad="24"/>
<contactref element="IC2" pad="25"/>
<contactref element="IC1" pad="8"/>
<contactref element="SWD1" pad="VSS"/>
<contactref element="X1" pad="3"/>
<contactref element="C11" pad="1"/>
<contactref element="R4" pad="2"/>
<contactref element="R3" pad="2"/>
<contactref element="IC2" pad="6"/>
<contactref element="IC2" pad="4"/>
<contactref element="C10" pad="1"/>
<contactref element="C13" pad="1"/>
<wire x1="33.3756" y1="14.859" x2="36.8046" y2="14.859" width="0.3048" layer="1"/>
<wire x1="28.1178" y1="20.1168" x2="33.3756" y2="14.859" width="0.3048" layer="1"/>
<wire x1="36.8046" y1="14.859" x2="36.83" y2="14.8454" width="0.3048" layer="1"/>
<wire x1="28.1178" y1="20.1168" x2="27.94" y2="20.32" width="0.3048" layer="1"/>
<wire x1="33.6042" y1="4.572" x2="29.4894" y2="4.572" width="0.3048" layer="1"/>
<wire x1="35.433" y1="2.7432" x2="33.6042" y2="4.572" width="0.3048" layer="1"/>
<wire x1="29.4894" y1="4.572" x2="29.47" y2="4.7117" width="0.3048" layer="1"/>
<wire x1="35.433" y1="2.7432" x2="35.56" y2="2.54" width="0.3048" layer="1"/>
<wire x1="46.6344" y1="5.0292" x2="46.6344" y2="2.7432" width="0.3048" layer="1"/>
<wire x1="46.6344" y1="2.7432" x2="46.5954" y2="2.54" width="0.3048" layer="1"/>
<wire x1="46.6344" y1="5.0292" x2="46.5954" y2="5.08" width="0.3048" layer="1"/>
<wire x1="48.006" y1="6.6294" x2="48.006" y2="7.7724" width="0.3048" layer="1"/>
<wire x1="48.006" y1="7.7724" x2="48.006" y2="8.9154" width="0.3048" layer="1"/>
<wire x1="46.6344" y1="5.2578" x2="48.006" y2="6.6294" width="0.3048" layer="1"/>
<wire x1="48.006" y1="8.9154" x2="48.1194" y2="9.017" width="0.3048" layer="1"/>
<wire x1="46.6344" y1="5.2578" x2="46.5954" y2="5.08" width="0.3048" layer="1"/>
<wire x1="43.434" y1="20.1168" x2="42.9768" y2="20.1168" width="0.3048" layer="1"/>
<wire x1="45.9486" y1="17.6022" x2="44.8056" y2="18.7452" width="0.3048" layer="1"/>
<wire x1="44.8056" y1="18.7452" x2="43.434" y2="20.1168" width="0.3048" layer="1"/>
<wire x1="42.9768" y1="20.1168" x2="42.7854" y2="20.32" width="0.3048" layer="1"/>
<wire x1="45.9486" y1="17.6022" x2="46.0517" y2="17.545" width="0.3048" layer="1"/>
<wire x1="46.1772" y1="12.8016" x2="46.1772" y2="12.3444" width="0.3048" layer="1"/>
<wire x1="46.1772" y1="12.3444" x2="46.0517" y2="12.345" width="0.3048" layer="1"/>
<wire x1="46.1772" y1="12.8016" x2="46.0517" y2="12.995" width="0.3048" layer="1"/>
<wire x1="40.9194" y1="9.3726" x2="37.719" y2="9.3726" width="0.3048" layer="1"/>
<wire x1="37.719" y1="9.3726" x2="37.0332" y2="9.3726" width="0.3048" layer="1"/>
<wire x1="42.9768" y1="11.43" x2="42.5196" y2="10.9728" width="0.3048" layer="1"/>
<wire x1="42.5196" y1="10.9728" x2="40.9194" y2="9.3726" width="0.3048" layer="1"/>
<wire x1="42.9768" y1="13.9446" x2="42.9768" y2="12.3444" width="0.3048" layer="1"/>
<wire x1="42.9768" y1="12.3444" x2="42.9768" y2="11.43" width="0.3048" layer="1"/>
<wire x1="37.0332" y1="9.3726" x2="36.83" y2="9.2846" width="0.3048" layer="1"/>
<wire x1="42.9768" y1="13.9446" x2="43.18" y2="13.97" width="0.3048" layer="1"/>
<wire x1="42.9768" y1="14.1732" x2="41.6052" y2="14.1732" width="0.3048" layer="1"/>
<wire x1="41.6052" y1="14.1732" x2="40.4622" y2="14.1732" width="0.3048" layer="1"/>
<wire x1="40.4622" y1="14.1732" x2="40.3083" y2="14.295" width="0.3048" layer="1"/>
<wire x1="42.9768" y1="14.1732" x2="43.18" y2="13.97" width="0.3048" layer="1"/>
<wire x1="41.148" y1="15.5448" x2="40.4622" y2="15.5448" width="0.3048" layer="1"/>
<wire x1="41.6052" y1="15.0876" x2="41.3766" y2="15.3162" width="0.3048" layer="1"/>
<wire x1="41.3766" y1="15.3162" x2="41.148" y2="15.5448" width="0.3048" layer="1"/>
<wire x1="41.6052" y1="14.1732" x2="41.6052" y2="15.0876" width="0.3048" layer="1"/>
<wire x1="40.4622" y1="15.5448" x2="40.3083" y2="15.595" width="0.3048" layer="1"/>
<wire x1="41.6052" y1="14.1732" x2="43.18" y2="13.97" width="0.3048" layer="1"/>
<wire x1="42.9768" y1="12.3444" x2="45.9486" y2="12.3444" width="0.3048" layer="1"/>
<wire x1="45.9486" y1="12.3444" x2="46.0517" y2="12.345" width="0.3048" layer="1"/>
<wire x1="42.9768" y1="12.3444" x2="43.18" y2="13.97" width="0.3048" layer="1"/>
<wire x1="41.3766" y1="15.3162" x2="44.8056" y2="18.7452" width="0.3048" layer="1"/>
<wire x1="45.72" y1="7.7724" x2="48.006" y2="7.7724" width="0.3048" layer="1"/>
<wire x1="42.5196" y1="10.9728" x2="45.72" y2="7.7724" width="0.3048" layer="1"/>
<wire x1="36.576" y1="1.6002" x2="35.6616" y2="2.5146" width="0.3048" layer="1"/>
<wire x1="37.2618" y1="1.6002" x2="36.576" y2="1.6002" width="0.3048" layer="1"/>
<wire x1="37.719" y1="2.0574" x2="37.2618" y2="1.6002" width="0.3048" layer="1"/>
<wire x1="37.719" y1="9.3726" x2="37.719" y2="2.0574" width="0.3048" layer="1"/>
<wire x1="35.6616" y1="2.5146" x2="35.56" y2="2.54" width="0.3048" layer="1"/>
<wire x1="37.0332" y1="15.3162" x2="37.0332" y2="14.859" width="0.3048" layer="1"/>
<wire x1="38.6334" y1="16.9164" x2="37.0332" y2="15.3162" width="0.3048" layer="1"/>
<wire x1="38.6334" y1="17.3736" x2="38.6334" y2="16.9164" width="0.3048" layer="1"/>
<wire x1="40.005" y1="18.7452" x2="38.6334" y2="17.3736" width="0.3048" layer="1"/>
<wire x1="40.005" y1="21.2598" x2="40.005" y2="18.7452" width="0.3048" layer="1"/>
<wire x1="40.2336" y1="21.4884" x2="40.005" y2="21.2598" width="0.3048" layer="1"/>
<wire x1="41.8338" y1="21.4884" x2="40.2336" y2="21.4884" width="0.3048" layer="1"/>
<wire x1="42.9768" y1="20.3454" x2="41.8338" y2="21.4884" width="0.3048" layer="1"/>
<wire x1="37.0332" y1="14.859" x2="36.83" y2="14.8454" width="0.3048" layer="1"/>
<wire x1="42.9768" y1="20.3454" x2="42.7854" y2="20.32" width="0.3048" layer="1"/>
<wire x1="19.8882" y1="8.9154" x2="19.2024" y2="9.6012" width="0.3048" layer="1"/>
<wire x1="20.1168" y1="8.9154" x2="19.8882" y2="8.9154" width="0.3048" layer="1"/>
<wire x1="20.1168" y1="7.3152" x2="20.1168" y2="8.9154" width="0.3048" layer="1"/>
<wire x1="19.8882" y1="7.0866" x2="20.1168" y2="7.3152" width="0.3048" layer="1"/>
<wire x1="16.4592" y1="7.0866" x2="19.8882" y2="7.0866" width="0.3048" layer="1"/>
<wire x1="19.2024" y1="9.6012" x2="19.05" y2="9.7654" width="0.3048" layer="1"/>
<wire x1="16.4592" y1="7.0866" x2="16.4254" y2="6.985" width="0.3048" layer="1"/>
<wire x1="14.6304" y1="5.715" x2="11.5146" y2="5.715" width="0.3048" layer="1"/>
<wire x1="15.7734" y1="6.858" x2="14.6304" y2="5.715" width="0.3048" layer="1"/>
<wire x1="16.2306" y1="6.858" x2="15.7734" y2="6.858" width="0.3048" layer="1"/>
<wire x1="16.2306" y1="6.858" x2="16.4254" y2="6.985" width="0.3048" layer="1"/>
<wire x1="9.6012" y1="3.8862" x2="3.8862" y2="3.8862" width="0.3048" layer="1"/>
<wire x1="11.43" y1="5.715" x2="9.6012" y2="3.8862" width="0.3048" layer="1"/>
<wire x1="3.8862" y1="3.8862" x2="3.81" y2="3.81" width="0.3048" layer="1"/>
<wire x1="11.43" y1="5.715" x2="11.5146" y2="5.715" width="0.3048" layer="1"/>
<wire x1="5.9436" y1="16.4592" x2="4.8006" y2="15.3162" width="0.3048" layer="1"/>
<wire x1="7.3152" y1="16.4592" x2="5.9436" y2="16.4592" width="0.3048" layer="1"/>
<wire x1="8.4582" y1="15.3162" x2="8.001" y2="15.7734" width="0.3048" layer="1"/>
<wire x1="8.001" y1="15.7734" x2="7.3152" y2="16.4592" width="0.3048" layer="1"/>
<wire x1="4.8006" y1="15.3162" x2="4.6854" y2="15.24" width="0.3048" layer="1"/>
<wire x1="8.4582" y1="15.3162" x2="8.4954" y2="15.24" width="0.3048" layer="1"/>
<wire x1="5.0292" y1="19.8882" x2="5.0292" y2="19.2024" width="0.3048" layer="1"/>
<wire x1="5.0292" y1="19.2024" x2="5.0633" y2="19.05" width="0.3048" layer="1"/>
<wire x1="5.0292" y1="19.8882" x2="5.0633" y2="20" width="0.3048" layer="1"/>
<wire x1="5.2578" y1="19.2024" x2="8.6868" y2="19.2024" width="0.3048" layer="1"/>
<wire x1="8.6868" y1="19.2024" x2="8.9067" y2="19.05" width="0.3048" layer="1"/>
<wire x1="5.2578" y1="19.2024" x2="5.0633" y2="19.05" width="0.3048" layer="1"/>
<wire x1="10.9728" y1="21.0312" x2="10.9728" y2="22.1742" width="0.3048" layer="1"/>
<wire x1="10.9728" y1="22.1742" x2="10.9728" y2="22.86" width="0.3048" layer="1"/>
<wire x1="9.8298" y1="19.8882" x2="10.9728" y2="21.0312" width="0.3048" layer="1"/>
<wire x1="9.8298" y1="19.431" x2="9.8298" y2="19.8882" width="0.3048" layer="1"/>
<wire x1="9.6012" y1="19.2024" x2="9.8298" y2="19.431" width="0.3048" layer="1"/>
<wire x1="8.9154" y1="19.2024" x2="9.6012" y2="19.2024" width="0.3048" layer="1"/>
<wire x1="10.9728" y1="22.86" x2="11.0354" y2="22.86" width="0.3048" layer="1"/>
<wire x1="8.9154" y1="19.2024" x2="8.9067" y2="19.05" width="0.3048" layer="1"/>
<wire x1="9.8298" y1="17.6022" x2="8.001" y2="15.7734" width="0.3048" layer="1"/>
<wire x1="9.8298" y1="19.431" x2="9.8298" y2="17.6022" width="0.3048" layer="1"/>
<wire x1="8.001" y1="15.7734" x2="8.4954" y2="15.24" width="0.3048" layer="1"/>
<wire x1="23.5458" y1="13.4874" x2="20.3454" y2="13.4874" width="0.3048" layer="1"/>
<wire x1="23.7744" y1="13.2588" x2="23.5458" y2="13.4874" width="0.3048" layer="1"/>
<wire x1="20.3454" y1="13.4874" x2="20.32" y2="13.5754" width="0.3048" layer="1"/>
<wire x1="23.7744" y1="13.2588" x2="23.87" y2="13.0683" width="0.3048" layer="1"/>
<wire x1="13.716" y1="16.6878" x2="13.716" y2="13.716" width="0.3048" layer="1"/>
<wire x1="13.716" y1="13.716" x2="13.716" y2="12.8016" width="0.3048" layer="1"/>
<wire x1="15.0876" y1="18.0594" x2="13.716" y2="16.6878" width="0.3048" layer="1"/>
<wire x1="13.716" y1="12.8016" x2="13.5754" y2="12.7" width="0.3048" layer="1"/>
<wire x1="15.0876" y1="18.0594" x2="15.24" y2="18.1746" width="0.3048" layer="1"/>
<wire x1="13.716" y1="13.716" x2="20.1168" y2="13.716" width="0.3048" layer="1"/>
<wire x1="20.1168" y1="13.716" x2="20.32" y2="13.5754" width="0.3048" layer="1"/>
<wire x1="10.5156" y1="17.6022" x2="9.8298" y2="17.6022" width="0.3048" layer="1"/>
<wire x1="11.43" y1="16.6878" x2="10.5156" y2="17.6022" width="0.3048" layer="1"/>
<wire x1="13.716" y1="16.6878" x2="11.43" y2="16.6878" width="0.3048" layer="1"/>
<wire x1="13.716" y1="8.9154" x2="15.7734" y2="6.858" width="0.3048" layer="1"/>
<wire x1="13.716" y1="12.573" x2="13.716" y2="8.9154" width="0.3048" layer="1"/>
<wire x1="15.7734" y1="6.858" x2="16.4254" y2="6.985" width="0.3048" layer="1"/>
<wire x1="13.716" y1="12.573" x2="13.5754" y2="12.7" width="0.3048" layer="1"/>
<wire x1="36.8046" y1="21.2598" x2="40.005" y2="21.2598" width="0.3048" layer="1"/>
<wire x1="35.8902" y1="22.1742" x2="36.8046" y2="21.2598" width="0.3048" layer="1"/>
<wire x1="10.9728" y1="22.1742" x2="35.8902" y2="22.1742" width="0.3048" layer="1"/>
<wire x1="10.9728" y1="22.1742" x2="11.0354" y2="22.86" width="0.3048" layer="1"/>
<wire x1="8.4954" y1="15.24" x2="8.4954" y2="11.77330625" width="0.3048" layer="1"/>
<wire x1="8.4954" y1="11.77330625" x2="8.83870625" y2="11.43" width="0.3048" layer="1"/>
<via x="8.83870625" y="11.43" extent="1-16" drill="0.6"/>
</signal>
<signal name="VCC">
<contactref element="UREG2" pad="IN"/>
<contactref element="UREG2" pad="EN"/>
<contactref element="C1" pad="2"/>
<contactref element="INPUT" pad="1"/>
<contactref element="C4" pad="2"/>
<contactref element="UREG1" pad="IN"/>
<contactref element="C8" pad="1"/>
<contactref element="IC2" pad="13"/>
<contactref element="IC2" pad="20"/>
<contactref element="C12" pad="2"/>
<wire x1="46.1772" y1="10.287" x2="46.1772" y2="10.0584" width="0.3048" layer="1"/>
<wire x1="46.1772" y1="10.0584" x2="46.1772" y2="9.144" width="0.3048" layer="1"/>
<wire x1="46.1772" y1="9.144" x2="46.3686" y2="9.017" width="0.3048" layer="1"/>
<wire x1="46.1772" y1="10.287" x2="46.0517" y2="10.395" width="0.3048" layer="1"/>
<wire x1="50.6476" y1="17.272" x2="51.1556" y2="17.78" width="0.3048" layer="1"/>
<wire x1="50.6476" y1="14.859" x2="50.6476" y2="17.272" width="0.3048" layer="1"/>
<wire x1="50.419" y1="14.6304" x2="50.6476" y2="14.859" width="0.3048" layer="1"/>
<wire x1="47.3202" y1="14.6304" x2="50.419" y2="14.6304" width="0.3048" layer="1"/>
<wire x1="47.0916" y1="14.859" x2="47.3202" y2="14.6304" width="0.3048" layer="1"/>
<wire x1="46.1772" y1="14.859" x2="47.0916" y2="14.859" width="0.3048" layer="1"/>
<wire x1="46.1772" y1="14.859" x2="46.0517" y2="14.945" width="0.3048" layer="1"/>
<wire x1="49.1109" y1="10.0584" x2="46.1772" y2="10.0584" width="0.3048" layer="1"/>
<wire x1="51.943" y1="7.2263" x2="49.1109" y2="10.0584" width="0.3048" layer="1"/>
<wire x1="56.6928" y1="7.2263" x2="51.943" y2="7.2263" width="0.3048" layer="1"/>
<wire x1="56.9214" y1="7.4549" x2="56.6928" y2="7.2263" width="0.3048" layer="1"/>
<wire x1="56.9214" y1="15.0876" x2="56.9214" y2="7.4549" width="0.3048" layer="1"/>
<wire x1="54.6354" y1="17.3736" x2="56.9214" y2="15.0876" width="0.3048" layer="1"/>
<wire x1="52.2478" y1="17.3736" x2="54.6354" y2="17.3736" width="0.3048" layer="1"/>
<wire x1="52.2478" y1="17.3736" x2="52.07" y2="17.3854" width="0.3048" layer="1"/>
<wire x1="8.9154" y1="22.6314" x2="8.9154" y2="20.8026" width="0.3048" layer="1"/>
<wire x1="8.9154" y1="20.8026" x2="8.9154" y2="20.1168" width="0.3048" layer="1"/>
<wire x1="9.144" y1="22.86" x2="8.9154" y2="22.6314" width="0.3048" layer="1"/>
<wire x1="8.9154" y1="20.1168" x2="8.9067" y2="20" width="0.3048" layer="1"/>
<wire x1="8.6868" y1="18.0594" x2="5.2578" y2="18.0594" width="0.3048" layer="1"/>
<wire x1="5.2578" y1="18.0594" x2="5.0633" y2="18.1" width="0.3048" layer="1"/>
<wire x1="8.6868" y1="18.0594" x2="8.9067" y2="18.1" width="0.3048" layer="1"/>
<wire x1="4.3434" y1="20.8026" x2="8.9154" y2="20.8026" width="0.3048" layer="1"/>
<wire x1="4.1148" y1="20.574" x2="4.3434" y2="20.8026" width="0.3048" layer="1"/>
<wire x1="4.1148" y1="18.5166" x2="4.1148" y2="20.574" width="0.3048" layer="1"/>
<wire x1="4.3434" y1="18.288" x2="4.1148" y2="18.5166" width="0.3048" layer="1"/>
<wire x1="5.0292" y1="18.288" x2="4.3434" y2="18.288" width="0.3048" layer="1"/>
<wire x1="5.0292" y1="18.288" x2="5.0633" y2="18.1" width="0.3048" layer="1"/>
<wire x1="6.6294" y1="14.1732" x2="6.6294" y2="15.0876" width="0.3048" layer="1"/>
<wire x1="3.8862" y1="11.43" x2="4.3434" y2="11.8872" width="0.3048" layer="1"/>
<wire x1="4.3434" y1="11.8872" x2="6.6294" y2="14.1732" width="0.3048" layer="1"/>
<wire x1="6.6294" y1="15.0876" x2="6.7446" y2="15.24" width="0.3048" layer="1"/>
<wire x1="3.8862" y1="11.43" x2="3.81" y2="11.43" width="0.3048" layer="1"/>
<wire x1="2.5146" y1="16.4592" x2="4.3434" y2="18.288" width="0.3048" layer="1"/>
<wire x1="2.286" y1="16.4592" x2="2.5146" y2="16.4592" width="0.3048" layer="1"/>
<wire x1="1.8288" y1="16.002" x2="2.286" y2="16.4592" width="0.3048" layer="1"/>
<wire x1="1.8288" y1="14.4018" x2="1.8288" y2="16.002" width="0.3048" layer="1"/>
<wire x1="4.3434" y1="11.8872" x2="1.8288" y2="14.4018" width="0.3048" layer="1"/>
<wire x1="4.3434" y1="11.8872" x2="3.81" y2="11.43" width="0.3048" layer="1"/>
<wire x1="44.9326" y1="24.003" x2="51.1556" y2="17.78" width="0.3048" layer="1"/>
<wire x1="51.1556" y1="17.78" x2="51.7906" y2="17.145" width="0.3048" layer="1"/>
<wire x1="10.287" y1="24.003" x2="44.9326" y2="24.003" width="0.3048" layer="1"/>
<wire x1="9.144" y1="22.86" x2="10.287" y2="24.003" width="0.3048" layer="1"/>
<wire x1="51.7906" y1="17.145" x2="52.07" y2="17.3854" width="0.3048" layer="1"/>
<wire x1="9.144" y1="22.86" x2="9.2846" y2="22.86" width="0.3048" layer="1"/>
</signal>
<signal name="+3V3">
<contactref element="UREG2" pad="OUT"/>
<contactref element="C2" pad="2"/>
<contactref element="C5" pad="1"/>
<contactref element="MCU1" pad="1"/>
<contactref element="MCU1" pad="17"/>
<contactref element="MCU1" pad="5"/>
<contactref element="C7" pad="1"/>
<contactref element="IC1" pad="5"/>
<contactref element="R1" pad="2"/>
<contactref element="SWD1" pad="VCC"/>
<contactref element="X1" pad="1"/>
<contactref element="R2" pad="1"/>
<wire x1="22.4028" y1="11.8872" x2="20.3454" y2="11.8872" width="0.3048" layer="1"/>
<wire x1="20.3454" y1="11.8872" x2="20.32" y2="11.8246" width="0.3048" layer="1"/>
<wire x1="22.4028" y1="11.8872" x2="22.4917" y2="11.69" width="0.3048" layer="1"/>
<wire x1="32.2326" y1="6.6294" x2="34.29" y2="6.6294" width="0.3048" layer="1"/>
<wire x1="31.7754" y1="6.1722" x2="32.2326" y2="6.6294" width="0.3048" layer="1"/>
<wire x1="30.861" y1="6.1722" x2="31.7754" y2="6.1722" width="0.3048" layer="1"/>
<wire x1="34.29" y1="6.6294" x2="34.29" y2="6.7446" width="0.3048" layer="1"/>
<wire x1="30.861" y1="6.1722" x2="30.8483" y2="6.09" width="0.3048" layer="1"/>
<wire x1="29.9466" y1="9.144" x2="30.6324" y2="9.144" width="0.3048" layer="1"/>
<wire x1="28.8036" y1="8.001" x2="29.2608" y2="8.4582" width="0.3048" layer="1"/>
<wire x1="29.2608" y1="8.4582" x2="29.9466" y2="9.144" width="0.3048" layer="1"/>
<wire x1="28.8036" y1="7.0866" x2="28.8036" y2="8.001" width="0.3048" layer="1"/>
<wire x1="29.718" y1="6.1722" x2="28.8036" y2="7.0866" width="0.3048" layer="1"/>
<wire x1="30.6324" y1="6.1722" x2="29.718" y2="6.1722" width="0.3048" layer="1"/>
<wire x1="30.6324" y1="9.144" x2="30.8483" y2="9.29" width="0.3048" layer="1"/>
<wire x1="30.6324" y1="6.1722" x2="30.8483" y2="6.09" width="0.3048" layer="1"/>
<wire x1="26.0604" y1="11.6586" x2="25.6032" y2="11.6586" width="0.3048" layer="1"/>
<wire x1="25.6032" y1="11.6586" x2="22.6314" y2="11.6586" width="0.3048" layer="1"/>
<wire x1="29.2608" y1="8.4582" x2="26.0604" y2="11.6586" width="0.3048" layer="1"/>
<wire x1="22.6314" y1="11.6586" x2="22.4917" y2="11.69" width="0.3048" layer="1"/>
<wire x1="11.6586" y1="9.6012" x2="11.6586" y2="10.795" width="0.3048" layer="1"/>
<wire x1="11.6586" y1="10.795" x2="11.6586" y2="12.573" width="0.3048" layer="1"/>
<wire x1="11.6586" y1="12.573" x2="11.8246" y2="12.7" width="0.3048" layer="1"/>
<wire x1="11.6586" y1="9.6012" x2="11.5146" y2="9.525" width="0.3048" layer="1"/>
<wire x1="15.0876" y1="20.1168" x2="11.43" y2="20.1168" width="0.3048" layer="1"/>
<wire x1="11.43" y1="20.1168" x2="11.4133" y2="20" width="0.3048" layer="1"/>
<wire x1="15.0876" y1="20.1168" x2="15.24" y2="19.9254" width="0.3048" layer="1"/>
<wire x1="30.861" y1="18.7452" x2="36.8046" y2="18.7452" width="0.3048" layer="1"/>
<wire x1="28.3464" y1="21.2598" x2="30.861" y2="18.7452" width="0.3048" layer="1"/>
<wire x1="26.289" y1="21.2598" x2="28.3464" y2="21.2598" width="0.3048" layer="1"/>
<wire x1="25.3746" y1="20.3454" x2="26.289" y2="21.2598" width="0.3048" layer="1"/>
<wire x1="36.8046" y1="18.7452" x2="36.83" y2="18.6554" width="0.3048" layer="1"/>
<wire x1="25.3746" y1="20.3454" x2="25.4" y2="20.32" width="0.3048" layer="1"/>
<wire x1="31.5468" y1="3.6576" x2="31.5468" y2="2.7432" width="0.3048" layer="16"/>
<wire x1="25.6032" y1="9.6012" x2="31.5468" y2="3.6576" width="0.3048" layer="16"/>
<wire x1="25.6032" y1="20.1168" x2="25.6032" y2="14.1732" width="0.3048" layer="16"/>
<wire x1="25.6032" y1="14.1732" x2="25.6032" y2="11.6586" width="0.3048" layer="16"/>
<wire x1="25.6032" y1="11.6586" x2="25.6032" y2="9.6012" width="0.3048" layer="16"/>
<wire x1="31.5468" y1="2.7432" x2="31.75" y2="2.54" width="0.3048" layer="16"/>
<wire x1="25.6032" y1="20.1168" x2="25.4" y2="20.32" width="0.3048" layer="16"/>
<wire x1="23.3172" y1="20.1168" x2="15.3162" y2="20.1168" width="0.3048" layer="1"/>
<wire x1="25.3746" y1="20.1168" x2="23.3172" y2="20.1168" width="0.3048" layer="16"/>
<wire x1="15.3162" y1="20.1168" x2="15.24" y2="19.9254" width="0.3048" layer="1"/>
<wire x1="25.3746" y1="20.1168" x2="25.4" y2="20.32" width="0.3048" layer="16"/>
<wire x1="13.0302" y1="13.9446" x2="11.8872" y2="12.8016" width="0.3048" layer="1"/>
<wire x1="13.0302" y1="14.1732" x2="13.0302" y2="13.9446" width="0.3048" layer="1"/>
<wire x1="25.6032" y1="14.1732" x2="13.0302" y2="14.1732" width="0.3048" layer="16"/>
<wire x1="11.8872" y1="12.8016" x2="11.8246" y2="12.7" width="0.3048" layer="1"/>
<via x="23.3172" y="20.1168" extent="1-16" drill="0.35"/>
<via x="13.0302" y="14.1732" extent="1-16" drill="0.35"/>
<via x="25.6032" y="11.6586" extent="1-16" drill="0.35"/>
<wire x1="11.6586" y1="10.795" x2="9.8425" y2="10.795" width="0.3048" layer="1"/>
<via x="9.8425" y="10.795" extent="1-16" drill="0.6"/>
</signal>
<signal name="+5V">
<contactref element="C6" pad="1"/>
<contactref element="UREG1" pad="OUT"/>
<contactref element="C3" pad="2"/>
<contactref element="IC1" pad="3"/>
<wire x1="2.5146" y1="17.6022" x2="2.5146" y2="18.0594" width="0.3048" layer="1"/>
<wire x1="2.0574" y1="17.145" x2="2.5146" y2="17.6022" width="0.3048" layer="1"/>
<wire x1="3.429" y1="17.145" x2="2.0574" y2="17.145" width="0.3048" layer="16"/>
<wire x1="3.8862" y1="16.6878" x2="3.429" y2="17.145" width="0.3048" layer="16"/>
<wire x1="3.8862" y1="16.2306" x2="3.8862" y2="16.6878" width="0.3048" layer="1"/>
<wire x1="2.9718" y1="15.3162" x2="3.8862" y2="16.2306" width="0.3048" layer="1"/>
<wire x1="2.5146" y1="18.0594" x2="2.5567" y2="18.1" width="0.3048" layer="1"/>
<wire x1="2.9718" y1="15.3162" x2="2.9346" y2="15.24" width="0.3048" layer="1"/>
<wire x1="16.4592" y1="8.2296" x2="18.9738" y2="8.2296" width="0.3048" layer="1"/>
<wire x1="18.9738" y1="8.2296" x2="19.05" y2="8.0146" width="0.3048" layer="1"/>
<wire x1="16.4592" y1="8.2296" x2="16.4254" y2="8.255" width="0.3048" layer="1"/>
<wire x1="7.5438" y1="16.6878" x2="3.8862" y2="16.6878" width="0.3048" layer="16"/>
<wire x1="14.859" y1="9.3726" x2="9.8933" y2="14.3383" width="0.3048" layer="16"/>
<wire x1="9.8933" y1="14.3383" x2="7.5438" y2="16.6878" width="0.3048" layer="16"/>
<wire x1="15.7734" y1="8.4582" x2="14.859" y2="9.3726" width="0.3048" layer="1"/>
<wire x1="16.2306" y1="8.4582" x2="15.7734" y2="8.4582" width="0.3048" layer="1"/>
<wire x1="16.2306" y1="8.4582" x2="16.4254" y2="8.255" width="0.3048" layer="1"/>
<via x="2.0574" y="17.145" extent="1-16" drill="0.35"/>
<via x="3.8862" y="16.6878" extent="1-16" drill="0.35"/>
<via x="14.859" y="9.3726" extent="1-16" drill="0.35"/>
<wire x1="9.8933" y1="14.3383" x2="9.8933" y2="12.1158" width="0.3048" layer="16"/>
<wire x1="9.8933" y1="12.1158" x2="9.8425" y2="12.065" width="0.3048" layer="16"/>
<via x="9.8425" y="12.065" extent="1-16" drill="0.6"/>
</signal>
<signal name="N$3">
<contactref element="R1" pad="1"/>
<contactref element="MCU1" pad="4"/>
<contactref element="SWD1" pad="RST"/>
<wire x1="30.861" y1="8.6868" x2="34.29" y2="8.6868" width="0.3048" layer="1"/>
<wire x1="30.861" y1="8.6868" x2="30.8483" y2="8.49" width="0.3048" layer="1"/>
<wire x1="36.8046" y1="6.1722" x2="36.8046" y2="2.7432" width="0.3048" layer="1"/>
<wire x1="34.29" y1="8.6868" x2="36.8046" y2="6.1722" width="0.3048" layer="1"/>
<wire x1="36.8046" y1="2.7432" x2="36.83" y2="2.54" width="0.3048" layer="1"/>
<wire x1="34.29" y1="8.6868" x2="34.29" y2="8.4954" width="0.3048" layer="1"/>
</signal>
<signal name="N$2">
<contactref element="C9" pad="1"/>
<contactref element="IC2" pad="23"/>
<wire x1="47.3202" y1="17.3736" x2="49.1871" y2="17.3736" width="0.3048" layer="1"/>
<wire x1="46.863" y1="16.9164" x2="47.3202" y2="17.3736" width="0.3048" layer="1"/>
<wire x1="46.1772" y1="16.9164" x2="46.863" y2="16.9164" width="0.3048" layer="1"/>
<wire x1="49.1871" y1="17.3736" x2="49.2125" y2="17.3854" width="0.3048" layer="1"/>
<wire x1="46.1772" y1="16.9164" x2="46.0517" y2="16.895" width="0.3048" layer="1"/>
</signal>
<signal name="N$11">
<contactref element="IC1" pad="1"/>
<contactref element="MCU1" pad="20"/>
<wire x1="21.4884" y1="9.144" x2="22.4028" y2="9.144" width="0.3048" layer="1"/>
<wire x1="20.574" y1="8.2296" x2="21.4884" y2="9.144" width="0.3048" layer="1"/>
<wire x1="20.574" y1="7.0866" x2="20.574" y2="8.2296" width="0.3048" layer="1"/>
<wire x1="19.2024" y1="5.715" x2="20.574" y2="7.0866" width="0.3048" layer="1"/>
<wire x1="16.4254" y1="5.715" x2="18.7325" y2="5.715" width="0.3048" layer="1"/>
<wire x1="18.7325" y1="5.715" x2="19.2024" y2="5.715" width="0.3048" layer="1"/>
<wire x1="22.4028" y1="9.144" x2="22.4917" y2="9.29" width="0.3048" layer="1"/>
<wire x1="18.7325" y1="5.715" x2="18.7325" y2="4.7625" width="0.3048" layer="1"/>
<via x="18.7325" y="4.7625" extent="1-16" drill="0.6"/>
</signal>
<signal name="N$12">
<contactref element="IC1" pad="4"/>
<contactref element="MCU1" pad="19"/>
<wire x1="20.3454" y1="10.287" x2="22.4028" y2="10.287" width="0.3048" layer="1"/>
<wire x1="19.8882" y1="10.7442" x2="20.3454" y2="10.287" width="0.3048" layer="1"/>
<wire x1="17.6022" y1="10.7442" x2="17.78" y2="10.7442" width="0.3048" layer="1"/>
<wire x1="17.78" y1="10.7442" x2="19.8882" y2="10.7442" width="0.3048" layer="1"/>
<wire x1="16.4592" y1="9.6012" x2="17.6022" y2="10.7442" width="0.3048" layer="1"/>
<wire x1="22.4028" y1="10.287" x2="22.4917" y2="10.09" width="0.3048" layer="1"/>
<wire x1="16.4592" y1="9.6012" x2="16.4254" y2="9.525" width="0.3048" layer="1"/>
<wire x1="17.78" y1="10.7442" x2="17.78" y2="12.065" width="0.3048" layer="1"/>
<via x="17.78" y="12.065" extent="1-16" drill="0.6"/>
</signal>
<signal name="N$15">
<contactref element="IC1" pad="7"/>
<contactref element="INPUT" pad="COM1"/>
<wire x1="12.1158" y1="7.0866" x2="11.6586" y2="7.0866" width="0.3048" layer="1"/>
<wire x1="12.8016" y1="7.7724" x2="12.1158" y2="7.0866" width="0.3048" layer="1"/>
<wire x1="12.8016" y1="8.6868" x2="12.8016" y2="7.7724" width="0.3048" layer="1"/>
<wire x1="12.573" y1="8.9154" x2="12.8016" y2="8.6868" width="0.3048" layer="1"/>
<wire x1="4.1148" y1="8.9154" x2="12.573" y2="8.9154" width="0.3048" layer="1"/>
<wire x1="3.8862" y1="8.6868" x2="4.1148" y2="8.9154" width="0.3048" layer="1"/>
<wire x1="11.6586" y1="7.0866" x2="11.5146" y2="6.985" width="0.3048" layer="1"/>
<wire x1="3.8862" y1="8.6868" x2="3.81" y2="8.5725" width="0.3048" layer="1"/>
</signal>
<signal name="N$16">
<contactref element="IC1" pad="6"/>
<contactref element="INPUT" pad="COM2"/>
<wire x1="6.4008" y1="8.2296" x2="11.43" y2="8.2296" width="0.3048" layer="1"/>
<wire x1="5.0292" y1="6.858" x2="6.4008" y2="8.2296" width="0.3048" layer="1"/>
<wire x1="3.8862" y1="6.858" x2="5.0292" y2="6.858" width="0.3048" layer="1"/>
<wire x1="11.43" y1="8.2296" x2="11.5146" y2="8.255" width="0.3048" layer="1"/>
<wire x1="3.8862" y1="6.858" x2="3.81" y2="6.6675" width="0.3048" layer="1"/>
</signal>
<signal name="N$17">
<contactref element="SWD1" pad="SWD"/>
<contactref element="MCU1" pad="23"/>
<wire x1="21.717" y1="6.858" x2="22.4028" y2="6.858" width="0.3048" layer="1"/>
<wire x1="21.2598" y1="6.4008" x2="21.717" y2="6.858" width="0.3048" layer="1"/>
<wire x1="21.2598" y1="5.0292" x2="21.2598" y2="6.4008" width="0.3048" layer="1"/>
<wire x1="24.6888" y1="1.6002" x2="21.2598" y2="5.0292" width="0.3048" layer="1"/>
<wire x1="33.3756" y1="1.6002" x2="24.6888" y2="1.6002" width="0.3048" layer="1"/>
<wire x1="34.29" y1="2.5146" x2="33.3756" y2="1.6002" width="0.3048" layer="1"/>
<wire x1="22.4028" y1="6.858" x2="22.4917" y2="6.89" width="0.3048" layer="1"/>
<wire x1="34.29" y1="2.5146" x2="34.29" y2="2.54" width="0.3048" layer="1"/>
</signal>
<signal name="N$18">
<contactref element="SWD1" pad="SWC"/>
<contactref element="MCU1" pad="24"/>
<wire x1="22.6314" y1="4.3434" x2="22.6314" y2="5.9436" width="0.3048" layer="1"/>
<wire x1="23.5458" y1="3.429" x2="22.6314" y2="4.3434" width="0.3048" layer="1"/>
<wire x1="32.2326" y1="3.429" x2="23.5458" y2="3.429" width="0.3048" layer="1"/>
<wire x1="32.9184" y1="2.7432" x2="32.2326" y2="3.429" width="0.3048" layer="1"/>
<wire x1="22.6314" y1="5.9436" x2="22.4917" y2="6.09" width="0.3048" layer="1"/>
<wire x1="32.9184" y1="2.7432" x2="33.02" y2="2.54" width="0.3048" layer="1"/>
</signal>
<signal name="N$19">
<contactref element="MCU1" pad="11"/>
<contactref element="X1" pad="2"/>
<wire x1="27.6606" y1="19.2024" x2="27.6606" y2="13.2588" width="0.3048" layer="1"/>
<wire x1="26.7462" y1="20.1168" x2="27.6606" y2="19.2024" width="0.3048" layer="1"/>
<wire x1="27.6606" y1="13.2588" x2="27.87" y2="13.0683" width="0.3048" layer="1"/>
<wire x1="26.7462" y1="20.1168" x2="26.67" y2="20.32" width="0.3048" layer="1"/>
</signal>
<signal name="N$1">
<contactref element="C9" pad="2"/>
<contactref element="IC2" pad="22"/>
<wire x1="46.1772" y1="16.2306" x2="49.2125" y2="16.2306" width="0.3048" layer="1"/>
<wire x1="49.2125" y1="16.2306" x2="49.2125" y2="15.6346" width="0.3048" layer="1"/>
<wire x1="46.1772" y1="16.2306" x2="46.0517" y2="16.245" width="0.3048" layer="1"/>
</signal>
<signal name="N$6">
<contactref element="C11" pad="2"/>
<contactref element="IC2" pad="5"/>
<contactref element="IC2" pad="3"/>
<contactref element="IC2" pad="11"/>
<contactref element="IC2" pad="1"/>
<wire x1="40.9194" y1="18.0594" x2="40.9194" y2="20.1168" width="0.3048" layer="1"/>
<wire x1="40.4622" y1="17.6022" x2="40.9194" y2="18.0594" width="0.3048" layer="1"/>
<wire x1="40.9194" y1="20.1168" x2="41.0346" y2="20.32" width="0.3048" layer="1"/>
<wire x1="40.4622" y1="17.6022" x2="40.3083" y2="17.545" width="0.3048" layer="1"/>
<wire x1="38.862" y1="10.9728" x2="40.2336" y2="10.9728" width="0.3048" layer="1"/>
<wire x1="38.862" y1="15.5448" x2="38.862" y2="10.9728" width="0.3048" layer="16"/>
<wire x1="39.5478" y1="14.859" x2="38.862" y2="15.5448" width="0.3048" layer="1"/>
<wire x1="40.2336" y1="14.859" x2="39.5478" y2="14.859" width="0.3048" layer="1"/>
<wire x1="40.2336" y1="10.9728" x2="40.3083" y2="11.045" width="0.3048" layer="1"/>
<wire x1="40.2336" y1="14.859" x2="40.3083" y2="14.945" width="0.3048" layer="1"/>
<wire x1="39.3192" y1="16.2306" x2="40.2336" y2="16.2306" width="0.3048" layer="1"/>
<wire x1="38.862" y1="15.7734" x2="39.0906" y2="16.002" width="0.3048" layer="1"/>
<wire x1="39.0906" y1="16.002" x2="39.3192" y2="16.2306" width="0.3048" layer="1"/>
<wire x1="38.862" y1="15.5448" x2="38.862" y2="15.7734" width="0.3048" layer="1"/>
<wire x1="40.2336" y1="16.2306" x2="40.3083" y2="16.245" width="0.3048" layer="1"/>
<wire x1="39.5478" y1="17.6022" x2="40.2336" y2="17.6022" width="0.3048" layer="1"/>
<wire x1="39.0906" y1="17.145" x2="39.5478" y2="17.6022" width="0.3048" layer="1"/>
<wire x1="39.0906" y1="16.002" x2="39.0906" y2="17.145" width="0.3048" layer="1"/>
<wire x1="40.2336" y1="17.6022" x2="40.3083" y2="17.545" width="0.3048" layer="1"/>
<via x="38.862" y="10.9728" extent="1-16" drill="0.35"/>
<via x="38.862" y="15.5448" extent="1-16" drill="0.35"/>
</signal>
<signal name="N$8">
<contactref element="MCU1" pad="15"/>
<contactref element="IC2" pad="7"/>
<wire x1="24.4602" y1="15.3162" x2="24.4602" y2="13.2588" width="0.3048" layer="1"/>
<wire x1="24.003" y1="15.7734" x2="24.4602" y2="15.3162" width="0.3048" layer="1"/>
<wire x1="24.003" y1="21.4884" x2="24.003" y2="15.7734" width="0.3048" layer="1"/>
<wire x1="31.5468" y1="21.4884" x2="24.003" y2="21.4884" width="0.3048" layer="16"/>
<wire x1="38.1762" y1="14.859" x2="35.88385" y2="17.15135" width="0.3048" layer="16"/>
<wire x1="35.88385" y1="17.15135" x2="31.5468" y2="21.4884" width="0.3048" layer="16"/>
<wire x1="39.3192" y1="13.716" x2="38.1762" y2="14.859" width="0.3048" layer="1"/>
<wire x1="40.2336" y1="13.716" x2="39.3192" y2="13.716" width="0.3048" layer="1"/>
<wire x1="24.4602" y1="13.2588" x2="24.67" y2="13.0683" width="0.3048" layer="1"/>
<wire x1="40.2336" y1="13.716" x2="40.3083" y2="13.645" width="0.3048" layer="1"/>
<via x="24.003" y="21.4884" extent="1-16" drill="0.35"/>
<via x="38.1762" y="14.859" extent="1-16" drill="0.35"/>
<wire x1="35.88385" y1="17.15135" x2="33.02" y2="14.2875" width="0.3048" layer="16"/>
<wire x1="33.02" y1="14.2875" x2="33.02" y2="13.97" width="0.3048" layer="16"/>
<via x="33.02" y="13.97" extent="1-16" drill="0.6"/>
</signal>
<signal name="N$9">
<contactref element="MCU1" pad="26"/>
<contactref element="IC2" pad="8"/>
<wire x1="24.6888" y1="6.1722" x2="24.6888" y2="4.8006" width="0.3048" layer="1"/>
<wire x1="27.432" y1="8.9154" x2="24.6888" y2="6.1722" width="0.3048" layer="1"/>
<wire x1="31.5468" y1="8.9154" x2="27.432" y2="8.9154" width="0.3048" layer="16"/>
<wire x1="36.3474" y1="13.716" x2="34.96945" y2="12.33805" width="0.3048" layer="16"/>
<wire x1="34.96945" y1="12.33805" x2="31.5468" y2="8.9154" width="0.3048" layer="16"/>
<wire x1="38.1762" y1="13.716" x2="36.3474" y2="13.716" width="0.3048" layer="16"/>
<wire x1="38.6334" y1="13.716" x2="38.1762" y2="13.716" width="0.3048" layer="1"/>
<wire x1="39.3192" y1="13.0302" x2="38.6334" y2="13.716" width="0.3048" layer="1"/>
<wire x1="40.2336" y1="13.0302" x2="39.3192" y2="13.0302" width="0.3048" layer="1"/>
<wire x1="24.6888" y1="4.8006" x2="24.67" y2="4.7117" width="0.3048" layer="1"/>
<wire x1="40.2336" y1="13.0302" x2="40.3083" y2="12.995" width="0.3048" layer="1"/>
<via x="27.432" y="8.9154" extent="1-16" drill="0.35"/>
<via x="38.1762" y="13.716" extent="1-16" drill="0.35"/>
<wire x1="34.96945" y1="12.33805" x2="34.65195" y2="12.33805" width="0.3048" layer="16"/>
<wire x1="34.65195" y1="12.33805" x2="33.9725" y2="13.0175" width="0.3048" layer="16"/>
<via x="33.9725" y="13.0175" extent="1-16" drill="0.6"/>
</signal>
<signal name="N$20">
<contactref element="C12" pad="1"/>
<contactref element="IC2" pad="21"/>
<wire x1="51.8922" y1="15.0876" x2="51.8922" y2="15.5448" width="0.3048" layer="1"/>
<wire x1="51.2064" y1="14.4018" x2="51.8922" y2="15.0876" width="0.3048" layer="1"/>
<wire x1="48.6918" y1="14.4018" x2="51.2064" y2="14.4018" width="0.3048" layer="16"/>
<wire x1="47.5488" y1="15.5448" x2="48.6918" y2="14.4018" width="0.3048" layer="16"/>
<wire x1="46.1772" y1="15.5448" x2="47.5488" y2="15.5448" width="0.3048" layer="1"/>
<wire x1="51.8922" y1="15.5448" x2="52.07" y2="15.6346" width="0.3048" layer="1"/>
<wire x1="46.1772" y1="15.5448" x2="46.0517" y2="15.595" width="0.3048" layer="1"/>
<via x="51.2064" y="14.4018" extent="1-16" drill="0.35"/>
<via x="47.5488" y="15.5448" extent="1-16" drill="0.35"/>
</signal>
<signal name="N$21">
<contactref element="R3" pad="1"/>
<contactref element="MCU1" pad="6"/>
<contactref element="IC2" pad="10"/>
<wire x1="37.4904" y1="12.573" x2="37.0332" y2="13.0302" width="0.3048" layer="1"/>
<wire x1="37.4904" y1="12.3444" x2="37.4904" y2="12.573" width="0.3048" layer="1"/>
<wire x1="38.1762" y1="11.6586" x2="37.4904" y2="12.3444" width="0.3048" layer="1"/>
<wire x1="40.2336" y1="11.6586" x2="38.1762" y2="11.6586" width="0.3048" layer="1"/>
<wire x1="37.0332" y1="13.0302" x2="36.83" y2="13.0946" width="0.3048" layer="1"/>
<wire x1="40.2336" y1="11.6586" x2="40.3083" y2="11.695" width="0.3048" layer="1"/>
<wire x1="34.0614" y1="10.287" x2="30.861" y2="10.287" width="0.3048" layer="1"/>
<wire x1="35.433" y1="11.6586" x2="34.0614" y2="10.287" width="0.3048" layer="16"/>
<wire x1="36.8046" y1="13.0302" x2="35.433" y2="11.6586" width="0.3048" layer="1"/>
<wire x1="30.861" y1="10.287" x2="30.8483" y2="10.09" width="0.3048" layer="1"/>
<wire x1="36.8046" y1="13.0302" x2="36.83" y2="13.0946" width="0.3048" layer="1"/>
<via x="34.0614" y="10.287" extent="1-16" drill="0.35"/>
<via x="35.433" y="11.6586" extent="1-16" drill="0.35"/>
</signal>
<signal name="N$7">
<contactref element="R2" pad="2"/>
<contactref element="MCU1" pad="14"/>
<contactref element="IC2" pad="2"/>
<wire x1="37.9476" y1="17.8308" x2="37.0332" y2="16.9164" width="0.3048" layer="1"/>
<wire x1="37.9476" y1="19.431" x2="37.9476" y2="18.0594" width="0.3048" layer="1"/>
<wire x1="37.9476" y1="18.0594" x2="37.9476" y2="17.8308" width="0.3048" layer="1"/>
<wire x1="35.6616" y1="21.717" x2="37.9476" y2="19.431" width="0.3048" layer="1"/>
<wire x1="25.3746" y1="21.717" x2="35.6616" y2="21.717" width="0.3048" layer="1"/>
<wire x1="24.4602" y1="20.8026" x2="25.3746" y2="21.717" width="0.3048" layer="1"/>
<wire x1="24.4602" y1="16.002" x2="24.4602" y2="20.8026" width="0.3048" layer="1"/>
<wire x1="25.3746" y1="15.0876" x2="24.4602" y2="16.002" width="0.3048" layer="1"/>
<wire x1="25.3746" y1="13.2588" x2="25.3746" y2="15.0876" width="0.3048" layer="1"/>
<wire x1="37.0332" y1="16.9164" x2="36.83" y2="16.9046" width="0.3048" layer="1"/>
<wire x1="25.3746" y1="13.2588" x2="25.47" y2="13.0683" width="0.3048" layer="1"/>
<wire x1="41.6052" y1="16.9164" x2="40.4622" y2="16.9164" width="0.3048" layer="1"/>
<wire x1="41.8338" y1="17.145" x2="41.6052" y2="16.9164" width="0.3048" layer="1"/>
<wire x1="39.0906" y1="17.145" x2="41.8338" y2="17.145" width="0.3048" layer="16"/>
<wire x1="38.1762" y1="18.0594" x2="39.0906" y2="17.145" width="0.3048" layer="16"/>
<wire x1="37.9476" y1="18.0594" x2="38.1762" y2="18.0594" width="0.3048" layer="1"/>
<wire x1="40.4622" y1="16.9164" x2="40.3083" y2="16.895" width="0.3048" layer="1"/>
<via x="41.8338" y="17.145" extent="1-16" drill="0.35"/>
<via x="38.1762" y="18.0594" extent="1-16" drill="0.35"/>
</signal>
<signal name="N$5">
<contactref element="R4" pad="1"/>
<contactref element="MCU1" pad="7"/>
<contactref element="IC2" pad="12"/>
<wire x1="37.719" y1="10.9728" x2="37.0332" y2="10.9728" width="0.3048" layer="1"/>
<wire x1="38.4048" y1="10.287" x2="37.719" y2="10.9728" width="0.3048" layer="1"/>
<wire x1="40.2336" y1="10.287" x2="38.4048" y2="10.287" width="0.3048" layer="1"/>
<wire x1="37.0332" y1="10.9728" x2="36.83" y2="11.0354" width="0.3048" layer="1"/>
<wire x1="40.2336" y1="10.287" x2="40.3083" y2="10.395" width="0.3048" layer="1"/>
<wire x1="36.8046" y1="10.9728" x2="30.861" y2="10.9728" width="0.3048" layer="1"/>
<wire x1="30.861" y1="10.9728" x2="30.8483" y2="10.89" width="0.3048" layer="1"/>
<wire x1="36.8046" y1="10.9728" x2="36.83" y2="11.0354" width="0.3048" layer="1"/>
</signal>
<signal name="N$10">
<contactref element="M1" pad="2"/>
<contactref element="IC2" pad="18"/>
<contactref element="IC2" pad="19"/>
<wire x1="46.1772" y1="14.1732" x2="46.1772" y2="13.716" width="0.3048" layer="1"/>
<wire x1="46.1772" y1="14.1732" x2="46.0517" y2="14.295" width="0.3048" layer="1"/>
<wire x1="49.3776" y1="13.716" x2="46.1772" y2="13.716" width="0.3048" layer="1"/>
<wire x1="52.1208" y1="10.9728" x2="49.3776" y2="13.716" width="0.3048" layer="16"/>
<wire x1="53.0352" y1="10.9728" x2="52.1208" y2="10.9728" width="0.3048" layer="1"/>
<wire x1="54.4957" y1="9.5123" x2="53.0352" y2="10.9728" width="0.3048" layer="1"/>
<wire x1="46.1772" y1="13.716" x2="46.0517" y2="13.645" width="0.3048" layer="1"/>
<wire x1="54.4957" y1="9.5123" x2="54.61" y2="9.2075" width="0.3048" layer="1"/>
<via x="49.3776" y="13.716" extent="1-16" drill="0.35"/>
<via x="52.1208" y="10.9728" extent="1-16" drill="0.35"/>
</signal>
<signal name="N$13">
<contactref element="M1" pad="1"/>
<contactref element="IC2" pad="14"/>
<contactref element="IC2" pad="15"/>
<wire x1="46.1772" y1="11.6586" x2="46.1772" y2="11.2014" width="0.3048" layer="1"/>
<wire x1="46.1772" y1="11.2014" x2="46.0517" y2="11.045" width="0.3048" layer="1"/>
<wire x1="52.8066" y1="11.6586" x2="46.1772" y2="11.6586" width="0.3048" layer="1"/>
<wire x1="53.8988" y1="12.7508" x2="52.8066" y2="11.6586" width="0.3048" layer="1"/>
<wire x1="46.1772" y1="11.6586" x2="46.0517" y2="11.695" width="0.3048" layer="1"/>
<wire x1="53.8988" y1="12.7508" x2="54.61" y2="13.0175" width="0.3048" layer="1"/>
</signal>
<signal name="N$23">
<contactref element="MCU1" pad="27"/>
<contactref element="IC2" pad="9"/>
<wire x1="25.6032" y1="5.715" x2="25.6032" y2="4.8006" width="0.3048" layer="1"/>
<wire x1="28.1178" y1="8.2296" x2="25.6032" y2="5.715" width="0.3048" layer="1"/>
<wire x1="33.6042" y1="8.2296" x2="28.1178" y2="8.2296" width="0.3048" layer="16"/>
<wire x1="38.1762" y1="12.8016" x2="33.6042" y2="8.2296" width="0.3048" layer="16"/>
<wire x1="38.862" y1="12.8016" x2="38.1762" y2="12.8016" width="0.3048" layer="1"/>
<wire x1="39.3192" y1="12.3444" x2="38.862" y2="12.8016" width="0.3048" layer="1"/>
<wire x1="40.2336" y1="12.3444" x2="39.3192" y2="12.3444" width="0.3048" layer="1"/>
<wire x1="25.6032" y1="4.8006" x2="25.47" y2="4.7117" width="0.3048" layer="1"/>
<wire x1="40.2336" y1="12.3444" x2="40.3083" y2="12.345" width="0.3048" layer="1"/>
<via x="28.1178" y="8.2296" extent="1-16" drill="0.35"/>
<via x="38.1762" y="12.8016" extent="1-16" drill="0.35"/>
</signal>
<signal name="N$14">
<contactref element="Y1" pad="2"/>
<contactref element="C10" pad="2"/>
<contactref element="MCU1" pad="3"/>
<wire x1="44.577" y1="2.9718" x2="41.6052" y2="2.9718" width="0.3048" layer="1"/>
<wire x1="44.8056" y1="2.7432" x2="44.577" y2="2.9718" width="0.3048" layer="1"/>
<wire x1="41.6052" y1="2.9718" x2="41.465" y2="3.185" width="0.3048" layer="1"/>
<wire x1="44.8056" y1="2.7432" x2="44.8446" y2="2.54" width="0.3048" layer="1"/>
<wire x1="29.4894" y1="7.5438" x2="30.6324" y2="7.5438" width="0.3048" layer="1"/>
<wire x1="31.5468" y1="7.5438" x2="29.4894" y2="7.5438" width="0.3048" layer="16"/>
<wire x1="35.6616" y1="3.429" x2="31.5468" y2="7.5438" width="0.3048" layer="16"/>
<wire x1="39.0906" y1="3.429" x2="35.6616" y2="3.429" width="0.3048" layer="16"/>
<wire x1="40.4622" y1="2.0574" x2="39.0906" y2="3.429" width="0.3048" layer="16"/>
<wire x1="41.3766" y1="2.9718" x2="40.4622" y2="2.0574" width="0.3048" layer="1"/>
<wire x1="30.6324" y1="7.5438" x2="30.8483" y2="7.69" width="0.3048" layer="1"/>
<wire x1="41.3766" y1="2.9718" x2="41.465" y2="3.185" width="0.3048" layer="1"/>
<via x="29.4894" y="7.5438" extent="1-16" drill="0.35"/>
<via x="40.4622" y="2.0574" extent="1-16" drill="0.35"/>
</signal>
<signal name="N$22">
<contactref element="MCU1" pad="2"/>
<contactref element="C13" pad="2"/>
<contactref element="Y1" pad="4"/>
<wire x1="40.6908" y1="5.2578" x2="40.005" y2="4.572" width="0.3048" layer="1"/>
<wire x1="44.8056" y1="5.2578" x2="40.6908" y2="5.2578" width="0.3048" layer="1"/>
<wire x1="40.005" y1="4.572" x2="39.815" y2="4.435" width="0.3048" layer="1"/>
<wire x1="44.8056" y1="5.2578" x2="44.8446" y2="5.08" width="0.3048" layer="1"/>
<wire x1="32.6898" y1="7.0866" x2="30.861" y2="7.0866" width="0.3048" layer="1"/>
<wire x1="32.9184" y1="7.3152" x2="32.6898" y2="7.0866" width="0.3048" layer="1"/>
<wire x1="37.0332" y1="7.3152" x2="32.9184" y2="7.3152" width="0.3048" layer="16"/>
<wire x1="38.862" y1="5.4864" x2="37.0332" y2="7.3152" width="0.3048" layer="16"/>
<wire x1="39.7764" y1="4.572" x2="38.862" y2="5.4864" width="0.3048" layer="1"/>
<wire x1="30.861" y1="7.0866" x2="30.8483" y2="6.89" width="0.3048" layer="1"/>
<wire x1="39.7764" y1="4.572" x2="39.815" y2="4.435" width="0.3048" layer="1"/>
<via x="32.9184" y="7.3152" extent="1-16" drill="0.35"/>
<via x="38.862" y="5.4864" extent="1-16" drill="0.35"/>
</signal>
</signals>
<mfgpreviewcolors>
<mfgpreviewcolor name="soldermaskcolor" color="0xC8008000"/>
<mfgpreviewcolor name="silkscreencolor" color="0xFFFEFEFE"/>
<mfgpreviewcolor name="backgroundcolor" color="0xFF282828"/>
<mfgpreviewcolor name="coppercolor" color="0xFFFFBF00"/>
<mfgpreviewcolor name="substratecolor" color="0xFF786E46"/>
</mfgpreviewcolors>
</board>
</drawing>
<compatibility>
<note version="8.3" severity="warning">
Since Version 8.3, EAGLE supports URNs for individual library
assets (packages, symbols, and devices). The URNs of those assets
will not be understood (or retained) with this version.
</note>
<note version="8.3" severity="warning">
Since Version 8.3, EAGLE supports the association of 3D packages
with devices in libraries, schematics, and board files. Those 3D
packages will not be understood (or retained) with this version.
</note>
</compatibility>
</eagle>
