G04 EAGLE Gerber RS-274X export*
G75*
%MOMM*%
%FSLAX34Y34*%
%LPD*%
%INSolderpaste Bottom*%
%IPPOS*%
%AMOC8*
5,1,8,0,0,1.08239X$1,22.5*%
G01*
%ADD10R,0.511800X0.611800*%
%ADD11R,0.611800X0.511800*%
%ADD12C,0.320000*%
%ADD13R,3.556000X3.556000*%
%ADD14R,0.300000X0.550000*%
%ADD15R,0.300000X0.350000*%
%ADD16R,0.350000X0.300000*%
%ADD17R,0.550000X0.300000*%

G36*
X52230Y123506D02*
X52230Y123506D01*
X52230Y125006D01*
X52226Y125011D01*
X52225Y125011D01*
X49225Y125011D01*
X49224Y125010D01*
X49222Y125010D01*
X49222Y125008D01*
X49220Y125007D01*
X49222Y125005D01*
X49221Y125003D01*
X50721Y123503D01*
X50724Y123503D01*
X50725Y123501D01*
X52225Y123501D01*
X52230Y123506D01*
G37*
G36*
X83726Y90502D02*
X83726Y90502D01*
X83728Y90502D01*
X83728Y90505D01*
X83730Y90506D01*
X83730Y93506D01*
X83726Y93511D01*
X83725Y93511D01*
X82225Y93511D01*
X82220Y93507D01*
X82220Y93506D01*
X82220Y92006D01*
X82222Y92005D01*
X82221Y92003D01*
X83721Y90503D01*
X83723Y90503D01*
X83724Y90501D01*
X83726Y90502D01*
G37*
G36*
X83730Y120506D02*
X83730Y120506D01*
X83730Y123506D01*
X83729Y123508D01*
X83729Y123509D01*
X83727Y123509D01*
X83726Y123511D01*
X83724Y123510D01*
X83721Y123510D01*
X82221Y122010D01*
X82221Y122008D01*
X82221Y122007D01*
X82220Y122006D01*
X82220Y120506D01*
X82224Y120501D01*
X82225Y120502D01*
X82225Y120501D01*
X83725Y120501D01*
X83730Y120506D01*
G37*
G36*
X47726Y90503D02*
X47726Y90503D01*
X47729Y90503D01*
X49229Y92003D01*
X49229Y92005D01*
X49230Y92006D01*
X49230Y93506D01*
X49226Y93511D01*
X49225Y93511D01*
X47725Y93511D01*
X47720Y93507D01*
X47720Y93506D01*
X47720Y90506D01*
X47721Y90505D01*
X47721Y90503D01*
X47723Y90503D01*
X47724Y90501D01*
X47726Y90503D01*
G37*
G36*
X52230Y89006D02*
X52230Y89006D01*
X52230Y90506D01*
X52226Y90511D01*
X52225Y90511D01*
X50725Y90511D01*
X50723Y90510D01*
X50721Y90510D01*
X49221Y89010D01*
X49221Y89008D01*
X49220Y89007D01*
X49221Y89006D01*
X49221Y89003D01*
X49223Y89003D01*
X49225Y89001D01*
X52225Y89001D01*
X52230Y89006D01*
G37*
G36*
X80727Y123503D02*
X80727Y123503D01*
X80729Y123503D01*
X82229Y125003D01*
X82229Y125004D01*
X82230Y125006D01*
X82229Y125007D01*
X82229Y125009D01*
X82227Y125009D01*
X82225Y125011D01*
X79225Y125011D01*
X79220Y125007D01*
X79220Y125006D01*
X79220Y123506D01*
X79224Y123501D01*
X79225Y123502D01*
X79225Y123501D01*
X80725Y123501D01*
X80727Y123503D01*
G37*
G36*
X82226Y89002D02*
X82226Y89002D01*
X82228Y89002D01*
X82228Y89004D01*
X82230Y89006D01*
X82228Y89007D01*
X82229Y89010D01*
X80729Y90510D01*
X80726Y90510D01*
X80725Y90511D01*
X79225Y90511D01*
X79220Y90507D01*
X79220Y90506D01*
X79220Y89006D01*
X79224Y89001D01*
X79225Y89002D01*
X79225Y89001D01*
X82225Y89001D01*
X82226Y89002D01*
G37*
G36*
X49230Y120506D02*
X49230Y120506D01*
X49230Y122006D01*
X49228Y122008D01*
X49229Y122010D01*
X47729Y123510D01*
X47727Y123510D01*
X47726Y123511D01*
X47724Y123510D01*
X47722Y123510D01*
X47722Y123508D01*
X47720Y123506D01*
X47720Y120506D01*
X47724Y120501D01*
X47725Y120502D01*
X47725Y120501D01*
X49225Y120501D01*
X49230Y120506D01*
G37*
D10*
X74694Y10169D03*
X64694Y10169D03*
D11*
X37456Y107238D03*
X37456Y97238D03*
D10*
X124225Y45094D03*
X134225Y45094D03*
X89300Y11756D03*
X99300Y11756D03*
D12*
X71700Y66960D02*
X71700Y72140D01*
X78200Y72140D02*
X78200Y66960D01*
X84700Y66960D02*
X84700Y72140D01*
X91200Y72140D02*
X91200Y66960D01*
X97700Y66960D02*
X97700Y72140D01*
X104200Y72140D02*
X104200Y66960D01*
X109816Y61344D02*
X114996Y61344D01*
X114996Y54844D02*
X109816Y54844D01*
X109816Y48344D02*
X114996Y48344D01*
X114996Y41844D02*
X109816Y41844D01*
X109816Y35344D02*
X114996Y35344D01*
X114996Y28844D02*
X109816Y28844D01*
X104200Y23228D02*
X104200Y18048D01*
X97700Y18048D02*
X97700Y23228D01*
X91200Y23228D02*
X91200Y18048D01*
X84700Y18048D02*
X84700Y23228D01*
X78200Y23228D02*
X78200Y18048D01*
X71700Y18048D02*
X71700Y23228D01*
X66084Y28844D02*
X60904Y28844D01*
X60904Y35344D02*
X66084Y35344D01*
X66084Y41844D02*
X60904Y41844D01*
X60904Y48344D02*
X66084Y48344D01*
X66084Y54844D02*
X60904Y54844D01*
X60904Y61344D02*
X66084Y61344D01*
D13*
X87950Y45094D03*
D14*
X65725Y88256D03*
X70725Y88256D03*
X75725Y88256D03*
X60725Y88256D03*
X55725Y88256D03*
D15*
X80725Y87256D03*
X50725Y87256D03*
D16*
X85475Y92006D03*
D17*
X84475Y97006D03*
X84475Y102006D03*
X84475Y107006D03*
X84475Y112006D03*
X84475Y117006D03*
D16*
X85475Y122006D03*
D15*
X80725Y126756D03*
D14*
X75725Y125756D03*
X70725Y125756D03*
X65725Y125756D03*
X60725Y125756D03*
X55725Y125756D03*
D15*
X50725Y126756D03*
D16*
X45975Y122006D03*
D17*
X46975Y117006D03*
X46975Y112006D03*
X46975Y107006D03*
X46975Y102006D03*
X46975Y97006D03*
D16*
X45975Y92006D03*
D11*
X113350Y114388D03*
X113350Y104388D03*
D10*
X134225Y54619D03*
X124225Y54619D03*
M02*
