Value;Designator;Manufacturer Part Number ;Qty;Link
1µF;C1,C2,C9,C10,C13,C15,C16,C17,C20,C24,C26,C27,C28,C31,C35,C37,C38,C39,C42,C49,C51,C52,C55,C56,C57,C61,C63,C65,C66,C69,C70,C71,C75,C77,C79,C80,C83,C84,C85,C89,C91,C93,C94,C97,C98,C99,C103;CM05X5R105M16AH ;47;https://www.mouser.it/ProductDetail/Kyocera-Electronic-Components/CM05X5R105M16AH?qs=sGAEpiMZZMsG1k5vdNM%2Fc62HxpYsYx%252BhBV8RL3Hya%252Bk%3D
100nF;C3,C5,C6,C7,C8,C18,C19,C29,C30,C40,C41,C58,C59,C60,C72,C73,C74,C86,C87,C88,C100,C101,C102;CM05X5R104M25AH ;23;https://www.mouser.it/ProductDetail/Kyocera-Electronic-Components/CM05X5R104M25AH?qs=sGAEpiMZZMukHu%252BjC5l7YVcK8nR54NRf%252B%2FCwG4ny9h4%3D
10nF;C4,C14,C25,C36;C0402C103J3RACAUTO;4;https://www.mouser.it/ProductDetail/KEMET/C0402C103J3RACAUTO?qs=sGAEpiMZZMve4%2FbfQkoj%252BCWWpKGC3MQ%252BwgfuJpV5gCA%3D
6pF;C11,C12,C21,C22,C32,C33,C43,C44,C50,C53,C64,C67,C78,C81,C92,C95;CM02CG6R0C25AH;16;https://www.mouser.it/ProductDetail/Kyocera-Electronic-Components/CM02CG6R0C25AH?qs=sGAEpiMZZMsG1k5vdNM%2FcwGynhgql%252BwqrjoY%252BtX2Gl4%3D
2.2µF;C23,C34,C45;GRM155D80J225KE95D;3;https://eu.mouser.com/ProductDetail/Murata-Electronics/GRM155D80J225KE95D?qs=sGAEpiMZZMukHu%252BjC5l7YbA1Uz8mFEbw84Tc7RFEpyk%3D
1000µF;C54,C68,C82,C96;EMZR160ADA102MJA0G ;4;https://www.mouser.it/ProductDetail/United-Chemi-Con/EMZR160ADA102MJA0G?qs=sGAEpiMZZMtZ1n0r9vR22fqwrRNfnv%252BxKrr0ji2QNcqbu3TmqptkFQ%3D%3D
47nF;C62,C76,C90,C104;885012205054;4;https://www.mouser.it/ProductDetail/Wurth-Elektronik/885012205054?qs=sGAEpiMZZMukHu%252BjC5l7YRTxnIahtzp%252ByRFbUy39Xb4%3D
ATA6561;IC1,IC3,IC5,IC7,IC9,IC11,IC13,IC15;ATA6561-GBQW-N;8;https://www.mouser.it/ProductDetail/Microchip-Technology/ATA6561-GBQW-N?qs=sGAEpiMZZMve4%2FbfQkoj%252BI%2F7t6KV9V5GttbTFJRO2QE%3D
MPU9250;IC2;MPU-9250;1;https://www.mouser.it/ProductDetail/TDK-InvenSense/MPU-9250?qs=sGAEpiMZZMve4%2FbfQkoj%252BGX2U5IkiOVxAMRs%252Bjynh2I%3D
DRV8833;IC4,IC6,IC8;DRV8833RTYR;3;https://eu.mouser.com/ProductDetail/Texas-Instruments/DRV8833RTYR?qs=sGAEpiMZZMtz%252B0sEXfDDUASdefVSgDvl
DRV8873;IC10,IC12,IC14,IC16;DRV8873HPWPR ;4;https://www.mouser.it/ProductDetail/Texas-Instruments/DRV8873HPWPR?qs=sGAEpiMZZMve4%2FbfQkoj%252BI3JP6hi623WoZdN3QB6XpI%3D
JST6;INPUT;;1;
X4SMD_COM;INPUT1,INPUT2,INPUT3,INPUT4,INPUT5,INPUT6,INPUT7;;7;
X2SMD;M1,M2,M3;;3;
PCB_OUTLINE;M4,M5,M6,M7;;4;
STM32F042G6;MCU1,MCU2,MCU3,MCU4,MCU5,MCU6,MCU7,MCU8;STM32F042G6U6 ;8;https://www.mouser.it/ProductDetail/STMicroelectronics/STM32F042G6U6?qs=sGAEpiMZZMuoKKEcg8mMKNc9fYNb0pwdq4rqFaZOONp42qL8qoOBeg%3D%3D
X3THTSMALL;POT,POT1,POT2,POT3,POT4,POT5,POT6;;7;
10k;R1,R3,R7,R11,R12,R13,R17,R18,R22,R23,R27,R28;RR0510P-103-D;12;https://www.mouser.it/ProductDetail/Susumu/RR0510P-103-D?qs=sGAEpiMZZMu61qfTUdNhG%2FDhcyQpRg8MB7P%2FfnNlJ9M%3D
1M;R2;MCS04020C1004FE000 ;1;https://www.mouser.it/ProductDetail/Vishay-Beyschlag/MCS04020C1004FE000?qs=wTZ%2FFzl837afGRMa0lJoFA%3D%3D
330k;R4,R8,R16,R21,R26,R31,R32;MCS04020C3303FE000;7;https://www.mouser.it/ProductDetail/Vishay-Beyschlag/MCS04020C3303FE000?qs=wTZ%2FFzl837bYr6QLjKqnrw%3D%3D
0.075;R5,R6,R9,R10,R33,R34;ERJ-2BWFR075X ;6;https://eu.mouser.com/ProductDetail/Panasonic/ERJ-2BWFR075X?qs=sGAEpiMZZMvdGkrng054t%252BCSV7RqsZYanf4L0ZPtkAA%3D
330;R14,R15,R19,R20,R24,R25,R29,R30;RR0816P-331-D ;8;https://www.mouser.it/ProductDetail/Susumu/RR0816P-331-D?qs=sGAEpiMZZMu61qfTUdNhG%2FDhcyQpRg8MBi1RcDRDsPM%3D
SWD;SWD1,SWD2,SWD3,SWD4,SWD5,SWD6,SWD7,SWD8;;8;
5V;UREG1,UREG3,UREG5,UREG7,UREG9,UREG11,UREG13,UREG15;TPS76950DBVR;8;https://www.mouser.it/ProductDetail/Texas-Instruments/TPS76950DBVR?qs=sGAEpiMZZMsGz1a6aV8DcAfX9iOHBOeIyQpQEiditR4%3D
3V3;UREG2,UREG4,UREG6,UREG8,UREG10,UREG12,UREG14,UREG16;MCP1802T-3002I/OT;8;https://www.mouser.it/ProductDetail/Microchip-Technology/MCP1802T-3002I-OT?qs=sGAEpiMZZMsGz1a6aV8DcHtY22241HYI5svncn6gMRE%3D
32MHz;Y1,Y2,Y3,Y4,Y5,Y6,Y7,Y8;XRCGB32M000F0Z00R0 ;8;https://www.mouser.it/ProductDetail/81-XRCGB32M000F0Z0R0
