G04 EAGLE Gerber RS-274X export*
G75*
%MOMM*%
%FSLAX34Y34*%
%LPD*%
%IN*%
%IPPOS*%
%AMOC8*
5,1,8,0,0,1.08239X$1,22.5*%
G01*
%ADD10C,0.254000*%


D10*
X0Y0D02*
X150000Y0D01*
X150000Y8294D01*
X150095Y10473D01*
X150380Y12635D01*
X150852Y14764D01*
X151508Y16844D01*
X152342Y18859D01*
X153349Y20794D01*
X154521Y22633D01*
X155849Y24363D01*
X157322Y25971D01*
X158930Y27445D01*
X160661Y28773D01*
X162500Y29944D01*
X164435Y30951D01*
X166450Y31786D01*
X168530Y32442D01*
X170659Y32914D01*
X172821Y33199D01*
X175000Y33294D01*
X175000Y118294D01*
X172821Y118389D01*
X170659Y118674D01*
X168530Y119146D01*
X166450Y119801D01*
X164435Y120636D01*
X162500Y121643D01*
X160661Y122815D01*
X158930Y124143D01*
X157322Y125616D01*
X155849Y127224D01*
X154521Y128954D01*
X153349Y130794D01*
X152342Y132728D01*
X151508Y134743D01*
X150852Y136823D01*
X150380Y138953D01*
X150095Y141115D01*
X150000Y143294D01*
X150000Y151588D01*
X0Y151588D01*
X0Y0D01*
M02*
