G04 EAGLE Gerber RS-274X export*
G75*
%MOMM*%
%FSLAX34Y34*%
%LPD*%
%INSoldermask Top*%
%IPPOS*%
%AMOC8*
5,1,8,0,0,1.08239X$1,22.5*%
G01*
%ADD10C,4.403200*%
%ADD11R,0.883400X1.412000*%
%ADD12R,0.715000X0.815000*%
%ADD13R,0.815000X0.715000*%
%ADD14C,0.523200*%
%ADD15R,2.703200X1.903200*%
%ADD16R,0.503200X0.753200*%
%ADD17R,0.503200X0.553200*%
%ADD18R,0.553200X0.503200*%
%ADD19R,0.753200X0.503200*%
%ADD20C,1.211200*%
%ADD21C,0.909600*%
%ADD22C,0.959600*%

G36*
X78834Y175662D02*
X78834Y175662D01*
X78834Y175663D01*
X78834Y177798D01*
X78830Y177803D01*
X78829Y177802D01*
X78829Y177803D01*
X74686Y177803D01*
X74685Y177802D01*
X74683Y177802D01*
X74683Y177800D01*
X74681Y177798D01*
X74683Y177797D01*
X74682Y177794D01*
X76817Y175659D01*
X76820Y175659D01*
X76821Y175658D01*
X78829Y175658D01*
X78834Y175662D01*
G37*
G36*
X110330Y142405D02*
X110330Y142405D01*
X110332Y142405D01*
X110332Y142407D01*
X110334Y142409D01*
X110334Y146552D01*
X110330Y146557D01*
X110329Y146556D01*
X110329Y146557D01*
X108194Y146557D01*
X108189Y146552D01*
X108189Y144544D01*
X108191Y144542D01*
X108190Y144540D01*
X110325Y142405D01*
X110327Y142405D01*
X110328Y142404D01*
X110330Y142405D01*
G37*
G36*
X73822Y142405D02*
X73822Y142405D01*
X73825Y142405D01*
X75960Y144540D01*
X75960Y144543D01*
X75961Y144544D01*
X75961Y146552D01*
X75957Y146557D01*
X75956Y146556D01*
X75956Y146557D01*
X73821Y146557D01*
X73816Y146552D01*
X73816Y142409D01*
X73817Y142407D01*
X73817Y142406D01*
X73819Y142406D01*
X73820Y142404D01*
X73822Y142405D01*
G37*
G36*
X78961Y141416D02*
X78961Y141416D01*
X78961Y141417D01*
X78961Y143552D01*
X78957Y143557D01*
X78956Y143556D01*
X78956Y143557D01*
X76948Y143557D01*
X76946Y143555D01*
X76944Y143555D01*
X74809Y141420D01*
X74809Y141419D01*
X74808Y141417D01*
X74809Y141416D01*
X74809Y141414D01*
X74811Y141414D01*
X74813Y141412D01*
X78956Y141412D01*
X78961Y141416D01*
G37*
G36*
X110334Y172789D02*
X110334Y172789D01*
X110334Y172790D01*
X110334Y176933D01*
X110333Y176934D01*
X110333Y176936D01*
X110331Y176936D01*
X110330Y176938D01*
X110328Y176936D01*
X110325Y176936D01*
X108190Y174801D01*
X108190Y174799D01*
X108189Y174798D01*
X108189Y172790D01*
X108193Y172785D01*
X108194Y172785D01*
X110329Y172785D01*
X110334Y172789D01*
G37*
G36*
X107204Y175786D02*
X107204Y175786D01*
X107206Y175786D01*
X109341Y177921D01*
X109341Y177923D01*
X109342Y177924D01*
X109341Y177925D01*
X109341Y177928D01*
X109339Y177928D01*
X109337Y177930D01*
X105194Y177930D01*
X105189Y177925D01*
X105189Y175790D01*
X105193Y175785D01*
X105194Y175785D01*
X107202Y175785D01*
X107204Y175786D01*
G37*
G36*
X109338Y141413D02*
X109338Y141413D01*
X109340Y141413D01*
X109340Y141415D01*
X109342Y141416D01*
X109340Y141418D01*
X109341Y141420D01*
X107206Y143555D01*
X107203Y143555D01*
X107202Y143557D01*
X105194Y143557D01*
X105189Y143552D01*
X105189Y141417D01*
X105193Y141412D01*
X105194Y141412D01*
X109337Y141412D01*
X109338Y141413D01*
G37*
G36*
X75834Y172662D02*
X75834Y172662D01*
X75834Y172663D01*
X75834Y174671D01*
X75832Y174673D01*
X75833Y174674D01*
X73698Y176809D01*
X73696Y176809D01*
X73695Y176811D01*
X73693Y176810D01*
X73691Y176810D01*
X73691Y176807D01*
X73689Y176806D01*
X73689Y172663D01*
X73693Y172658D01*
X73694Y172658D01*
X75829Y172658D01*
X75834Y172662D01*
G37*
D10*
X92075Y-25400D03*
X92075Y228600D03*
D11*
X82575Y69223D03*
X92075Y69223D03*
X101575Y69223D03*
X101575Y94289D03*
X82575Y94289D03*
D12*
X99456Y57944D03*
X89456Y57944D03*
D13*
X66675Y81200D03*
X66675Y71200D03*
X119856Y159306D03*
X119856Y169306D03*
X82550Y18813D03*
X82550Y28813D03*
D12*
X107713Y57944D03*
X117713Y57944D03*
D14*
X114525Y50297D02*
X114525Y45391D01*
X108025Y45391D02*
X108025Y50297D01*
X101525Y50297D02*
X101525Y45391D01*
X95025Y45391D02*
X95025Y50297D01*
X95025Y21285D02*
X95025Y16379D01*
X101525Y16379D02*
X101525Y21285D01*
X108025Y21285D02*
X108025Y16379D01*
X114525Y16379D02*
X114525Y21285D01*
D15*
X104775Y33338D03*
D16*
X92075Y140794D03*
X87075Y140794D03*
X82075Y140794D03*
X97075Y140794D03*
X102075Y140794D03*
D17*
X77075Y139794D03*
X107075Y139794D03*
D18*
X72325Y144544D03*
D19*
X73325Y149544D03*
X73325Y154544D03*
X73325Y159544D03*
X73325Y164544D03*
X73325Y169544D03*
D18*
X72325Y174544D03*
D17*
X77075Y179294D03*
D16*
X82075Y178294D03*
X87075Y178294D03*
X92075Y178294D03*
X97075Y178294D03*
X102075Y178294D03*
D17*
X107075Y179294D03*
D18*
X111825Y174544D03*
D19*
X110825Y169544D03*
X110825Y164544D03*
X110825Y159544D03*
X110825Y154544D03*
X110825Y149544D03*
D18*
X111825Y144544D03*
D20*
X133350Y57050D03*
X133350Y44550D03*
X133350Y32050D03*
X133350Y19550D03*
X133350Y69550D03*
X133350Y82050D03*
X133350Y158650D03*
X133350Y146150D03*
X133350Y133650D03*
X133350Y121150D03*
X133350Y171150D03*
X133350Y183650D03*
X50800Y146150D03*
X50800Y158650D03*
X50800Y171150D03*
X50800Y183650D03*
X50800Y133650D03*
X50800Y121150D03*
D13*
X65088Y160894D03*
X65088Y170894D03*
D20*
X50800Y44550D03*
X50800Y57050D03*
X50800Y69550D03*
X50800Y82050D03*
X50800Y32050D03*
X50800Y19550D03*
D21*
X81756Y57944D03*
X123825Y151606D03*
X119063Y184944D03*
X62706Y99219D03*
X54769Y99219D03*
X19050Y175419D03*
X19050Y183356D03*
X19844Y73025D03*
X19844Y65088D03*
D22*
X111919Y190528D03*
X100450Y190274D03*
D21*
X11535Y193594D03*
X25429Y191032D03*
D22*
X32544Y185738D03*
X88459Y155374D03*
X71834Y90904D03*
X110282Y67469D03*
D21*
X100806Y164306D03*
X93118Y96044D03*
D22*
X93663Y169863D03*
X110331Y110331D03*
D21*
X126206Y103981D03*
D22*
X117475Y138906D03*
X81756Y149225D03*
D21*
X92075Y186531D03*
X89983Y116392D03*
D22*
X93697Y82016D03*
M02*
