<?xml version="1.0" encoding="utf-8"?>
<!DOCTYPE eagle SYSTEM "eagle.dtd">
<eagle version="9.4.2">
<drawing>
<settings>
<setting alwaysvectorfont="no"/>
<setting verticaltext="up"/>
</settings>
<grid distance="12.5" unitdist="mil" unit="mil" style="dots" multiple="1" display="yes" altdistance="5" altunitdist="mil" altunit="mil"/>
<layers>
<layer number="1" name="Top" color="4" fill="1" visible="yes" active="yes"/>
<layer number="2" name="Route2" color="16" fill="1" visible="no" active="no"/>
<layer number="3" name="Route3" color="17" fill="1" visible="no" active="no"/>
<layer number="4" name="Route4" color="18" fill="1" visible="no" active="no"/>
<layer number="5" name="Route5" color="19" fill="1" visible="no" active="no"/>
<layer number="6" name="Route6" color="25" fill="1" visible="no" active="no"/>
<layer number="7" name="Route7" color="26" fill="1" visible="no" active="no"/>
<layer number="8" name="Route8" color="27" fill="1" visible="no" active="no"/>
<layer number="9" name="Route9" color="28" fill="1" visible="no" active="no"/>
<layer number="10" name="Route10" color="29" fill="1" visible="no" active="no"/>
<layer number="11" name="Route11" color="30" fill="1" visible="no" active="no"/>
<layer number="12" name="Route12" color="20" fill="1" visible="no" active="no"/>
<layer number="13" name="Route13" color="21" fill="1" visible="no" active="no"/>
<layer number="14" name="Route14" color="22" fill="1" visible="no" active="no"/>
<layer number="15" name="Route15" color="23" fill="1" visible="no" active="no"/>
<layer number="16" name="Bottom" color="1" fill="1" visible="yes" active="yes"/>
<layer number="17" name="Pads" color="2" fill="1" visible="yes" active="yes"/>
<layer number="18" name="Vias" color="2" fill="1" visible="yes" active="yes"/>
<layer number="19" name="Unrouted" color="6" fill="1" visible="no" active="yes"/>
<layer number="20" name="Dimension" color="24" fill="1" visible="no" active="yes"/>
<layer number="21" name="tPlace" color="7" fill="1" visible="no" active="yes"/>
<layer number="22" name="bPlace" color="7" fill="1" visible="no" active="yes"/>
<layer number="23" name="tOrigins" color="15" fill="1" visible="no" active="yes"/>
<layer number="24" name="bOrigins" color="15" fill="1" visible="no" active="yes"/>
<layer number="25" name="tNames" color="7" fill="1" visible="no" active="yes"/>
<layer number="26" name="bNames" color="7" fill="1" visible="no" active="yes"/>
<layer number="27" name="tValues" color="7" fill="1" visible="no" active="yes"/>
<layer number="28" name="bValues" color="7" fill="1" visible="no" active="yes"/>
<layer number="29" name="tStop" color="7" fill="3" visible="no" active="yes"/>
<layer number="30" name="bStop" color="7" fill="6" visible="no" active="yes"/>
<layer number="31" name="tCream" color="7" fill="4" visible="no" active="yes"/>
<layer number="32" name="bCream" color="7" fill="5" visible="no" active="yes"/>
<layer number="33" name="tFinish" color="6" fill="3" visible="no" active="yes"/>
<layer number="34" name="bFinish" color="6" fill="6" visible="no" active="yes"/>
<layer number="35" name="tGlue" color="7" fill="4" visible="no" active="yes"/>
<layer number="36" name="bGlue" color="7" fill="5" visible="no" active="yes"/>
<layer number="37" name="tTest" color="7" fill="1" visible="no" active="yes"/>
<layer number="38" name="bTest" color="7" fill="1" visible="no" active="yes"/>
<layer number="39" name="tKeepout" color="4" fill="11" visible="no" active="yes"/>
<layer number="40" name="bKeepout" color="1" fill="11" visible="no" active="yes"/>
<layer number="41" name="tRestrict" color="4" fill="10" visible="no" active="yes"/>
<layer number="42" name="bRestrict" color="1" fill="10" visible="no" active="yes"/>
<layer number="43" name="vRestrict" color="2" fill="10" visible="no" active="yes"/>
<layer number="44" name="Drills" color="7" fill="1" visible="no" active="yes"/>
<layer number="45" name="Holes" color="7" fill="1" visible="no" active="yes"/>
<layer number="46" name="Milling" color="3" fill="1" visible="no" active="yes"/>
<layer number="47" name="Measures" color="7" fill="1" visible="no" active="yes"/>
<layer number="48" name="Document" color="7" fill="1" visible="no" active="yes"/>
<layer number="49" name="Reference" color="7" fill="1" visible="no" active="yes"/>
<layer number="51" name="tDocu" color="7" fill="1" visible="no" active="yes"/>
<layer number="52" name="bDocu" color="7" fill="1" visible="no" active="yes"/>
<layer number="88" name="SimResults" color="9" fill="1" visible="no" active="no"/>
<layer number="89" name="SimProbes" color="9" fill="1" visible="no" active="no"/>
<layer number="90" name="Modules" color="5" fill="1" visible="no" active="no"/>
<layer number="91" name="Nets" color="2" fill="1" visible="no" active="no"/>
<layer number="92" name="Busses" color="1" fill="1" visible="no" active="no"/>
<layer number="93" name="Pins" color="2" fill="1" visible="no" active="no"/>
<layer number="94" name="Symbols" color="4" fill="1" visible="no" active="no"/>
<layer number="95" name="Names" color="7" fill="1" visible="no" active="no"/>
<layer number="96" name="Values" color="7" fill="1" visible="no" active="no"/>
<layer number="97" name="Info" color="7" fill="1" visible="no" active="no"/>
<layer number="98" name="Guide" color="6" fill="1" visible="no" active="no"/>
</layers>
<board>
<plain>
</plain>
<libraries>
<library name="Standard">
<packages>
<package name="CAPC1005X30" urn="urn:adsk.eagle:footprint:11214500/1" locally_modified="yes">
<description>Chip, 1.00 X 0.50 X 0.30 mm body
&lt;p&gt;Chip package with body size 1.00 X 0.50 X 0.30 mm&lt;/p&gt;</description>
<smd name="1" x="-0.5" y="0" dx="0.5118" dy="0.6118" layer="1"/>
<smd name="2" x="0.5" y="0" dx="0.5118" dy="0.6118" layer="1"/>
<text x="0" y="0.4929" size="0.6096" layer="25" align="bottom-center">&gt;NAME</text>
<text x="0" y="-0.4929" size="0.6096" layer="27" align="top-center">&gt;VALUE</text>
<polygon width="0.0762" layer="21">
<vertex x="-0.127" y="0.254"/>
<vertex x="-0.127" y="-0.254"/>
<vertex x="0.127" y="-0.254"/>
<vertex x="0.127" y="0.254"/>
</polygon>
</package>
<package name="RESC1005X30" urn="urn:adsk.eagle:footprint:11214493/1" locally_modified="yes">
<description>Chip, 1.00 X 0.50 X 0.30 mm body
&lt;p&gt;Chip package with body size 1.00 X 0.50 X 0.30 mm&lt;/p&gt;</description>
<smd name="1" x="-0.5" y="0" dx="0.5118" dy="0.6118" layer="1"/>
<smd name="2" x="0.5" y="0" dx="0.5118" dy="0.6118" layer="1"/>
<text x="0" y="0.4929" size="0.6096" layer="25" align="bottom-center">&gt;NAME</text>
<text x="0" y="-0.4929" size="0.6096" layer="27" align="top-center">&gt;VALUE</text>
<wire x1="-0.127" y1="0.254" x2="-0.127" y2="-0.254" width="0.0762" layer="21"/>
<wire x1="-0.127" y1="-0.254" x2="0.127" y2="-0.254" width="0.0762" layer="21"/>
<wire x1="0.127" y1="-0.254" x2="0.127" y2="0.254" width="0.0762" layer="21"/>
<wire x1="0.127" y1="0.254" x2="-0.127" y2="0.254" width="0.0762" layer="21"/>
</package>
</packages>
<packages3d>
<package3d name="CAPC1005X30" urn="urn:adsk.eagle:package:11214499/1" locally_modified="yes" type="model">
<description>Chip, 1.00 X 0.50 X 0.30 mm body
&lt;p&gt;Chip package with body size 1.00 X 0.50 X 0.30 mm&lt;/p&gt;</description>
<packageinstances>
<packageinstance name="CAPC1005X30"/>
</packageinstances>
</package3d>
<package3d name="RESC1005X30" urn="urn:adsk.eagle:package:11214492/1" locally_modified="yes" type="model">
<description>Chip, 1.00 X 0.50 X 0.30 mm body
&lt;p&gt;Chip package with body size 1.00 X 0.50 X 0.30 mm&lt;/p&gt;</description>
<packageinstances>
<packageinstance name="RESC1005X30"/>
</packageinstances>
</package3d>
</packages3d>
</library>
<library name="BMS_PD">
<packages>
<package name="CAPC3216X160" urn="urn:adsk.eagle:footprint:11819575/1" locally_modified="yes">
<description>Chip, 3.20 X 1.60 X 1.60 mm body
&lt;p&gt;Chip package with body size 3.20 X 1.60 X 1.60 mm&lt;/p&gt;</description>
<smd name="1" x="-1.4" y="0" dx="1.2118" dy="1.7118" layer="1"/>
<smd name="2" x="1.4" y="0" dx="1.2118" dy="1.7118" layer="1"/>
<text x="0" y="1.1699" size="0.6096" layer="25" font="vector" align="bottom-center">&gt;NAME</text>
<text x="0" y="-1.1699" size="0.6096" layer="27" font="vector" align="top-center">&gt;VALUE</text>
<rectangle x1="-0.635" y1="-0.635" x2="0.635" y2="0.635" layer="21"/>
</package>
<package name="QFN50P400X400X80-21T275" urn="urn:adsk.eagle:footprint:11816613/1" locally_modified="yes">
<description>20-QFN, 0.50 mm pitch, 4.00 X 4.00 X 0.80 mm body, 2.75 X 2.75 mm thermal pad
&lt;p&gt;20-pin QFN package with 0.50 mm pitch with body size 4.00 X 4.00 X 0.80 mm and thermal pad size 2.75 X 2.75 mm&lt;/p&gt;</description>
<circle x="-2.554" y="1.639" radius="0.25" width="0" layer="21"/>
<wire x1="-2.05" y1="1.389" x2="-2.05" y2="2.05" width="0.12" layer="21"/>
<wire x1="-2.05" y1="2.05" x2="-1.389" y2="2.05" width="0.12" layer="21"/>
<wire x1="2.05" y1="1.389" x2="2.05" y2="2.05" width="0.12" layer="21"/>
<wire x1="2.05" y1="2.05" x2="1.389" y2="2.05" width="0.12" layer="21"/>
<wire x1="2.05" y1="-1.389" x2="2.05" y2="-2.05" width="0.12" layer="21"/>
<wire x1="2.05" y1="-2.05" x2="1.389" y2="-2.05" width="0.12" layer="21"/>
<wire x1="-2.05" y1="-1.389" x2="-2.05" y2="-2.05" width="0.12" layer="21"/>
<wire x1="-2.05" y1="-2.05" x2="-1.389" y2="-2.05" width="0.12" layer="21"/>
<smd name="1" x="-1.9346" y="1" dx="0.86" dy="0.27" layer="1" roundness="100"/>
<smd name="2" x="-1.9346" y="0.5" dx="0.86" dy="0.27" layer="1" roundness="100"/>
<smd name="3" x="-1.9346" y="0" dx="0.86" dy="0.27" layer="1" roundness="100"/>
<smd name="4" x="-1.9346" y="-0.5" dx="0.86" dy="0.27" layer="1" roundness="100"/>
<smd name="5" x="-1.9346" y="-1" dx="0.86" dy="0.27" layer="1" roundness="100"/>
<smd name="6" x="-1" y="-1.9346" dx="0.86" dy="0.27" layer="1" roundness="100" rot="R90"/>
<smd name="7" x="-0.5" y="-1.9346" dx="0.86" dy="0.27" layer="1" roundness="100" rot="R90"/>
<smd name="8" x="0" y="-1.9346" dx="0.86" dy="0.27" layer="1" roundness="100" rot="R90"/>
<smd name="9" x="0.5" y="-1.9346" dx="0.86" dy="0.27" layer="1" roundness="100" rot="R90"/>
<smd name="10" x="1" y="-1.9346" dx="0.86" dy="0.27" layer="1" roundness="100" rot="R90"/>
<smd name="11" x="1.9346" y="-1" dx="0.86" dy="0.27" layer="1" roundness="100"/>
<smd name="12" x="1.9346" y="-0.5" dx="0.86" dy="0.27" layer="1" roundness="100"/>
<smd name="13" x="1.9346" y="0" dx="0.86" dy="0.27" layer="1" roundness="100"/>
<smd name="14" x="1.9346" y="0.5" dx="0.86" dy="0.27" layer="1" roundness="100"/>
<smd name="15" x="1.9346" y="1" dx="0.86" dy="0.27" layer="1" roundness="100"/>
<smd name="16" x="1" y="1.9346" dx="0.86" dy="0.27" layer="1" roundness="100" rot="R90"/>
<smd name="17" x="0.5" y="1.9346" dx="0.86" dy="0.27" layer="1" roundness="100" rot="R90"/>
<smd name="18" x="0" y="1.9346" dx="0.86" dy="0.27" layer="1" roundness="100" rot="R90"/>
<smd name="19" x="-0.5" y="1.9346" dx="0.86" dy="0.27" layer="1" roundness="100" rot="R90"/>
<smd name="20" x="-1" y="1.9346" dx="0.86" dy="0.27" layer="1" roundness="100" rot="R90"/>
<smd name="21" x="0" y="0" dx="2.75" dy="2.75" layer="1" thermals="no"/>
<text x="0" y="2.9996" size="0.6096" layer="25" align="bottom-center">&gt;NAME</text>
<text x="0" y="-2.9996" size="1.27" layer="27" align="top-center">&gt;VALUE</text>
</package>
<package name="L_100115">
<smd name="P$1" x="-4.75" y="0" dx="4" dy="3.5" layer="1" rot="R90"/>
<smd name="P$2" x="4.75" y="0" dx="4" dy="3.5" layer="1" rot="R90"/>
<wire x1="-6" y1="2.25" x2="-6" y2="5.25" width="0.127" layer="21"/>
<wire x1="-6" y1="5.25" x2="6" y2="5.25" width="0.127" layer="21"/>
<wire x1="6" y1="5.25" x2="6" y2="2.25" width="0.127" layer="21"/>
<wire x1="6" y1="-2.25" x2="6" y2="-5.25" width="0.127" layer="21"/>
<wire x1="6" y1="-5.25" x2="-6" y2="-5.25" width="0.127" layer="21"/>
<wire x1="-6" y1="-5.25" x2="-6" y2="-2.25" width="0.127" layer="21"/>
<text x="-5.25" y="4.25" size="0.6096" layer="25" font="vector">&gt;NAME</text>
<text x="-5.5" y="-4.75" size="0.6096" layer="27" font="vector">&gt;VALUE</text>
</package>
<package name="PG-TDSON-8">
<smd name="3" x="2.825" y="0.635" dx="0.75" dy="1.3" layer="1" rot="R90"/>
<smd name="2" x="2.825" y="-0.635" dx="0.75" dy="1.3" layer="1" rot="R90"/>
<smd name="1" x="2.825" y="-1.905" dx="0.75" dy="1.3" layer="1" rot="R90"/>
<smd name="4" x="2.825" y="1.905" dx="0.75" dy="1.3" layer="1" rot="R90"/>
<smd name="6" x="-2.825" y="0.635" dx="0.75" dy="1.3" layer="1" rot="R90"/>
<smd name="7" x="-2.825" y="-0.635" dx="0.75" dy="1.3" layer="1" rot="R90"/>
<smd name="8" x="-2.825" y="-1.905" dx="0.75" dy="1.3" layer="1" rot="R90"/>
<smd name="5" x="-2.825" y="1.905" dx="0.75" dy="1.3" layer="1" rot="R90"/>
<polygon width="0.002540625" layer="1">
<vertex x="-3.475" y="-2.28"/>
<vertex x="-3.475" y="-1.53"/>
<vertex x="-2.175" y="-1.53"/>
<vertex x="-2.175" y="2.285"/>
<vertex x="1.625" y="2.28"/>
<vertex x="1.625" y="-2.28"/>
</polygon>
<circle x="3.81" y="-2.8575" radius="0.3175" width="0.127" layer="21"/>
<wire x1="-3.4925" y1="2.54" x2="2.8575" y2="2.54" width="0.127" layer="21"/>
<wire x1="2.8575" y1="-2.54" x2="-3.4925" y2="-2.54" width="0.127" layer="21"/>
<polygon width="0.127" layer="29">
<vertex x="-3.475" y="-2.28"/>
<vertex x="-3.475" y="-1.53"/>
<vertex x="-2.175" y="-1.53"/>
<vertex x="-2.175" y="-1.01"/>
<vertex x="-3.475" y="-1.01"/>
<vertex x="-2.175" y="-1.01"/>
<vertex x="-2.175" y="-0.26"/>
<vertex x="-2.175" y="0.26"/>
<vertex x="-3.475" y="0.26"/>
<vertex x="-3.475" y="1.01"/>
<vertex x="-2.175" y="1.01"/>
<vertex x="-2.175" y="1.53"/>
<vertex x="-3.475" y="1.53"/>
<vertex x="-3.475" y="2.28"/>
<vertex x="1.625" y="2.28"/>
<vertex x="1.625" y="-2.28"/>
</polygon>
<polygon width="0.127" layer="31">
<vertex x="-3.475" y="-2.28"/>
<vertex x="-3.475" y="-1.53"/>
<vertex x="-2.175" y="-1.53"/>
<vertex x="-2.175" y="-1.01"/>
<vertex x="-3.475" y="-1.01"/>
<vertex x="-2.175" y="-1.01"/>
<vertex x="-2.175" y="-0.26"/>
<vertex x="-2.175" y="0.26"/>
<vertex x="-3.475" y="0.26"/>
<vertex x="-3.475" y="1.01"/>
<vertex x="-2.175" y="1.01"/>
<vertex x="-2.175" y="1.53"/>
<vertex x="-3.475" y="1.53"/>
<vertex x="-3.475" y="2.28"/>
<vertex x="1.625" y="2.28"/>
<vertex x="1.625" y="-2.28"/>
</polygon>
<text x="-3.4925" y="2.8575" size="0.6096" layer="25" font="vector">&gt;NAME</text>
<text x="-3.4925" y="-3.4925" size="0.6096" layer="27" font="vector">&gt;VALUE</text>
</package>
</packages>
<packages3d>
<package3d name="CAPC3216X160" urn="urn:adsk.eagle:package:11819311/1" type="model">
<description>Chip, 3.20 X 1.60 X 1.60 mm body
&lt;p&gt;Chip package with body size 3.20 X 1.60 X 1.60 mm&lt;/p&gt;</description>
<packageinstances>
<packageinstance name="CAPC3216X160"/>
</packageinstances>
</package3d>
<package3d name="QFN50P400X400X80-21T275" urn="urn:adsk.eagle:package:11816611/1" type="model">
<description>20-QFN, 0.50 mm pitch, 4.00 X 4.00 X 0.80 mm body, 2.75 X 2.75 mm thermal pad
&lt;p&gt;20-pin QFN package with 0.50 mm pitch with body size 4.00 X 4.00 X 0.80 mm and thermal pad size 2.75 X 2.75 mm&lt;/p&gt;</description>
<packageinstances>
<packageinstance name="QFN50P400X400X80-21T275"/>
</packageinstances>
</package3d>
</packages3d>
</library>
</libraries>
<attributes>
</attributes>
<variantdefs>
</variantdefs>
<classes>
<class number="0" name="default" width="0" drill="0">
</class>
</classes>
<designrules name="default *">
<description language="de">&lt;b&gt;EAGLE Design Rules&lt;/b&gt;
&lt;p&gt;
Die Standard-Design-Rules sind so gewählt, dass sie für 
die meisten Anwendungen passen. Sollte ihre Platine 
besondere Anforderungen haben, treffen Sie die erforderlichen
Einstellungen hier und speichern die Design Rules unter 
einem neuen Namen ab.</description>
<description language="en">&lt;b&gt;EAGLE Design Rules&lt;/b&gt;
&lt;p&gt;
The default Design Rules have been set to cover
a wide range of applications. Your particular design
may have different requirements, so please make the
necessary adjustments and save your customized
design rules under a new name.</description>
<param name="layerSetup" value="(1*16)"/>
<param name="mtCopper" value="0.035mm 0.035mm 0.035mm 0.035mm 0.035mm 0.035mm 0.035mm 0.035mm 0.035mm 0.035mm 0.035mm 0.035mm 0.035mm 0.035mm 0.035mm 0.035mm"/>
<param name="mtIsolate" value="1.5mm 0.15mm 0.2mm 0.15mm 0.2mm 0.15mm 0.2mm 0.15mm 0.2mm 0.15mm 0.2mm 0.15mm 0.2mm 0.15mm 0.2mm"/>
<param name="mdWireWire" value="6mil"/>
<param name="mdWirePad" value="6mil"/>
<param name="mdWireVia" value="6mil"/>
<param name="mdPadPad" value="6mil"/>
<param name="mdPadVia" value="6mil"/>
<param name="mdViaVia" value="6mil"/>
<param name="mdSmdPad" value="6mil"/>
<param name="mdSmdVia" value="6mil"/>
<param name="mdSmdSmd" value="6mil"/>
<param name="mdViaViaSameLayer" value="6mil"/>
<param name="mnLayersViaInSmd" value="2"/>
<param name="mdCopperDimension" value="40mil"/>
<param name="mdDrill" value="6mil"/>
<param name="mdSmdStop" value="0mil"/>
<param name="msWidth" value="6mil"/>
<param name="msDrill" value="0.3mm"/>
<param name="msMicroVia" value="9.99mm"/>
<param name="msBlindViaRatio" value="0.5"/>
<param name="rvPadTop" value="0.25"/>
<param name="rvPadInner" value="0.25"/>
<param name="rvPadBottom" value="0.25"/>
<param name="rvViaOuter" value="0.25"/>
<param name="rvViaInner" value="0.25"/>
<param name="rvMicroViaOuter" value="0.25"/>
<param name="rvMicroViaInner" value="0.25"/>
<param name="rlMinPadTop" value="10mil"/>
<param name="rlMaxPadTop" value="20mil"/>
<param name="rlMinPadInner" value="10mil"/>
<param name="rlMaxPadInner" value="20mil"/>
<param name="rlMinPadBottom" value="10mil"/>
<param name="rlMaxPadBottom" value="20mil"/>
<param name="rlMinViaOuter" value="8mil"/>
<param name="rlMaxViaOuter" value="20mil"/>
<param name="rlMinViaInner" value="8mil"/>
<param name="rlMaxViaInner" value="20mil"/>
<param name="rlMinMicroViaOuter" value="4mil"/>
<param name="rlMaxMicroViaOuter" value="20mil"/>
<param name="rlMinMicroViaInner" value="4mil"/>
<param name="rlMaxMicroViaInner" value="20mil"/>
<param name="psTop" value="-1"/>
<param name="psBottom" value="-1"/>
<param name="psFirst" value="-1"/>
<param name="psElongationLong" value="100"/>
<param name="psElongationOffset" value="100"/>
<param name="mvStopFrame" value="1"/>
<param name="mvCreamFrame" value="0"/>
<param name="mlMinStopFrame" value="4mil"/>
<param name="mlMaxStopFrame" value="4mil"/>
<param name="mlMinCreamFrame" value="0mil"/>
<param name="mlMaxCreamFrame" value="0mil"/>
<param name="mlViaStopLimit" value="0mil"/>
<param name="srRoundness" value="0"/>
<param name="srMinRoundness" value="0mil"/>
<param name="srMaxRoundness" value="0mil"/>
<param name="slThermalIsolate" value="10mil"/>
<param name="slThermalsForVias" value="0"/>
<param name="dpMaxLengthDifference" value="10mm"/>
<param name="dpGapFactor" value="2.5"/>
<param name="checkAngle" value="0"/>
<param name="checkFont" value="1"/>
<param name="checkRestrict" value="1"/>
<param name="checkStop" value="0"/>
<param name="checkValues" value="0"/>
<param name="checkNames" value="1"/>
<param name="checkWireStubs" value="1"/>
<param name="checkPolygonWidth" value="0"/>
<param name="useDiameter" value="13"/>
<param name="maxErrors" value="50"/>
</designrules>
<autorouter>
<pass name="Default">
<param name="RoutingGrid" value="50mil"/>
<param name="AutoGrid" value="1"/>
<param name="Efforts" value="0"/>
<param name="TopRouterVariant" value="1"/>
<param name="tpViaShape" value="round"/>
<param name="PrefDir.1" value="a"/>
<param name="PrefDir.2" value="0"/>
<param name="PrefDir.3" value="0"/>
<param name="PrefDir.4" value="0"/>
<param name="PrefDir.5" value="0"/>
<param name="PrefDir.6" value="0"/>
<param name="PrefDir.7" value="0"/>
<param name="PrefDir.8" value="0"/>
<param name="PrefDir.9" value="0"/>
<param name="PrefDir.10" value="0"/>
<param name="PrefDir.11" value="0"/>
<param name="PrefDir.12" value="0"/>
<param name="PrefDir.13" value="0"/>
<param name="PrefDir.14" value="0"/>
<param name="PrefDir.15" value="0"/>
<param name="PrefDir.16" value="a"/>
<param name="cfVia" value="8"/>
<param name="cfNonPref" value="5"/>
<param name="cfChangeDir" value="2"/>
<param name="cfOrthStep" value="2"/>
<param name="cfDiagStep" value="3"/>
<param name="cfExtdStep" value="0"/>
<param name="cfBonusStep" value="1"/>
<param name="cfMalusStep" value="1"/>
<param name="cfPadImpact" value="4"/>
<param name="cfSmdImpact" value="4"/>
<param name="cfBusImpact" value="0"/>
<param name="cfHugging" value="3"/>
<param name="cfAvoid" value="4"/>
<param name="cfPolygon" value="10"/>
<param name="cfBase.1" value="0"/>
<param name="cfBase.2" value="1"/>
<param name="cfBase.3" value="1"/>
<param name="cfBase.4" value="1"/>
<param name="cfBase.5" value="1"/>
<param name="cfBase.6" value="1"/>
<param name="cfBase.7" value="1"/>
<param name="cfBase.8" value="1"/>
<param name="cfBase.9" value="1"/>
<param name="cfBase.10" value="1"/>
<param name="cfBase.11" value="1"/>
<param name="cfBase.12" value="1"/>
<param name="cfBase.13" value="1"/>
<param name="cfBase.14" value="1"/>
<param name="cfBase.15" value="1"/>
<param name="cfBase.16" value="0"/>
<param name="mnVias" value="20"/>
<param name="mnSegments" value="9999"/>
<param name="mnExtdSteps" value="9999"/>
<param name="mnRipupLevel" value="10"/>
<param name="mnRipupSteps" value="100"/>
<param name="mnRipupTotal" value="100"/>
</pass>
<pass name="Follow-me" refer="Default" active="yes">
</pass>
<pass name="Busses" refer="Default" active="yes">
<param name="cfNonPref" value="4"/>
<param name="cfBusImpact" value="4"/>
<param name="cfHugging" value="0"/>
<param name="mnVias" value="0"/>
</pass>
<pass name="Route" refer="Default" active="yes">
</pass>
<pass name="Optimize1" refer="Default" active="yes">
<param name="cfVia" value="99"/>
<param name="cfExtdStep" value="10"/>
<param name="cfHugging" value="1"/>
<param name="mnExtdSteps" value="1"/>
<param name="mnRipupLevel" value="0"/>
</pass>
<pass name="Optimize2" refer="Optimize1" active="yes">
<param name="cfNonPref" value="0"/>
<param name="cfChangeDir" value="6"/>
<param name="cfExtdStep" value="0"/>
<param name="cfBonusStep" value="2"/>
<param name="cfMalusStep" value="2"/>
<param name="cfPadImpact" value="2"/>
<param name="cfSmdImpact" value="2"/>
<param name="cfHugging" value="0"/>
</pass>
<pass name="Optimize3" refer="Optimize2" active="yes">
<param name="cfChangeDir" value="8"/>
<param name="cfPadImpact" value="0"/>
<param name="cfSmdImpact" value="0"/>
</pass>
<pass name="Optimize4" refer="Optimize3" active="yes">
<param name="cfChangeDir" value="25"/>
</pass>
</autorouter>
<elements>
<element name="C1" library="Standard" package="CAPC1005X30" package3d_urn="urn:adsk.eagle:package:11214499/1" value="1µF" x="12.7" y="34.925" smashed="yes" rot="R270">
<attribute name="NAME" x="13.1929" y="34.925" size="0.6096" layer="25" rot="R270" align="bottom-center"/>
<attribute name="VALUE" x="12.2071" y="34.925" size="0.6096" layer="27" rot="R270" align="top-center"/>
</element>
<element name="C10" library="Standard" package="CAPC1005X30" package3d_urn="urn:adsk.eagle:package:11214499/1" value="100nF" x="32.385" y="33.655" smashed="yes">
<attribute name="NAME" x="32.385" y="34.1479" size="0.6096" layer="25" align="bottom-center"/>
<attribute name="VALUE" x="32.385" y="33.1621" size="0.6096" layer="27" align="top-center"/>
</element>
<element name="C11" library="BMS_PD" package="CAPC3216X160" package3d_urn="urn:adsk.eagle:package:11819311/1" value="100µF" x="27.94" y="11.43" smashed="yes" rot="R90">
<attribute name="NAME" x="26.7701" y="11.43" size="0.6096" layer="25" font="vector" rot="R90" align="bottom-center"/>
<attribute name="VALUE" x="29.1099" y="11.43" size="0.6096" layer="27" font="vector" rot="R90" align="top-center"/>
</element>
<element name="C12" library="BMS_PD" package="CAPC3216X160" package3d_urn="urn:adsk.eagle:package:11819311/1" value="100µF" x="30.48" y="11.43" smashed="yes" rot="R90">
<attribute name="NAME" x="29.3101" y="11.43" size="0.6096" layer="25" font="vector" rot="R90" align="bottom-center"/>
<attribute name="VALUE" x="31.6499" y="11.43" size="0.6096" layer="27" font="vector" rot="R90" align="top-center"/>
</element>
<element name="C13" library="Standard" package="CAPC1005X30" package3d_urn="urn:adsk.eagle:package:11214499/1" value="1µF" x="24.60625" y="36.83" smashed="yes" rot="R180">
<attribute name="NAME" x="24.60625" y="35.6601" size="0.6096" layer="25" font="vector" rot="R180" align="bottom-center"/>
<attribute name="VALUE" x="24.60625" y="37.9999" size="0.6096" layer="27" font="vector" rot="R180" align="top-center"/>
</element>
<element name="C2" library="Standard" package="CAPC1005X30" package3d_urn="urn:adsk.eagle:package:11214499/1" value="10nF" x="22.86" y="34.6075" smashed="yes" rot="R90">
<attribute name="NAME" x="22.3671" y="34.6075" size="0.6096" layer="25" rot="R90" align="bottom-center"/>
<attribute name="VALUE" x="23.3529" y="34.6075" size="0.6096" layer="27" rot="R90" align="top-center"/>
</element>
<element name="C3" library="Standard" package="CAPC1005X30" package3d_urn="urn:adsk.eagle:package:11214499/1" value="1µF" x="10.16" y="38.1" smashed="yes" rot="R270">
<attribute name="NAME" x="10.6529" y="38.1" size="0.6096" layer="25" rot="R270" align="bottom-center"/>
<attribute name="VALUE" x="9.6671" y="38.1" size="0.6096" layer="27" rot="R270" align="top-center"/>
</element>
<element name="C4" library="Standard" package="CAPC1005X30" package3d_urn="urn:adsk.eagle:package:11214499/1" value="100nF" x="13.335" y="39.37" smashed="yes" rot="R180">
<attribute name="NAME" x="13.335" y="38.8771" size="0.6096" layer="25" rot="R180" align="bottom-center"/>
<attribute name="VALUE" x="13.335" y="39.8629" size="0.6096" layer="27" rot="R180" align="top-center"/>
</element>
<element name="C5" library="BMS_PD" package="CAPC3216X160" package3d_urn="urn:adsk.eagle:package:11819311/1" value="100µF" x="15.24" y="11.43" smashed="yes" rot="R90">
<attribute name="NAME" x="14.0701" y="11.43" size="0.6096" layer="25" font="vector" rot="R90" align="bottom-center"/>
<attribute name="VALUE" x="16.4099" y="11.43" size="0.6096" layer="27" font="vector" rot="R90" align="top-center"/>
</element>
<element name="C6" library="BMS_PD" package="CAPC3216X160" package3d_urn="urn:adsk.eagle:package:11819311/1" value="100µF" x="17.78" y="11.43" smashed="yes" rot="R90">
<attribute name="NAME" x="16.6101" y="11.43" size="0.6096" layer="25" font="vector" rot="R90" align="bottom-center"/>
<attribute name="VALUE" x="18.9499" y="11.43" size="0.6096" layer="27" font="vector" rot="R90" align="top-center"/>
</element>
<element name="C7" library="Standard" package="CAPC1005X30" package3d_urn="urn:adsk.eagle:package:11214499/1" value="1µF" x="33.02" y="38.1" smashed="yes" rot="R90">
<attribute name="NAME" x="32.5271" y="38.1" size="0.6096" layer="25" rot="R90" align="bottom-center"/>
<attribute name="VALUE" x="33.5129" y="38.1" size="0.6096" layer="27" rot="R90" align="top-center"/>
</element>
<element name="C8" library="Standard" package="CAPC1005X30" package3d_urn="urn:adsk.eagle:package:11214499/1" value="1µF" x="21.11375" y="36.83" smashed="yes">
<attribute name="NAME" x="21.11375" y="37.9999" size="0.6096" layer="25" font="vector" align="bottom-center"/>
<attribute name="VALUE" x="21.11375" y="35.6601" size="0.6096" layer="27" font="vector" align="top-center"/>
</element>
<element name="C9" library="Standard" package="CAPC1005X30" package3d_urn="urn:adsk.eagle:package:11214499/1" value="1µF" x="35.56" y="38.1" smashed="yes" rot="R270">
<attribute name="NAME" x="36.0529" y="38.1" size="0.6096" layer="25" rot="R270" align="bottom-center"/>
<attribute name="VALUE" x="35.0671" y="38.1" size="0.6096" layer="27" rot="R270" align="top-center"/>
</element>
<element name="IC1" library="BMS_PD" package="QFN50P400X400X80-21T275" package3d_urn="urn:adsk.eagle:package:11816611/1" value="ADP1853" x="16.51" y="36.83" smashed="yes" rot="R90">
<attribute name="NAME" x="13.5104" y="36.83" size="0.6096" layer="25" rot="R90" align="bottom-center"/>
<attribute name="VALUE" x="19.5096" y="36.83" size="1.27" layer="27" rot="R90" align="top-center"/>
</element>
<element name="IC2" library="BMS_PD" package="QFN50P400X400X80-21T275" package3d_urn="urn:adsk.eagle:package:11816611/1" value="ADP1853" x="29.21" y="36.83" smashed="yes" rot="R270">
<attribute name="NAME" x="32.2096" y="36.83" size="0.6096" layer="25" rot="R270" align="bottom-center"/>
<attribute name="VALUE" x="26.2104" y="36.83" size="1.27" layer="27" rot="R270" align="top-center"/>
</element>
<element name="L1" library="BMS_PD" package="L_100115" value="1µH" x="16.51" y="25.4" smashed="yes" rot="R90">
<attribute name="NAME" x="12.26" y="20.15" size="0.6096" layer="25" font="vector" rot="R90"/>
<attribute name="VALUE" x="21.26" y="19.9" size="0.6096" layer="27" font="vector" rot="R90"/>
</element>
<element name="L2" library="BMS_PD" package="L_100115" value="1µH" x="29.21" y="25.4" smashed="yes" rot="R90">
<attribute name="NAME" x="24.96" y="20.15" size="0.6096" layer="25" font="vector" rot="R90"/>
<attribute name="VALUE" x="33.96" y="19.9" size="0.6096" layer="27" font="vector" rot="R90"/>
</element>
<element name="M1" library="BMS_PD" package="PG-TDSON-8" value="BSC010NE2LS" x="6.35" y="24.765" smashed="yes" rot="R270">
<attribute name="NAME" x="9.2075" y="28.2575" size="0.6096" layer="25" font="vector" rot="R270"/>
<attribute name="VALUE" x="2.8575" y="28.2575" size="0.6096" layer="27" font="vector" rot="R270"/>
</element>
<element name="M2" library="BMS_PD" package="PG-TDSON-8" value="BSC010NE2LS" x="6.35" y="35.56" smashed="yes" rot="R270">
<attribute name="NAME" x="9.2075" y="39.0525" size="0.6096" layer="25" font="vector" rot="R270"/>
<attribute name="VALUE" x="2.8575" y="39.0525" size="0.6096" layer="27" font="vector" rot="R270"/>
</element>
<element name="M3" library="BMS_PD" package="PG-TDSON-8" value="BSC010NE2LS" x="39.37" y="24.765" smashed="yes" rot="R270">
<attribute name="NAME" x="42.2275" y="28.2575" size="0.6096" layer="25" font="vector" rot="R270"/>
<attribute name="VALUE" x="35.8775" y="28.2575" size="0.6096" layer="27" font="vector" rot="R270"/>
</element>
<element name="M4" library="BMS_PD" package="PG-TDSON-8" value="BSC010NE2LS" x="39.37" y="35.56" smashed="yes" rot="R270">
<attribute name="NAME" x="42.2275" y="39.0525" size="0.6096" layer="25" font="vector" rot="R270"/>
<attribute name="VALUE" x="35.8775" y="39.0525" size="0.6096" layer="27" font="vector" rot="R270"/>
</element>
<element name="R1" library="Standard" package="RESC1005X30" package3d_urn="urn:adsk.eagle:package:11214492/1" value="" x="11.43" y="38.1" smashed="yes" rot="R270">
<attribute name="NAME" x="11.9229" y="38.1" size="0.6096" layer="25" rot="R270" align="bottom-center"/>
<attribute name="VALUE" x="10.9371" y="38.1" size="0.6096" layer="27" rot="R270" align="top-center"/>
</element>
<element name="R2" library="Standard" package="RESC1005X30" package3d_urn="urn:adsk.eagle:package:11214492/1" value="10k" x="12.7" y="38.1" smashed="yes" rot="R90">
<attribute name="NAME" x="12.2071" y="38.1" size="0.6096" layer="25" rot="R90" align="bottom-center"/>
<attribute name="VALUE" x="13.1929" y="38.1" size="0.6096" layer="27" rot="R90" align="top-center"/>
</element>
<element name="R3" library="Standard" package="RESC1005X30" package3d_urn="urn:adsk.eagle:package:11214492/1" value="22k" x="21.11375" y="34.925" smashed="yes">
<attribute name="NAME" x="21.11375" y="35.4179" size="0.6096" layer="25" align="bottom-center"/>
<attribute name="VALUE" x="21.11375" y="34.4321" size="0.6096" layer="27" align="top-center"/>
</element>
<element name="R4" library="Standard" package="RESC1005X30" package3d_urn="urn:adsk.eagle:package:11214492/1" value="1k" x="15.5575" y="33.02" smashed="yes" rot="R180">
<attribute name="NAME" x="15.5575" y="32.5271" size="0.6096" layer="25" rot="R180" align="bottom-center"/>
<attribute name="VALUE" x="15.5575" y="33.5129" size="0.6096" layer="27" rot="R180" align="top-center"/>
</element>
<element name="R5" library="Standard" package="RESC1005X30" package3d_urn="urn:adsk.eagle:package:11214492/1" value="13k" x="17.4625" y="33.02" smashed="yes" rot="R180">
<attribute name="NAME" x="17.4625" y="32.5271" size="0.6096" layer="25" rot="R180" align="bottom-center"/>
<attribute name="VALUE" x="17.4625" y="33.5129" size="0.6096" layer="27" rot="R180" align="top-center"/>
</element>
<element name="R6" library="Standard" package="RESC1005X30" package3d_urn="urn:adsk.eagle:package:11214492/1" value="" x="34.29" y="38.1" smashed="yes" rot="R270">
<attribute name="NAME" x="34.7829" y="38.1" size="0.6096" layer="25" rot="R270" align="bottom-center"/>
<attribute name="VALUE" x="33.7971" y="38.1" size="0.6096" layer="27" rot="R270" align="top-center"/>
</element>
<element name="R7" library="Standard" package="RESC1005X30" package3d_urn="urn:adsk.eagle:package:11214492/1" value="10k" x="33.02" y="34.925" smashed="yes" rot="R270">
<attribute name="NAME" x="33.5129" y="34.925" size="0.6096" layer="25" rot="R270" align="bottom-center"/>
<attribute name="VALUE" x="32.5271" y="34.925" size="0.6096" layer="27" rot="R270" align="top-center"/>
</element>
<element name="R8" library="Standard" package="RESC1005X30" package3d_urn="urn:adsk.eagle:package:11214492/1" value="22k" x="24.60625" y="34.925" smashed="yes" rot="R180">
<attribute name="NAME" x="24.60625" y="34.4321" size="0.6096" layer="25" rot="R180" align="bottom-center"/>
<attribute name="VALUE" x="24.60625" y="35.4179" size="0.6096" layer="27" rot="R180" align="top-center"/>
</element>
</elements>
<signals>
<signal name="N$1">
<contactref element="IC1" pad="18"/>
<contactref element="R1" pad="2"/>
<wire x1="14.5754" y1="36.83" x2="13.6525" y2="36.83" width="0.2032" layer="1"/>
<wire x1="11.7475" y1="36.195" x2="11.43" y2="36.5125" width="0.2032" layer="1"/>
<wire x1="11.43" y1="36.5125" x2="11.43" y2="37.6" width="0.2032" layer="1"/>
<wire x1="13.6525" y1="36.83" x2="13.0175" y2="36.195" width="0.2032" layer="1"/>
<wire x1="13.0175" y1="36.195" x2="11.7475" y2="36.195" width="0.2032" layer="1"/>
</signal>
<signal name="N$3">
<contactref element="IC1" pad="20"/>
<contactref element="C1" pad="1"/>
<contactref element="IC1" pad="9"/>
<contactref element="IC1" pad="6"/>
<contactref element="IC1" pad="19"/>
<wire x1="12.7" y1="35.425" x2="13.5175" y2="35.425" width="0.2032" layer="1"/>
<wire x1="13.9225" y1="35.83" x2="14.5754" y2="35.83" width="0.2032" layer="1"/>
<wire x1="13.5175" y1="35.425" x2="13.6525" y2="35.56" width="0.2032" layer="1"/>
<wire x1="13.6525" y1="35.56" x2="13.9225" y2="35.83" width="0.2032" layer="1"/>
<wire x1="14.5754" y1="35.83" x2="14.5754" y2="36.33" width="0.2032" layer="1"/>
<wire x1="19.3675" y1="35.56" x2="19.0975" y2="35.83" width="0.2032" layer="1"/>
<wire x1="19.0975" y1="35.83" x2="18.4446" y2="35.83" width="0.2032" layer="1"/>
<via x="19.3675" y="35.56" extent="1-16" drill="0.3"/>
<wire x1="19.3675" y1="35.56" x2="19.3675" y2="36.5125" width="0.2032" layer="16"/>
<wire x1="19.3675" y1="36.5125" x2="14.605" y2="36.5125" width="0.2032" layer="16"/>
<wire x1="14.605" y1="36.5125" x2="13.6525" y2="35.56" width="0.2032" layer="16"/>
<via x="13.6525" y="35.56" extent="1-16" drill="0.3"/>
<wire x1="19.3675" y1="37.62375" x2="19.3675" y2="35.56" width="0.2032" layer="16"/>
<via x="19.3675" y="37.62375" extent="1-16" drill="0.3"/>
<wire x1="19.3675" y1="37.62375" x2="19.07375" y2="37.33" width="0.2032" layer="1"/>
<wire x1="19.07375" y1="37.33" x2="18.4446" y2="37.33" width="0.2032" layer="1"/>
</signal>
<signal name="GND">
<contactref element="C2" pad="2"/>
<contactref element="C1" pad="2"/>
<contactref element="R4" pad="2"/>
<contactref element="C3" pad="2"/>
<contactref element="C7" pad="2"/>
<contactref element="C9" pad="2"/>
<contactref element="IC1" pad="5"/>
<contactref element="IC1" pad="10"/>
<contactref element="IC1" pad="21"/>
<contactref element="C8" pad="2"/>
<contactref element="C13" pad="2"/>
<contactref element="IC2" pad="5"/>
<contactref element="IC2" pad="10"/>
<contactref element="IC2" pad="21"/>
<polygon width="0.1524" layer="1" isolate="0.254" thermals="no" rank="2">
<vertex x="2.54" y="3.175"/>
<vertex x="43.18" y="3.175"/>
<vertex x="43.18" y="50.8"/>
<vertex x="2.54" y="50.8"/>
</polygon>
<polygon width="0.2032" layer="16" isolate="0.254" thermals="no" rank="2">
<vertex x="2.54" y="3.175"/>
<vertex x="43.18" y="3.175"/>
<vertex x="43.18" y="50.8"/>
<vertex x="2.54" y="50.8"/>
</polygon>
<via x="10.95375" y="35.71875" extent="1-16" drill="0.3"/>
<via x="13.97" y="33.81375" extent="1-16" drill="0.3"/>
<via x="18.415" y="34.925" extent="1-16" drill="0.3"/>
<via x="24.765" y="35.8775" extent="1-16" drill="0.3"/>
<via x="35.40125" y="36.195" extent="1-16" drill="0.3"/>
<via x="32.86125" y="39.37" extent="1-16" drill="0.3"/>
<wire x1="33.02" y1="38.6" x2="32.86125" y2="38.6" width="0.2032" layer="1"/>
<wire x1="32.86125" y1="38.6" x2="32.86125" y2="39.37" width="0.2032" layer="1"/>
<via x="22.86" y="35.8775" extent="1-16" drill="0.3"/>
<via x="21.510625" y="37.94125" extent="1-16" drill="0.3"/>
</signal>
<signal name="N$7">
<contactref element="IC1" pad="11"/>
<contactref element="M1" pad="4"/>
<contactref element="R3" pad="1"/>
<via x="20.6375" y="31.90875" extent="1-16" drill="0.3"/>
<wire x1="20.6375" y1="31.90875" x2="20.6375" y2="25.0825" width="0.4064" layer="16"/>
<wire x1="20.6375" y1="25.0825" x2="17.62125" y2="22.06625" width="0.4064" layer="16"/>
<wire x1="17.62125" y1="22.06625" x2="11.58875" y2="22.06625" width="0.4064" layer="16"/>
<via x="11.58875" y="22.06625" extent="1-16" drill="0.3"/>
<wire x1="11.58875" y1="22.06625" x2="11.4625" y2="21.94" width="0.4064" layer="1"/>
<wire x1="11.4625" y1="21.94" x2="8.255" y2="21.94" width="0.4064" layer="1"/>
<wire x1="17.51" y1="38.7646" x2="21.8779" y2="38.7646" width="0.4064" layer="1"/>
<wire x1="21.8779" y1="38.7646" x2="22.225" y2="38.4175" width="0.4064" layer="1"/>
<wire x1="22.225" y1="38.4175" x2="22.225" y2="36.195" width="0.4064" layer="1"/>
<wire x1="22.225" y1="36.195" x2="21.9075" y2="35.8775" width="0.4064" layer="1"/>
<wire x1="21.9075" y1="35.8775" x2="21.11375" y2="35.8775" width="0.4064" layer="1"/>
<wire x1="21.11375" y1="35.8775" x2="20.61375" y2="35.3775" width="0.4064" layer="1"/>
<wire x1="20.61375" y1="35.3775" x2="20.61375" y2="34.925" width="0.4064" layer="1"/>
<wire x1="20.61375" y1="34.925" x2="20.6375" y2="34.90125" width="0.4064" layer="1"/>
<wire x1="20.6375" y1="34.90125" x2="20.6375" y2="31.90875" width="0.4064" layer="1"/>
</signal>
<signal name="N$8">
<contactref element="IC1" pad="16"/>
<contactref element="R2" pad="1"/>
<wire x1="14.5754" y1="37.83" x2="13.85875" y2="37.83" width="0.2032" layer="1"/>
<wire x1="13.62875" y1="37.6" x2="12.7" y2="37.6" width="0.2032" layer="1"/>
<wire x1="13.85875" y1="37.83" x2="13.62875" y2="37.6" width="0.2032" layer="1"/>
</signal>
<signal name="N$4">
<contactref element="IC1" pad="14"/>
<contactref element="M2" pad="4"/>
<wire x1="16.01" y1="38.7646" x2="16.01" y2="39.3287875" width="0.4064" layer="1"/>
<wire x1="16.01" y1="39.3287875" x2="15.6234875" y2="39.7153" width="0.4064" layer="1"/>
<via x="15.6234875" y="39.7153" extent="1-16" drill="0.3"/>
<wire x1="15.6234875" y1="39.7153" x2="9.8703" y2="39.7153" width="0.4064" layer="16"/>
<wire x1="9.8703" y1="39.7153" x2="9.36625" y2="39.21125" width="0.4064" layer="16"/>
<wire x1="9.36625" y1="39.21125" x2="9.36625" y2="32.86125" width="0.4064" layer="16"/>
<via x="9.36625" y="32.86125" extent="1-16" drill="0.3"/>
<wire x1="9.36625" y1="32.86125" x2="9.24" y2="32.735" width="0.4064" layer="1"/>
<wire x1="9.24" y1="32.735" x2="8.255" y2="32.735" width="0.4064" layer="1"/>
</signal>
<signal name="N$5">
<contactref element="C4" pad="1"/>
<contactref element="IC1" pad="15"/>
<wire x1="13.835" y1="39.37" x2="14.44625" y2="39.37" width="0.2032" layer="1"/>
<wire x1="15.05165" y1="38.7646" x2="15.51" y2="38.7646" width="0.2032" layer="1"/>
<wire x1="14.44625" y1="39.37" x2="15.05165" y2="38.7646" width="0.2032" layer="1"/>
</signal>
<signal name="N$9">
<contactref element="C4" pad="2"/>
<contactref element="IC1" pad="13"/>
<contactref element="IC1" pad="12"/>
<contactref element="R2" pad="2"/>
<contactref element="M1" pad="5"/>
<contactref element="M1" pad="6"/>
<contactref element="M1" pad="7"/>
<contactref element="M1" pad="8"/>
<contactref element="M2" pad="1"/>
<contactref element="M2" pad="2"/>
<contactref element="M2" pad="3"/>
<contactref element="L1" pad="P$2"/>
<polygon width="0.1524" layer="1" thermals="no">
<vertex x="4.1275" y="33.3375"/>
<vertex x="4.1275" y="23.1775"/>
<vertex x="13.6525" y="23.1775"/>
<vertex x="18.7325" y="28.2575"/>
<vertex x="18.7325" y="32.0675"/>
<vertex x="8.89" y="32.0675"/>
<vertex x="7.62" y="33.3375"/>
</polygon>
<wire x1="12.7" y1="38.6" x2="12.7" y2="39.235" width="0.2032" layer="1"/>
<wire x1="12.7" y1="39.235" x2="12.835" y2="39.37" width="0.2032" layer="1"/>
<wire x1="17.01" y1="38.7646" x2="16.51" y2="38.7646" width="0.2032" layer="1"/>
<wire x1="16.51" y1="38.7646" x2="16.51" y2="39.6875" width="0.2032" layer="1"/>
<wire x1="15.875" y1="40.3225" x2="13.335" y2="40.3225" width="0.2032" layer="1"/>
<wire x1="13.335" y1="40.3225" x2="12.835" y2="39.8225" width="0.2032" layer="1"/>
<wire x1="12.835" y1="39.8225" x2="12.835" y2="39.37" width="0.2032" layer="1"/>
<wire x1="16.51" y1="39.6875" x2="15.875" y2="40.3225" width="0.2032" layer="1"/>
<wire x1="6.985" y1="32.735" x2="6.985" y2="33.49625" width="0.2032" layer="1"/>
<wire x1="6.985" y1="33.49625" x2="7.14375" y2="33.655" width="0.2032" layer="1"/>
<wire x1="7.14375" y1="33.655" x2="10.31875" y2="33.655" width="0.2032" layer="1"/>
<via x="10.31875" y="33.655" extent="1-16" drill="0.3"/>
<wire x1="10.31875" y1="33.655" x2="10.31875" y2="38.1" width="0.2032" layer="16"/>
<wire x1="10.31875" y1="38.1" x2="10.795" y2="38.57625" width="0.2032" layer="16"/>
<wire x1="10.795" y1="38.57625" x2="13.7935" y2="38.57625" width="0.2032" layer="16"/>
<wire x1="13.7935" y1="38.57625" x2="13.81125" y2="38.5585" width="0.2032" layer="16"/>
<via x="13.81125" y="38.5585" extent="1-16" drill="0.3"/>
<wire x1="13.81125" y1="38.5585" x2="13.76975" y2="38.6" width="0.2032" layer="1"/>
<wire x1="13.76975" y1="38.6" x2="12.7" y2="38.6" width="0.2032" layer="1"/>
</signal>
<signal name="PGND">
<contactref element="M1" pad="1"/>
<contactref element="M1" pad="2"/>
<contactref element="M1" pad="3"/>
<contactref element="R3" pad="2"/>
<contactref element="C5" pad="1"/>
<contactref element="C6" pad="1"/>
<contactref element="M3" pad="1"/>
<contactref element="M3" pad="2"/>
<contactref element="M3" pad="3"/>
<contactref element="R8" pad="2"/>
<contactref element="C11" pad="1"/>
<contactref element="C12" pad="1"/>
<polygon width="0.1524" layer="1" thermals="no">
<vertex x="4.1275" y="22.5425"/>
<vertex x="4.1275" y="7.62"/>
<vertex x="8.5725" y="3.175"/>
<vertex x="37.1475" y="3.175"/>
<vertex x="41.5925" y="7.62"/>
<vertex x="41.5925" y="22.5425"/>
<vertex x="37.1475" y="22.5425"/>
<vertex x="33.655" y="19.05"/>
<vertex x="33.655" y="13.0175"/>
<vertex x="32.0675" y="11.43"/>
<vertex x="13.6525" y="11.43"/>
<vertex x="12.065" y="13.0175"/>
<vertex x="12.065" y="19.05"/>
<vertex x="8.5725" y="22.5425"/>
</polygon>
<wire x1="21.61375" y1="34.925" x2="21.59" y2="34.90125" width="0.2032" layer="1"/>
<wire x1="21.59" y1="34.90125" x2="21.59" y2="32.7025" width="0.2032" layer="1"/>
<wire x1="21.59" y1="32.7025" x2="22.225" y2="32.0675" width="0.2032" layer="1"/>
<wire x1="24.10625" y1="34.925" x2="24.10625" y2="32.0675" width="0.2032" layer="1"/>
<wire x1="22.225" y1="32.0675" x2="24.10625" y2="32.0675" width="0.2032" layer="1"/>
<wire x1="24.10625" y1="32.0675" x2="24.9" y2="32.0675" width="0.2032" layer="1"/>
<wire x1="24.9" y1="32.0675" x2="24.9" y2="29.55125" width="0.2032" layer="1"/>
<wire x1="32.51125" y1="21.94" x2="37.465" y2="21.94" width="0.2032" layer="1"/>
<wire x1="24.9" y1="29.55125" x2="32.51125" y2="21.94" width="0.2032" layer="1"/>
</signal>
<signal name="N$10">
<contactref element="IC1" pad="3"/>
<contactref element="R4" pad="1"/>
<contactref element="R5" pad="2"/>
<wire x1="16.9625" y1="33.02" x2="16.51" y2="33.02" width="0.2032" layer="1"/>
<wire x1="16.51" y1="33.02" x2="16.0575" y2="33.02" width="0.2032" layer="1"/>
<wire x1="16.51" y1="33.02" x2="16.51" y2="34.8954" width="0.2032" layer="1"/>
</signal>
<signal name="VBAT">
<contactref element="C6" pad="2"/>
<contactref element="C5" pad="2"/>
<contactref element="L1" pad="P$1"/>
<contactref element="R5" pad="1"/>
<contactref element="C12" pad="2"/>
<contactref element="C11" pad="2"/>
<contactref element="L2" pad="P$1"/>
<polygon width="0.1524" layer="1" thermals="no">
<vertex x="14.2875" y="22.5425"/>
<vertex x="12.7" y="20.955"/>
<vertex x="12.7" y="13.335"/>
<vertex x="13.97" y="12.065"/>
<vertex x="31.75" y="12.065"/>
<vertex x="33.02" y="13.335"/>
<vertex x="33.02" y="20.955"/>
<vertex x="31.4325" y="22.5425"/>
</polygon>
<via x="23.8125" y="21.59" extent="1-16" drill="0.65"/>
<via x="21.2725" y="21.59" extent="1-16" drill="0.65"/>
<via x="22.5425" y="21.59" extent="1-16" drill="0.65"/>
<via x="25.0825" y="21.59" extent="1-16" drill="0.65"/>
<via x="25.0825" y="19.685" extent="1-16" drill="0.65"/>
<via x="23.8125" y="19.685" extent="1-16" drill="0.65"/>
<via x="22.5425" y="19.685" extent="1-16" drill="0.65"/>
<via x="21.2725" y="19.685" extent="1-16" drill="0.65"/>
<via x="20.0025" y="17.78" extent="1-16" drill="0.65"/>
<via x="21.2725" y="17.78" extent="1-16" drill="0.65"/>
<via x="22.5425" y="17.78" extent="1-16" drill="0.65"/>
<via x="23.8125" y="17.78" extent="1-16" drill="0.65"/>
<via x="25.0825" y="17.78" extent="1-16" drill="0.65"/>
<via x="26.3525" y="17.78" extent="1-16" drill="0.65"/>
<via x="26.3525" y="15.5575" extent="1-16" drill="0.65"/>
<via x="25.0825" y="15.5575" extent="1-16" drill="0.65"/>
<via x="23.8125" y="15.5575" extent="1-16" drill="0.65"/>
<via x="22.5425" y="15.5575" extent="1-16" drill="0.65"/>
<via x="21.2725" y="15.5575" extent="1-16" drill="0.65"/>
<via x="20.0025" y="15.5575" extent="1-16" drill="0.65"/>
<via x="20.0025" y="13.6525" extent="1-16" drill="0.65"/>
<via x="21.2725" y="13.6525" extent="1-16" drill="0.65"/>
<via x="22.5425" y="13.6525" extent="1-16" drill="0.65"/>
<via x="23.8125" y="13.6525" extent="1-16" drill="0.65"/>
<via x="25.0825" y="13.6525" extent="1-16" drill="0.65"/>
<via x="26.3525" y="13.6525" extent="1-16" drill="0.65"/>
<wire x1="17.9625" y1="33.02" x2="18.57375" y2="33.02" width="0.2032" layer="1"/>
<wire x1="18.57375" y1="33.02" x2="19.05" y2="32.54375" width="0.2032" layer="1"/>
<wire x1="19.05" y1="32.54375" x2="19.05" y2="22.38375" width="0.2032" layer="1"/>
</signal>
<signal name="VCC">
<contactref element="C3" pad="1"/>
<contactref element="M2" pad="5"/>
<contactref element="M2" pad="6"/>
<contactref element="M2" pad="7"/>
<contactref element="M2" pad="8"/>
<contactref element="R1" pad="1"/>
<contactref element="IC1" pad="1"/>
<contactref element="C9" pad="1"/>
<contactref element="M4" pad="5"/>
<contactref element="M4" pad="6"/>
<contactref element="M4" pad="7"/>
<contactref element="M4" pad="8"/>
<contactref element="R6" pad="1"/>
<contactref element="IC2" pad="1"/>
<contactref element="C8" pad="1"/>
<contactref element="IC1" pad="8"/>
<contactref element="IC2" pad="8"/>
<contactref element="C13" pad="1"/>
<polygon width="0.1524" layer="1" thermals="no">
<vertex x="4.1275" y="33.9725"/>
<vertex x="8.5725" y="33.9725"/>
<vertex x="9.525" y="34.925"/>
<vertex x="9.525" y="37.7825"/>
<vertex x="10.16" y="38.4175"/>
<vertex x="11.7475" y="38.4175"/>
<vertex x="13.97" y="40.64"/>
<vertex x="31.75" y="40.64"/>
<vertex x="33.9725" y="38.4175"/>
<vertex x="35.56" y="38.4175"/>
<vertex x="36.195" y="37.7825"/>
<vertex x="36.195" y="34.925"/>
<vertex x="37.1475" y="33.9725"/>
<vertex x="41.5925" y="33.9725"/>
<vertex x="43.18" y="35.56"/>
<vertex x="43.18" y="45.72"/>
<vertex x="38.1" y="50.8"/>
<vertex x="7.62" y="50.8"/>
<vertex x="2.54" y="45.72"/>
<vertex x="2.54" y="35.56"/>
</polygon>
<wire x1="27.2754" y1="36.83" x2="25.10625" y2="36.83" width="0.3048" layer="1"/>
<wire x1="25.10625" y1="36.83" x2="25.10625" y2="37.75875" width="0.3048" layer="1"/>
<wire x1="25.10625" y1="37.75875" x2="25.0825" y2="37.7825" width="0.3048" layer="1"/>
<via x="25.0825" y="37.7825" extent="1-16" drill="0.3"/>
<wire x1="25.0825" y1="40.9575" x2="25.0825" y2="37.7825" width="0.3048" layer="16"/>
<via x="25.0825" y="40.9575" extent="1-16" drill="0.3"/>
<wire x1="30.21" y1="38.7646" x2="31.0854" y2="38.7646" width="0.2032" layer="1"/>
<wire x1="31.0854" y1="38.7646" x2="31.115" y2="38.735" width="0.2032" layer="1"/>
<via x="31.115" y="38.735" extent="1-16" drill="0.3"/>
<wire x1="31.115" y1="38.735" x2="33.655" y2="38.735" width="0.2032" layer="16"/>
<wire x1="33.655" y1="38.735" x2="34.29" y2="39.37" width="0.2032" layer="16"/>
<via x="34.29" y="39.37" extent="1-16" drill="0.3"/>
<wire x1="18.4446" y1="36.83" x2="20.61375" y2="36.83" width="0.3048" layer="1"/>
<wire x1="20.61375" y1="36.83" x2="20.61375" y2="37.9175" width="0.3048" layer="1"/>
<wire x1="20.61375" y1="37.9175" x2="20.6375" y2="37.94125" width="0.3048" layer="1"/>
<via x="20.6375" y="37.94125" extent="1-16" drill="0.3"/>
<wire x1="20.6375" y1="37.94125" x2="20.6375" y2="40.9575" width="0.3048" layer="16"/>
<via x="20.6375" y="40.9575" extent="1-16" drill="0.3"/>
<wire x1="9.39585" y1="34.8954" x2="9.36625" y2="34.925" width="0.1524" layer="1"/>
<wire x1="15.51" y1="34.8954" x2="13.1146875" y2="34.8954" width="0.1524" layer="1"/>
<wire x1="13.1146875" y1="34.8954" x2="13.1005875" y2="34.9095" width="0.1524" layer="1"/>
<wire x1="13.1005875" y1="34.9095" x2="12.2994125" y2="34.9095" width="0.1524" layer="1"/>
<wire x1="12.2994125" y1="34.9095" x2="12.2853125" y2="34.8954" width="0.1524" layer="1"/>
<wire x1="12.2853125" y1="34.8954" x2="9.39585" y2="34.8954" width="0.1524" layer="1"/>
</signal>
<signal name="N$2">
<contactref element="IC2" pad="18"/>
<contactref element="R6" pad="2"/>
<wire x1="32.0025375" y1="36.83" x2="32.1334875" y2="36.96095" width="0.2032" layer="1"/>
<wire x1="32.1334875" y1="36.96095" x2="34.10345" y2="36.96095" width="0.2032" layer="1"/>
<wire x1="34.29" y1="37.1475" x2="34.29" y2="37.6" width="0.2032" layer="1"/>
<wire x1="31.1446" y1="36.83" x2="32.0025375" y2="36.83" width="0.2032" layer="1"/>
<wire x1="34.10345" y1="36.96095" x2="34.29" y2="37.1475" width="0.2032" layer="1"/>
</signal>
<signal name="N$11">
<contactref element="IC2" pad="20"/>
<contactref element="C7" pad="1"/>
<contactref element="IC2" pad="9"/>
<contactref element="IC2" pad="19"/>
<contactref element="IC2" pad="3"/>
<wire x1="33.02" y1="37.6" x2="32.25" y2="37.6" width="0.2032" layer="1"/>
<wire x1="31.1446" y1="37.83" x2="32.02" y2="37.83" width="0.2032" layer="1"/>
<wire x1="32.25" y1="37.6" x2="32.02" y2="37.83" width="0.2032" layer="1"/>
<wire x1="31.1446" y1="37.33" x2="31.1446" y2="37.83" width="0.2032" layer="1"/>
<wire x1="32.02" y1="37.83" x2="32.02" y2="39.4175" width="0.2032" layer="1"/>
<wire x1="31.115" y1="40.3225" x2="29.21" y2="40.3225" width="0.2032" layer="1"/>
<wire x1="29.21" y1="38.7646" x2="29.21" y2="40.3225" width="0.2032" layer="1"/>
<wire x1="32.02" y1="39.4175" x2="31.115" y2="40.3225" width="0.2032" layer="1"/>
<wire x1="29.21" y1="40.3225" x2="26.82875" y2="40.3225" width="0.2032" layer="1"/>
<wire x1="26.82875" y1="40.3225" x2="26.51125" y2="40.005" width="0.2032" layer="1"/>
<via x="26.51125" y="39.0803" extent="1-16" drill="0.3"/>
<wire x1="26.67" y1="38.92155" x2="26.51125" y2="39.0803" width="0.2032" layer="16"/>
<wire x1="26.67" y1="38.92155" x2="26.67" y2="36.64825" width="0.2032" layer="16"/>
<wire x1="26.67" y1="36.64825" x2="26.19375" y2="36.172" width="0.2032" layer="16"/>
<via x="26.19375" y="36.172" extent="1-16" drill="0.3"/>
<wire x1="26.19375" y1="36.172" x2="26.35175" y2="36.33" width="0.2032" layer="1"/>
<wire x1="26.35175" y1="36.33" x2="27.2754" y2="36.33" width="0.2032" layer="1"/>
<wire x1="26.51125" y1="40.005" x2="26.51125" y2="39.0803" width="0.2032" layer="1"/>
</signal>
<signal name="N$13">
<contactref element="IC2" pad="11"/>
<contactref element="M3" pad="4"/>
<contactref element="R8" pad="1"/>
<wire x1="25.10625" y1="34.925" x2="28.1804" y2="34.925" width="0.2032" layer="1"/>
<wire x1="28.1804" y1="34.925" x2="28.21" y2="34.8954" width="0.2032" layer="1"/>
<wire x1="28.21" y1="34.8954" x2="28.21" y2="33.0675" width="0.4064" layer="1"/>
<wire x1="28.21" y1="33.0675" x2="28.2575" y2="33.02" width="0.4064" layer="1"/>
<via x="28.2575" y="33.02" extent="1-16" drill="0.3"/>
<wire x1="28.2575" y1="33.02" x2="28.2575" y2="24.4475" width="0.4064" layer="16"/>
<wire x1="28.2575" y1="24.4475" x2="29.5275" y2="23.1775" width="0.4064" layer="16"/>
<wire x1="29.5275" y1="23.1775" x2="42.38625" y2="23.1775" width="0.4064" layer="16"/>
<via x="42.38625" y="23.1775" extent="1-16" drill="0.3"/>
<wire x1="42.38625" y1="23.1775" x2="42.38625" y2="22.225" width="0.4064" layer="1"/>
<wire x1="42.10125" y1="21.94" x2="41.275" y2="21.94" width="0.4064" layer="1"/>
<wire x1="42.38625" y1="22.225" x2="42.10125" y2="21.94" width="0.4064" layer="1"/>
</signal>
<signal name="N$14">
<contactref element="IC2" pad="16"/>
<contactref element="R7" pad="1"/>
<wire x1="33.02" y1="35.425" x2="32.2025" y2="35.425" width="0.2032" layer="1"/>
<wire x1="31.7975" y1="35.83" x2="31.1446" y2="35.83" width="0.2032" layer="1"/>
<wire x1="32.2025" y1="35.425" x2="31.7975" y2="35.83" width="0.2032" layer="1"/>
</signal>
<signal name="N$15">
<contactref element="IC2" pad="14"/>
<contactref element="M4" pad="4"/>
<wire x1="29.71" y1="34.8954" x2="29.71" y2="33.4725" width="0.4064" layer="1"/>
<wire x1="29.71" y1="33.4725" x2="29.845" y2="33.3375" width="0.4064" layer="1"/>
<via x="29.845" y="33.3375" extent="1-16" drill="0.3"/>
<wire x1="29.845" y1="33.3375" x2="41.91" y2="33.3375" width="0.4064" layer="16"/>
<wire x1="41.91" y1="33.3375" x2="42.38625" y2="32.86125" width="0.4064" layer="16"/>
<via x="42.38625" y="32.86125" extent="1-16" drill="0.3"/>
<wire x1="42.38625" y1="32.86125" x2="42.26" y2="32.735" width="0.4064" layer="1"/>
<wire x1="42.26" y1="32.735" x2="41.275" y2="32.735" width="0.4064" layer="1"/>
</signal>
<signal name="N$16">
<contactref element="C10" pad="1"/>
<contactref element="IC2" pad="15"/>
<wire x1="31.885" y1="33.655" x2="30.63875" y2="33.655" width="0.2032" layer="1"/>
<wire x1="30.21" y1="34.08375" x2="30.21" y2="34.8954" width="0.2032" layer="1"/>
<wire x1="30.63875" y1="33.655" x2="30.21" y2="34.08375" width="0.2032" layer="1"/>
</signal>
<signal name="N$17">
<contactref element="C10" pad="2"/>
<contactref element="IC2" pad="13"/>
<contactref element="IC2" pad="12"/>
<contactref element="R7" pad="2"/>
<contactref element="M3" pad="5"/>
<contactref element="M3" pad="6"/>
<contactref element="M3" pad="7"/>
<contactref element="M3" pad="8"/>
<contactref element="M4" pad="1"/>
<contactref element="M4" pad="2"/>
<contactref element="M4" pad="3"/>
<contactref element="L2" pad="P$2"/>
<polygon width="0.1524" layer="1" thermals="no">
<vertex x="41.5925" y="33.3375"/>
<vertex x="41.5925" y="23.1775"/>
<vertex x="32.0675" y="23.1775"/>
<vertex x="26.9875" y="28.2575"/>
<vertex x="26.9875" y="32.0675"/>
<vertex x="35.8775" y="32.0675"/>
<vertex x="37.1475" y="33.3375"/>
</polygon>
<wire x1="33.02" y1="34.425" x2="33.02" y2="33.79" width="0.2032" layer="1"/>
<wire x1="33.02" y1="33.79" x2="32.885" y2="33.655" width="0.2032" layer="1"/>
<wire x1="32.885" y1="33.655" x2="32.885" y2="32.7025" width="0.2032" layer="1"/>
<wire x1="32.885" y1="32.7025" x2="32.885" y2="31.9325" width="0.2032" layer="1"/>
<wire x1="32.885" y1="31.9325" x2="32.86125" y2="31.90875" width="0.2032" layer="1"/>
<wire x1="28.71" y1="34.8954" x2="29.21" y2="34.8954" width="0.2032" layer="1"/>
<wire x1="32.885" y1="32.7025" x2="29.5275" y2="32.7025" width="0.2032" layer="1"/>
<wire x1="29.5275" y1="32.7025" x2="29.21" y2="33.02" width="0.2032" layer="1"/>
<wire x1="29.21" y1="33.02" x2="29.21" y2="34.8954" width="0.2032" layer="1"/>
</signal>
<signal name="SS">
<contactref element="IC1" pad="2"/>
<contactref element="C2" pad="1"/>
<contactref element="IC2" pad="2"/>
<wire x1="29.71" y1="38.7646" x2="29.71" y2="39.5525" width="0.2032" layer="1"/>
<wire x1="29.71" y1="39.5525" x2="29.845" y2="39.6875" width="0.2032" layer="1"/>
<via x="29.845" y="39.6875" extent="1-16" drill="0.3"/>
<wire x1="29.845" y1="39.6875" x2="25.7405" y2="39.6875" width="0.2032" layer="16"/>
<via x="25.7405" y="39.6875" extent="1-16" drill="0.3"/>
<wire x1="25.7405" y1="39.6875" x2="24.13" y2="39.6875" width="0.2032" layer="1"/>
<wire x1="23.495" y1="39.0525" x2="23.495" y2="34.29" width="0.2032" layer="1"/>
<wire x1="23.495" y1="34.29" x2="23.3125" y2="34.1075" width="0.2032" layer="1"/>
<wire x1="23.3125" y1="34.1075" x2="22.86" y2="34.1075" width="0.2032" layer="1"/>
<wire x1="24.13" y1="39.6875" x2="23.495" y2="39.0525" width="0.2032" layer="1"/>
<wire x1="16.01" y1="34.8954" x2="16.01" y2="34.12525" width="0.2032" layer="1"/>
<wire x1="16.01" y1="34.12525" x2="15.71625" y2="33.8315" width="0.2032" layer="1"/>
<via x="15.71625" y="33.8315" extent="1-16" drill="0.3"/>
<wire x1="15.71625" y1="33.8315" x2="16.23805" y2="33.3097" width="0.2032" layer="16"/>
<wire x1="16.23805" y1="33.3097" x2="22.86" y2="33.3097" width="0.2032" layer="16"/>
<via x="22.86" y="33.3097" extent="1-16" drill="0.3"/>
<wire x1="22.86" y1="33.3097" x2="22.86" y2="34.1075" width="0.2032" layer="1"/>
</signal>
<signal name="CLK">
<contactref element="IC1" pad="7"/>
<contactref element="IC2" pad="6"/>
<via x="24.2237" y="38.1" extent="1-16" drill="0.3"/>
<wire x1="25.4927625" y1="38.3897" x2="24.6722375" y2="38.3897" width="0.2032" layer="1"/>
<wire x1="27.2754" y1="37.83" x2="26.0524625" y2="37.83" width="0.2032" layer="1"/>
<wire x1="24.6722375" y1="38.3897" x2="24.3825375" y2="38.1" width="0.2032" layer="1"/>
<wire x1="24.3825375" y1="38.1" x2="24.2237" y2="38.1" width="0.2032" layer="1"/>
<wire x1="26.0524625" y1="37.83" x2="25.4927625" y2="38.3897" width="0.2032" layer="1"/>
<wire x1="24.2237" y1="38.1" x2="23.1775" y2="38.1" width="0.2032" layer="16"/>
<wire x1="23.1775" y1="38.1" x2="22.86" y2="38.4175" width="0.2032" layer="16"/>
<wire x1="22.86" y1="38.4175" x2="22.86" y2="38.7407" width="0.2032" layer="16"/>
<wire x1="22.86" y1="38.7407" x2="22.8821" y2="38.7628" width="0.2032" layer="16"/>
<via x="22.8821" y="38.7628" extent="1-16" drill="0.3"/>
<wire x1="22.8821" y1="38.7628" x2="22.8821" y2="39.50665" width="0.2032" layer="1"/>
<wire x1="22.8821" y1="39.50665" x2="22.70125" y2="39.6875" width="0.2032" layer="1"/>
<wire x1="22.70125" y1="39.6875" x2="19.9795" y2="39.6875" width="0.2032" layer="1"/>
<via x="19.9795" y="39.6875" extent="1-16" drill="0.3"/>
<wire x1="19.9795" y1="39.6875" x2="19.994925" y2="39.672075" width="0.2032" layer="16"/>
<wire x1="19.994925" y1="39.672075" x2="19.994925" y2="36.172" width="0.2032" layer="16"/>
<via x="19.994925" y="36.172" extent="1-16" drill="0.3"/>
<wire x1="19.994925" y1="36.172" x2="19.836925" y2="36.33" width="0.2032" layer="1"/>
<wire x1="19.836925" y1="36.33" x2="18.4446" y2="36.33" width="0.2032" layer="1"/>
</signal>
<signal name="PGOOD">
<contactref element="IC1" pad="17"/>
<contactref element="IC2" pad="17"/>
<via x="12.3825" y="36.83" extent="1-16" drill="0.3"/>
<wire x1="14.5754" y1="37.33" x2="14.4644" y2="37.219" width="0.2032" layer="1"/>
<wire x1="13.1496" y1="36.83" x2="12.3825" y2="36.83" width="0.2032" layer="1"/>
<wire x1="14.4644" y1="37.219" x2="13.5386" y2="37.219" width="0.2032" layer="1"/>
<wire x1="13.5386" y1="37.219" x2="13.1496" y2="36.83" width="0.2032" layer="1"/>
<via x="32.385" y="36.35375" extent="1-16" drill="0.3"/>
<wire x1="32.385" y1="36.35375" x2="32.36125" y2="36.33" width="0.2032" layer="1"/>
<wire x1="32.36125" y1="36.33" x2="31.1446" y2="36.33" width="0.2032" layer="1"/>
<wire x1="12.3825" y1="33.81375" x2="12.3825" y2="36.83" width="0.2032" layer="16"/>
<wire x1="32.385" y1="34.44875" x2="32.0675" y2="34.13125" width="0.2032" layer="16"/>
<wire x1="28.2575" y1="34.13125" x2="32.0675" y2="34.13125" width="0.2032" layer="16"/>
<wire x1="26.82875" y1="32.7025" x2="13.49375" y2="32.7025" width="0.2032" layer="16"/>
<wire x1="32.385" y1="36.35375" x2="32.385" y2="34.44875" width="0.2032" layer="16"/>
<wire x1="13.49375" y1="32.7025" x2="12.3825" y2="33.81375" width="0.2032" layer="16"/>
<wire x1="26.82875" y1="32.7025" x2="28.2575" y2="34.13125" width="0.2032" layer="16"/>
</signal>
<signal name="COMP">
<contactref element="IC1" pad="4"/>
<contactref element="IC2" pad="4"/>
<wire x1="28.71" y1="38.7646" x2="28.71" y2="39.39375" width="0.2032" layer="1"/>
<wire x1="28.71" y1="39.39375" x2="28.41625" y2="39.6875" width="0.2032" layer="1"/>
<wire x1="28.41625" y1="39.6875" x2="27.6225" y2="39.6875" width="0.2032" layer="1"/>
<wire x1="27.6225" y1="39.6875" x2="27.305" y2="39.37" width="0.2032" layer="1"/>
<wire x1="27.305" y1="39.37" x2="27.305" y2="38.89375" width="0.2032" layer="1"/>
<wire x1="26.82875" y1="38.4175" x2="26.035" y2="38.4175" width="0.2032" layer="1"/>
<wire x1="26.035" y1="38.4175" x2="25.4" y2="39.0525" width="0.2032" layer="1"/>
<wire x1="25.4" y1="39.0525" x2="24.4245" y2="39.0525" width="0.2032" layer="1"/>
<via x="24.4245" y="39.0525" extent="1-16" drill="0.3"/>
<wire x1="24.4245" y1="39.0525" x2="24.107" y2="39.37" width="0.2032" layer="16"/>
<wire x1="24.107" y1="39.37" x2="22.5425" y2="39.37" width="0.2032" layer="16"/>
<wire x1="22.5425" y1="39.37" x2="22.225" y2="39.0525" width="0.2032" layer="16"/>
<wire x1="22.225" y1="39.0525" x2="22.225" y2="35.40125" width="0.2032" layer="16"/>
<wire x1="27.305" y1="38.89375" x2="26.82875" y2="38.4175" width="0.2032" layer="1"/>
<wire x1="21.43125" y1="34.6075" x2="19.52625" y2="34.6075" width="0.2032" layer="16"/>
<via x="19.52625" y="34.6075" extent="1-16" drill="0.3"/>
<wire x1="19.52625" y1="34.6075" x2="19.52625" y2="34.29" width="0.2032" layer="1"/>
<wire x1="19.52625" y1="34.29" x2="19.20875" y2="33.9725" width="0.2032" layer="1"/>
<wire x1="19.20875" y1="33.9725" x2="17.30375" y2="33.9725" width="0.2032" layer="1"/>
<wire x1="17.01" y1="34.26625" x2="17.01" y2="34.8954" width="0.2032" layer="1"/>
<wire x1="22.225" y1="35.40125" x2="21.43125" y2="34.6075" width="0.2032" layer="16"/>
<wire x1="17.30375" y1="33.9725" x2="17.01" y2="34.26625" width="0.2032" layer="1"/>
</signal>
</signals>
<mfgpreviewcolors>
<mfgpreviewcolor name="soldermaskcolor" color="0xC8008000"/>
<mfgpreviewcolor name="silkscreencolor" color="0xFFFEFEFE"/>
<mfgpreviewcolor name="backgroundcolor" color="0xFF282828"/>
<mfgpreviewcolor name="coppercolor" color="0xFFFFBF00"/>
<mfgpreviewcolor name="substratecolor" color="0xFF786E46"/>
</mfgpreviewcolors>
<errors>
<approved hash="5,1,f11ab91619a635ac"/>
<approved hash="5,1,421c081299a137a9"/>
<approved hash="5,1,e2cd796944246387"/>
<approved hash="5,1,75d0f6694625219a"/>
<approved hash="5,1,84d6476e8422239c"/>
<approved hash="5,1,9ab1198dddf058e0"/>
<approved hash="5,1,95261b91deb25651"/>
<approved hash="5,1,97971f11ddb453de"/>
<approved hash="5,1,9204181ddcf2514f"/>
<approved hash="5,1,8cf5191dddf04f3c"/>
<approved hash="5,1,cf0e1c698a25a544"/>
<approved hash="5,1,d30187119da075b7"/>
<approved hash="5,1,5e0ded6884256347"/>
<approved hash="5,1,e1137a6946246159"/>
<approved hash="5,1,7016cb694425235c"/>
<approved hash="5,1,9f7f1c8dd5f0502e"/>
<approved hash="5,1,90e81e91d6b25e9f"/>
<approved hash="5,1,92591a11d5b45b10"/>
<approved hash="5,1,97ca1d1dd4f25981"/>
<approved hash="5,1,f4d8a6121da23b6e"/>
<approved hash="5,1,45da351699a1356b"/>
<approved hash="5,1,d6df841199a07769"/>
<approved hash="5,1,a40316109da17bb5"/>
<approved hash="5,1,a7c1131095a17577"/>
<approved hash="5,1,38c2e21195a1b374"/>
<approved hash="5,1,b4481bced06f78cd"/>
<approved hash="5,1,abdb1aced00f66be"/>
<approved hash="5,1,a92a1dc2d62b642f"/>
<approved hash="5,1,acbd1942d20b61a0"/>
<approved hash="5,1,a20c1b5ed06f6f11"/>
<approved hash="5,1,b98a16ced06f780f"/>
<approved hash="5,1,a61917ced00f667c"/>
<approved hash="5,1,a4e810c2d62b64ed"/>
<approved hash="5,1,a17f1442d20b6162"/>
<approved hash="5,1,c0c81b698425a382"/>
<approved hash="5,1,53cfe86882256d85"/>
</errors>
</board>
</drawing>
<compatibility>
<note version="8.3" severity="warning">
Since Version 8.3, EAGLE supports URNs for individual library
assets (packages, symbols, and devices). The URNs of those assets
will not be understood (or retained) with this version.
</note>
<note version="8.3" severity="warning">
Since Version 8.3, EAGLE supports the association of 3D packages
with devices in libraries, schematics, and board files. Those 3D
packages will not be understood (or retained) with this version.
</note>
</compatibility>
</eagle>
