<?xml version="1.0" encoding="utf-8"?>
<!DOCTYPE eagle SYSTEM "eagle.dtd">
<eagle version="9.5.0">
<drawing>
<settings>
<setting alwaysvectorfont="no"/>
<setting verticaltext="up"/>
</settings>
<grid distance="0.1" unitdist="inch" unit="inch" style="lines" multiple="1" display="no" altdistance="0.01" altunitdist="inch" altunit="inch"/>
<layers>
<layer number="1" name="Top" color="4" fill="1" visible="yes" active="yes"/>
<layer number="2" name="Route2" color="16" fill="1" visible="no" active="yes"/>
<layer number="3" name="Route3" color="17" fill="1" visible="no" active="yes"/>
<layer number="4" name="Route4" color="18" fill="1" visible="no" active="yes"/>
<layer number="5" name="Route5" color="19" fill="1" visible="no" active="yes"/>
<layer number="6" name="Route6" color="25" fill="1" visible="no" active="yes"/>
<layer number="7" name="Route7" color="26" fill="1" visible="no" active="yes"/>
<layer number="8" name="Route8" color="27" fill="1" visible="no" active="yes"/>
<layer number="9" name="Route9" color="28" fill="1" visible="no" active="yes"/>
<layer number="10" name="Route10" color="29" fill="1" visible="no" active="yes"/>
<layer number="11" name="Route11" color="30" fill="1" visible="no" active="yes"/>
<layer number="12" name="Route12" color="20" fill="1" visible="no" active="yes"/>
<layer number="13" name="Route13" color="21" fill="1" visible="no" active="yes"/>
<layer number="14" name="Route14" color="22" fill="1" visible="no" active="yes"/>
<layer number="15" name="Route15" color="23" fill="1" visible="no" active="yes"/>
<layer number="16" name="Bottom" color="1" fill="1" visible="yes" active="yes"/>
<layer number="17" name="Pads" color="2" fill="1" visible="yes" active="yes"/>
<layer number="18" name="Vias" color="2" fill="1" visible="yes" active="yes"/>
<layer number="19" name="Unrouted" color="6" fill="1" visible="yes" active="yes"/>
<layer number="20" name="Dimension" color="24" fill="1" visible="yes" active="yes"/>
<layer number="21" name="tPlace" color="7" fill="1" visible="yes" active="yes"/>
<layer number="22" name="bPlace" color="7" fill="1" visible="yes" active="yes"/>
<layer number="23" name="tOrigins" color="15" fill="1" visible="yes" active="yes"/>
<layer number="24" name="bOrigins" color="15" fill="1" visible="yes" active="yes"/>
<layer number="25" name="tNames" color="7" fill="1" visible="yes" active="yes"/>
<layer number="26" name="bNames" color="7" fill="1" visible="yes" active="yes"/>
<layer number="27" name="tValues" color="7" fill="1" visible="yes" active="yes"/>
<layer number="28" name="bValues" color="7" fill="1" visible="yes" active="yes"/>
<layer number="29" name="tStop" color="7" fill="3" visible="no" active="yes"/>
<layer number="30" name="bStop" color="7" fill="6" visible="no" active="yes"/>
<layer number="31" name="tCream" color="7" fill="4" visible="no" active="yes"/>
<layer number="32" name="bCream" color="7" fill="5" visible="no" active="yes"/>
<layer number="33" name="tFinish" color="6" fill="3" visible="no" active="yes"/>
<layer number="34" name="bFinish" color="6" fill="6" visible="no" active="yes"/>
<layer number="35" name="tGlue" color="7" fill="4" visible="no" active="yes"/>
<layer number="36" name="bGlue" color="7" fill="5" visible="no" active="yes"/>
<layer number="37" name="tTest" color="7" fill="1" visible="no" active="yes"/>
<layer number="38" name="bTest" color="7" fill="1" visible="no" active="yes"/>
<layer number="39" name="tKeepout" color="4" fill="11" visible="yes" active="yes"/>
<layer number="40" name="bKeepout" color="1" fill="11" visible="yes" active="yes"/>
<layer number="41" name="tRestrict" color="4" fill="10" visible="yes" active="yes"/>
<layer number="42" name="bRestrict" color="1" fill="10" visible="yes" active="yes"/>
<layer number="43" name="vRestrict" color="2" fill="10" visible="yes" active="yes"/>
<layer number="44" name="Drills" color="7" fill="1" visible="no" active="yes"/>
<layer number="45" name="Holes" color="7" fill="1" visible="no" active="yes"/>
<layer number="46" name="Milling" color="3" fill="1" visible="no" active="yes"/>
<layer number="47" name="Measures" color="7" fill="1" visible="no" active="yes"/>
<layer number="48" name="Document" color="7" fill="1" visible="yes" active="yes"/>
<layer number="49" name="Reference" color="7" fill="1" visible="yes" active="yes"/>
<layer number="51" name="tDocu" color="7" fill="1" visible="yes" active="yes"/>
<layer number="52" name="bDocu" color="7" fill="1" visible="yes" active="yes"/>
<layer number="88" name="SimResults" color="9" fill="1" visible="yes" active="yes"/>
<layer number="89" name="SimProbes" color="9" fill="1" visible="yes" active="yes"/>
<layer number="90" name="Modules" color="5" fill="1" visible="yes" active="yes"/>
<layer number="91" name="Nets" color="2" fill="1" visible="yes" active="yes"/>
<layer number="92" name="Busses" color="1" fill="1" visible="yes" active="yes"/>
<layer number="93" name="Pins" color="2" fill="1" visible="yes" active="yes"/>
<layer number="94" name="Symbols" color="4" fill="1" visible="yes" active="yes"/>
<layer number="95" name="Names" color="7" fill="1" visible="yes" active="yes"/>
<layer number="96" name="Values" color="7" fill="1" visible="yes" active="yes"/>
<layer number="97" name="Info" color="7" fill="1" visible="yes" active="yes"/>
<layer number="98" name="Guide" color="6" fill="1" visible="yes" active="yes"/>
<layer number="99" name="SpiceOrder" color="5" fill="1" visible="no" active="no"/>
</layers>
<library>
<packages>
<package name="SODIMM-260">
<smd name="2" x="-36.75" y="4.1" dx="0.35" dy="1.8" layer="1" rot="R180"/>
<smd name="4" x="-36.25" y="4.1" dx="0.35" dy="1.8" layer="1" rot="R180"/>
<smd name="6" x="-35.75" y="4.1" dx="0.35" dy="1.8" layer="1" rot="R180"/>
<smd name="8" x="-35.25" y="4.1" dx="0.35" dy="1.8" layer="1" rot="R180"/>
<smd name="10" x="-34.75" y="4.1" dx="0.35" dy="1.8" layer="1" rot="R180"/>
<smd name="12" x="-34.25" y="4.1" dx="0.35" dy="1.8" layer="1" rot="R180"/>
<smd name="14" x="-33.75" y="4.1" dx="0.35" dy="1.8" layer="1" rot="R180"/>
<smd name="16" x="-33.25" y="4.1" dx="0.35" dy="1.8" layer="1" rot="R180"/>
<smd name="18" x="-32.75" y="4.1" dx="0.35" dy="1.8" layer="1" rot="R180"/>
<smd name="20" x="-32.25" y="4.1" dx="0.35" dy="1.8" layer="1" rot="R180"/>
<smd name="22" x="-31.75" y="4.1" dx="0.35" dy="1.8" layer="1" rot="R180"/>
<smd name="24" x="-31.25" y="4.1" dx="0.35" dy="1.8" layer="1" rot="R180"/>
<smd name="26" x="-30.75" y="4.1" dx="0.35" dy="1.8" layer="1" rot="R180"/>
<smd name="28" x="-30.25" y="4.1" dx="0.35" dy="1.8" layer="1" rot="R180"/>
<smd name="30" x="-29.75" y="4.1" dx="0.35" dy="1.8" layer="1" rot="R180"/>
<smd name="32" x="-29.25" y="4.1" dx="0.35" dy="1.8" layer="1" rot="R180"/>
<smd name="34" x="-28.75" y="4.1" dx="0.35" dy="1.8" layer="1" rot="R180"/>
<smd name="36" x="-28.25" y="4.1" dx="0.35" dy="1.8" layer="1" rot="R180"/>
<smd name="38" x="-27.75" y="4.1" dx="0.35" dy="1.8" layer="1" rot="R180"/>
<smd name="40" x="-27.25" y="4.1" dx="0.35" dy="1.8" layer="1" rot="R180"/>
<smd name="42" x="-26.75" y="4.1" dx="0.35" dy="1.8" layer="1" rot="R180"/>
<smd name="44" x="-26.25" y="4.1" dx="0.35" dy="1.8" layer="1" rot="R180"/>
<smd name="46" x="-25.75" y="4.1" dx="0.35" dy="1.8" layer="1" rot="R180"/>
<smd name="48" x="-25.25" y="4.1" dx="0.35" dy="1.8" layer="1" rot="R180"/>
<smd name="50" x="-24.75" y="4.1" dx="0.35" dy="1.8" layer="1" rot="R180"/>
<smd name="52" x="-24.25" y="4.1" dx="0.35" dy="1.8" layer="1" rot="R180"/>
<smd name="54" x="-23.75" y="4.1" dx="0.35" dy="1.8" layer="1" rot="R180"/>
<smd name="56" x="-23.25" y="4.1" dx="0.35" dy="1.8" layer="1" rot="R180"/>
<smd name="58" x="-22.75" y="4.1" dx="0.35" dy="1.8" layer="1" rot="R180"/>
<smd name="60" x="-22.25" y="4.1" dx="0.35" dy="1.8" layer="1" rot="R180"/>
<smd name="62" x="-21.75" y="4.1" dx="0.35" dy="1.8" layer="1" rot="R180"/>
<smd name="64" x="-21.25" y="4.1" dx="0.35" dy="1.8" layer="1" rot="R180"/>
<smd name="66" x="-20.75" y="4.1" dx="0.35" dy="1.8" layer="1" rot="R180"/>
<smd name="68" x="-20.25" y="4.1" dx="0.35" dy="1.8" layer="1" rot="R180"/>
<smd name="70" x="-19.75" y="4.1" dx="0.35" dy="1.8" layer="1" rot="R180"/>
<smd name="72" x="-19.25" y="4.1" dx="0.35" dy="1.8" layer="1" rot="R180"/>
<smd name="74" x="-18.75" y="4.1" dx="0.35" dy="1.8" layer="1" rot="R180"/>
<smd name="76" x="-18.25" y="4.1" dx="0.35" dy="1.8" layer="1" rot="R180"/>
<smd name="78" x="-17.75" y="4.1" dx="0.35" dy="1.8" layer="1" rot="R180"/>
<smd name="80" x="-17.25" y="4.1" dx="0.35" dy="1.8" layer="1" rot="R180"/>
<smd name="82" x="-16.75" y="4.1" dx="0.35" dy="1.8" layer="1" rot="R180"/>
<smd name="84" x="-16.25" y="4.1" dx="0.35" dy="1.8" layer="1" rot="R180"/>
<smd name="86" x="-15.75" y="4.1" dx="0.35" dy="1.8" layer="1" rot="R180"/>
<smd name="88" x="-15.25" y="4.1" dx="0.35" dy="1.8" layer="1" rot="R180"/>
<smd name="90" x="-14.75" y="4.1" dx="0.35" dy="1.8" layer="1" rot="R180"/>
<smd name="92" x="-14.25" y="4.1" dx="0.35" dy="1.8" layer="1" rot="R180"/>
<smd name="94" x="-13.75" y="4.1" dx="0.35" dy="1.8" layer="1" rot="R180"/>
<smd name="96" x="-13.25" y="4.1" dx="0.35" dy="1.8" layer="1" rot="R180"/>
<smd name="98" x="-12.75" y="4.1" dx="0.35" dy="1.8" layer="1" rot="R180"/>
<smd name="100" x="-12.25" y="4.1" dx="0.35" dy="1.8" layer="1" rot="R180"/>
<smd name="102" x="-11.75" y="4.1" dx="0.35" dy="1.8" layer="1" rot="R180"/>
<smd name="104" x="-11.25" y="4.1" dx="0.35" dy="1.8" layer="1" rot="R180"/>
<smd name="106" x="-10.75" y="4.1" dx="0.35" dy="1.8" layer="1" rot="R180"/>
<smd name="108" x="-10.25" y="4.1" dx="0.35" dy="1.8" layer="1" rot="R180"/>
<smd name="110" x="-9.75" y="4.1" dx="0.35" dy="1.8" layer="1" rot="R180"/>
<smd name="112" x="-9.25" y="4.1" dx="0.35" dy="1.8" layer="1" rot="R180"/>
<smd name="114" x="-8.75" y="4.1" dx="0.35" dy="1.8" layer="1" rot="R180"/>
<smd name="116" x="-8.25" y="4.1" dx="0.35" dy="1.8" layer="1" rot="R180"/>
<smd name="118" x="-7.75" y="4.1" dx="0.35" dy="1.8" layer="1" rot="R180"/>
<smd name="120" x="-7.25" y="4.1" dx="0.35" dy="1.8" layer="1" rot="R180"/>
<smd name="122" x="-6.75" y="4.1" dx="0.35" dy="1.8" layer="1" rot="R180"/>
<smd name="124" x="-6.25" y="4.1" dx="0.35" dy="1.8" layer="1" rot="R180"/>
<smd name="126" x="-5.75" y="4.1" dx="0.35" dy="1.8" layer="1" rot="R180"/>
<smd name="128" x="-5.25" y="4.1" dx="0.35" dy="1.8" layer="1" rot="R180"/>
<smd name="130" x="-4.75" y="4.1" dx="0.35" dy="1.8" layer="1" rot="R180"/>
<smd name="132" x="-4.25" y="4.1" dx="0.35" dy="1.8" layer="1" rot="R180"/>
<smd name="134" x="-3.75" y="4.1" dx="0.35" dy="1.8" layer="1" rot="R180"/>
<smd name="136" x="-3.25" y="4.1" dx="0.35" dy="1.8" layer="1" rot="R180"/>
<smd name="138" x="-2.75" y="4.1" dx="0.35" dy="1.8" layer="1" rot="R180"/>
<smd name="140" x="-2.25" y="4.1" dx="0.35" dy="1.8" layer="1" rot="R180"/>
<smd name="142" x="-1.75" y="4.1" dx="0.35" dy="1.8" layer="1" rot="R180"/>
<smd name="144" x="-1.25" y="4.1" dx="0.35" dy="1.8" layer="1" rot="R180"/>
<smd name="1" x="-37" y="-4.1" dx="0.35" dy="1.8" layer="1" rot="R180"/>
<smd name="3" x="-36.5" y="-4.1" dx="0.35" dy="1.8" layer="1" rot="R180"/>
<smd name="5" x="-36" y="-4.1" dx="0.35" dy="1.8" layer="1" rot="R180"/>
<smd name="7" x="-35.5" y="-4.1" dx="0.35" dy="1.8" layer="1" rot="R180"/>
<smd name="9" x="-35" y="-4.1" dx="0.35" dy="1.8" layer="1" rot="R180"/>
<smd name="11" x="-34.5" y="-4.1" dx="0.35" dy="1.8" layer="1" rot="R180"/>
<smd name="13" x="-34" y="-4.1" dx="0.35" dy="1.8" layer="1" rot="R180"/>
<smd name="15" x="-33.5" y="-4.1" dx="0.35" dy="1.8" layer="1" rot="R180"/>
<smd name="17" x="-33" y="-4.1" dx="0.35" dy="1.8" layer="1" rot="R180"/>
<smd name="19" x="-32.5" y="-4.1" dx="0.35" dy="1.8" layer="1" rot="R180"/>
<smd name="21" x="-32" y="-4.1" dx="0.35" dy="1.8" layer="1" rot="R180"/>
<smd name="23" x="-31.5" y="-4.1" dx="0.35" dy="1.8" layer="1" rot="R180"/>
<smd name="25" x="-31" y="-4.1" dx="0.35" dy="1.8" layer="1" rot="R180"/>
<smd name="27" x="-30.5" y="-4.1" dx="0.35" dy="1.8" layer="1" rot="R180"/>
<smd name="29" x="-30" y="-4.1" dx="0.35" dy="1.8" layer="1" rot="R180"/>
<smd name="31" x="-29.5" y="-4.1" dx="0.35" dy="1.8" layer="1" rot="R180"/>
<smd name="33" x="-29" y="-4.1" dx="0.35" dy="1.8" layer="1" rot="R180"/>
<smd name="35" x="-28.5" y="-4.1" dx="0.35" dy="1.8" layer="1" rot="R180"/>
<smd name="37" x="-28" y="-4.1" dx="0.35" dy="1.8" layer="1" rot="R180"/>
<smd name="39" x="-27.5" y="-4.1" dx="0.35" dy="1.8" layer="1" rot="R180"/>
<smd name="41" x="-27" y="-4.1" dx="0.35" dy="1.8" layer="1" rot="R180"/>
<smd name="43" x="-26.5" y="-4.1" dx="0.35" dy="1.8" layer="1" rot="R180"/>
<smd name="45" x="-26" y="-4.1" dx="0.35" dy="1.8" layer="1" rot="R180"/>
<smd name="47" x="-25.5" y="-4.1" dx="0.35" dy="1.8" layer="1" rot="R180"/>
<smd name="49" x="-25" y="-4.1" dx="0.35" dy="1.8" layer="1" rot="R180"/>
<smd name="51" x="-24.5" y="-4.1" dx="0.35" dy="1.8" layer="1" rot="R180"/>
<smd name="53" x="-24" y="-4.1" dx="0.35" dy="1.8" layer="1" rot="R180"/>
<smd name="55" x="-23.5" y="-4.1" dx="0.35" dy="1.8" layer="1" rot="R180"/>
<smd name="57" x="-23" y="-4.1" dx="0.35" dy="1.8" layer="1" rot="R180"/>
<smd name="59" x="-22.5" y="-4.1" dx="0.35" dy="1.8" layer="1" rot="R180"/>
<smd name="61" x="-22" y="-4.1" dx="0.35" dy="1.8" layer="1" rot="R180"/>
<smd name="63" x="-21.5" y="-4.1" dx="0.35" dy="1.8" layer="1" rot="R180"/>
<smd name="65" x="-21" y="-4.1" dx="0.35" dy="1.8" layer="1" rot="R180"/>
<smd name="67" x="-20.5" y="-4.1" dx="0.35" dy="1.8" layer="1" rot="R180"/>
<smd name="69" x="-20" y="-4.1" dx="0.35" dy="1.8" layer="1" rot="R180"/>
<smd name="71" x="-19.5" y="-4.1" dx="0.35" dy="1.8" layer="1" rot="R180"/>
<smd name="73" x="-19" y="-4.1" dx="0.35" dy="1.8" layer="1" rot="R180"/>
<smd name="75" x="-18.5" y="-4.1" dx="0.35" dy="1.8" layer="1" rot="R180"/>
<smd name="77" x="-18" y="-4.1" dx="0.35" dy="1.8" layer="1" rot="R180"/>
<smd name="79" x="-17.5" y="-4.1" dx="0.35" dy="1.8" layer="1" rot="R180"/>
<smd name="81" x="-17" y="-4.1" dx="0.35" dy="1.8" layer="1" rot="R180"/>
<smd name="83" x="-16.5" y="-4.1" dx="0.35" dy="1.8" layer="1" rot="R180"/>
<smd name="85" x="-16" y="-4.1" dx="0.35" dy="1.8" layer="1" rot="R180"/>
<smd name="87" x="-15.5" y="-4.1" dx="0.35" dy="1.8" layer="1" rot="R180"/>
<smd name="89" x="-15" y="-4.1" dx="0.35" dy="1.8" layer="1" rot="R180"/>
<smd name="91" x="-14.5" y="-4.1" dx="0.35" dy="1.8" layer="1" rot="R180"/>
<smd name="93" x="-14" y="-4.1" dx="0.35" dy="1.8" layer="1" rot="R180"/>
<smd name="95" x="-13.5" y="-4.1" dx="0.35" dy="1.8" layer="1" rot="R180"/>
<smd name="97" x="-13" y="-4.1" dx="0.35" dy="1.8" layer="1" rot="R180"/>
<smd name="99" x="-12.5" y="-4.1" dx="0.35" dy="1.8" layer="1" rot="R180"/>
<smd name="101" x="-12" y="-4.1" dx="0.35" dy="1.8" layer="1" rot="R180"/>
<smd name="103" x="-11.5" y="-4.1" dx="0.35" dy="1.8" layer="1" rot="R180"/>
<smd name="105" x="-11" y="-4.1" dx="0.35" dy="1.8" layer="1" rot="R180"/>
<smd name="107" x="-10.5" y="-4.1" dx="0.35" dy="1.8" layer="1" rot="R180"/>
<smd name="109" x="-10" y="-4.1" dx="0.35" dy="1.8" layer="1" rot="R180"/>
<smd name="111" x="-9.5" y="-4.1" dx="0.35" dy="1.8" layer="1" rot="R180"/>
<smd name="113" x="-9" y="-4.1" dx="0.35" dy="1.8" layer="1" rot="R180"/>
<smd name="115" x="-8.5" y="-4.1" dx="0.35" dy="1.8" layer="1" rot="R180"/>
<smd name="117" x="-8" y="-4.1" dx="0.35" dy="1.8" layer="1" rot="R180"/>
<smd name="119" x="-7.5" y="-4.1" dx="0.35" dy="1.8" layer="1" rot="R180"/>
<smd name="121" x="-7" y="-4.1" dx="0.35" dy="1.8" layer="1" rot="R180"/>
<smd name="123" x="-6.5" y="-4.1" dx="0.35" dy="1.8" layer="1" rot="R180"/>
<smd name="125" x="-6" y="-4.1" dx="0.35" dy="1.8" layer="1" rot="R180"/>
<smd name="127" x="-5.5" y="-4.1" dx="0.35" dy="1.8" layer="1" rot="R180"/>
<smd name="129" x="-5" y="-4.1" dx="0.35" dy="1.8" layer="1" rot="R180"/>
<smd name="131" x="-4.5" y="-4.1" dx="0.35" dy="1.8" layer="1" rot="R180"/>
<smd name="133" x="-4" y="-4.1" dx="0.35" dy="1.8" layer="1" rot="R180"/>
<smd name="135" x="-3.5" y="-4.1" dx="0.35" dy="1.8" layer="1" rot="R180"/>
<smd name="137" x="-3" y="-4.1" dx="0.35" dy="1.8" layer="1" rot="R180"/>
<smd name="139" x="-2.5" y="-4.1" dx="0.35" dy="1.8" layer="1" rot="R180"/>
<smd name="141" x="-2" y="-4.1" dx="0.35" dy="1.8" layer="1" rot="R180"/>
<smd name="143" x="-1.5" y="-4.1" dx="0.35" dy="1.8" layer="1" rot="R180"/>
<smd name="146" x="1.25" y="4.1" dx="0.35" dy="1.8" layer="1" rot="R180"/>
<smd name="148" x="1.75" y="4.1" dx="0.35" dy="1.8" layer="1" rot="R180"/>
<smd name="150" x="2.25" y="4.1" dx="0.35" dy="1.8" layer="1"/>
<smd name="152" x="2.75" y="4.1" dx="0.35" dy="1.8" layer="1"/>
<smd name="154" x="3.25" y="4.1" dx="0.35" dy="1.8" layer="1"/>
<smd name="156" x="3.75" y="4.1" dx="0.35" dy="1.8" layer="1"/>
<smd name="158" x="4.25" y="4.1" dx="0.35" dy="1.8" layer="1"/>
<smd name="160" x="4.75" y="4.1" dx="0.35" dy="1.8" layer="1"/>
<smd name="162" x="5.25" y="4.1" dx="0.35" dy="1.8" layer="1"/>
<smd name="164" x="5.75" y="4.1" dx="0.35" dy="1.8" layer="1"/>
<smd name="166" x="6.25" y="4.1" dx="0.35" dy="1.8" layer="1"/>
<smd name="168" x="6.75" y="4.1" dx="0.35" dy="1.8" layer="1"/>
<smd name="170" x="7.25" y="4.1" dx="0.35" dy="1.8" layer="1"/>
<smd name="172" x="7.75" y="4.1" dx="0.35" dy="1.8" layer="1"/>
<smd name="174" x="8.25" y="4.1" dx="0.35" dy="1.8" layer="1"/>
<smd name="176" x="8.75" y="4.1" dx="0.35" dy="1.8" layer="1"/>
<smd name="178" x="9.25" y="4.1" dx="0.35" dy="1.8" layer="1"/>
<smd name="180" x="9.75" y="4.1" dx="0.35" dy="1.8" layer="1"/>
<smd name="182" x="10.25" y="4.1" dx="0.35" dy="1.8" layer="1"/>
<smd name="184" x="10.75" y="4.1" dx="0.35" dy="1.8" layer="1"/>
<smd name="186" x="11.25" y="4.1" dx="0.35" dy="1.8" layer="1"/>
<smd name="188" x="11.75" y="4.1" dx="0.35" dy="1.8" layer="1"/>
<smd name="190" x="12.25" y="4.1" dx="0.35" dy="1.8" layer="1"/>
<smd name="192" x="12.75" y="4.1" dx="0.35" dy="1.8" layer="1"/>
<smd name="194" x="13.25" y="4.1" dx="0.35" dy="1.8" layer="1"/>
<smd name="196" x="13.75" y="4.1" dx="0.35" dy="1.8" layer="1"/>
<smd name="198" x="14.25" y="4.1" dx="0.35" dy="1.8" layer="1"/>
<smd name="200" x="14.75" y="4.1" dx="0.35" dy="1.8" layer="1"/>
<smd name="202" x="15.25" y="4.1" dx="0.35" dy="1.8" layer="1"/>
<smd name="204" x="15.75" y="4.1" dx="0.35" dy="1.8" layer="1"/>
<smd name="206" x="16.25" y="4.1" dx="0.35" dy="1.8" layer="1"/>
<smd name="208" x="16.75" y="4.1" dx="0.35" dy="1.8" layer="1"/>
<smd name="210" x="17.25" y="4.1" dx="0.35" dy="1.8" layer="1"/>
<smd name="212" x="17.75" y="4.1" dx="0.35" dy="1.8" layer="1"/>
<smd name="214" x="18.25" y="4.1" dx="0.35" dy="1.8" layer="1"/>
<smd name="216" x="18.75" y="4.1" dx="0.35" dy="1.8" layer="1"/>
<smd name="218" x="19.25" y="4.1" dx="0.35" dy="1.8" layer="1"/>
<smd name="220" x="19.75" y="4.1" dx="0.35" dy="1.8" layer="1"/>
<smd name="222" x="20.25" y="4.1" dx="0.35" dy="1.8" layer="1"/>
<smd name="224" x="20.75" y="4.1" dx="0.35" dy="1.8" layer="1"/>
<smd name="226" x="21.25" y="4.1" dx="0.35" dy="1.8" layer="1"/>
<smd name="228" x="21.75" y="4.1" dx="0.35" dy="1.8" layer="1"/>
<smd name="230" x="22.25" y="4.1" dx="0.35" dy="1.8" layer="1"/>
<smd name="232" x="22.75" y="4.1" dx="0.35" dy="1.8" layer="1"/>
<smd name="234" x="23.25" y="4.1" dx="0.35" dy="1.8" layer="1"/>
<smd name="236" x="23.75" y="4.1" dx="0.35" dy="1.8" layer="1"/>
<smd name="238" x="24.25" y="4.1" dx="0.35" dy="1.8" layer="1"/>
<smd name="240" x="24.75" y="4.1" dx="0.35" dy="1.8" layer="1"/>
<smd name="242" x="25.25" y="4.1" dx="0.35" dy="1.8" layer="1"/>
<smd name="244" x="25.75" y="4.1" dx="0.35" dy="1.8" layer="1"/>
<smd name="246" x="26.25" y="4.1" dx="0.35" dy="1.8" layer="1"/>
<smd name="248" x="26.75" y="4.1" dx="0.35" dy="1.8" layer="1"/>
<smd name="250" x="27.25" y="4.1" dx="0.35" dy="1.8" layer="1"/>
<smd name="252" x="27.75" y="4.1" dx="0.35" dy="1.8" layer="1"/>
<smd name="254" x="28.25" y="4.1" dx="0.35" dy="1.8" layer="1"/>
<smd name="256" x="28.75" y="4.1" dx="0.35" dy="1.8" layer="1"/>
<smd name="258" x="29.25" y="4.1" dx="0.35" dy="1.8" layer="1"/>
<smd name="260" x="29.75" y="4.1" dx="0.35" dy="1.8" layer="1"/>
<smd name="145" x="1" y="-4.1" dx="0.35" dy="1.8" layer="1" rot="R180"/>
<smd name="147" x="1.5" y="-4.1" dx="0.35" dy="1.8" layer="1" rot="R180"/>
<smd name="149" x="2" y="-4.1" dx="0.35" dy="1.8" layer="1"/>
<smd name="151" x="2.5" y="-4.1" dx="0.35" dy="1.8" layer="1"/>
<smd name="153" x="3" y="-4.1" dx="0.35" dy="1.8" layer="1"/>
<smd name="155" x="3.5" y="-4.1" dx="0.35" dy="1.8" layer="1"/>
<smd name="157" x="4" y="-4.1" dx="0.35" dy="1.8" layer="1"/>
<smd name="159" x="4.5" y="-4.1" dx="0.35" dy="1.8" layer="1"/>
<smd name="161" x="5" y="-4.1" dx="0.35" dy="1.8" layer="1"/>
<smd name="163" x="5.5" y="-4.1" dx="0.35" dy="1.8" layer="1"/>
<smd name="165" x="6" y="-4.1" dx="0.35" dy="1.8" layer="1"/>
<smd name="167" x="6.5" y="-4.1" dx="0.35" dy="1.8" layer="1"/>
<smd name="169" x="7" y="-4.1" dx="0.35" dy="1.8" layer="1"/>
<smd name="171" x="7.5" y="-4.1" dx="0.35" dy="1.8" layer="1"/>
<smd name="173" x="8" y="-4.1" dx="0.35" dy="1.8" layer="1"/>
<smd name="175" x="8.5" y="-4.1" dx="0.35" dy="1.8" layer="1"/>
<smd name="177" x="9" y="-4.1" dx="0.35" dy="1.8" layer="1"/>
<smd name="179" x="9.5" y="-4.1" dx="0.35" dy="1.8" layer="1"/>
<smd name="181" x="10" y="-4.1" dx="0.35" dy="1.8" layer="1"/>
<smd name="183" x="10.5" y="-4.1" dx="0.35" dy="1.8" layer="1"/>
<smd name="185" x="11" y="-4.1" dx="0.35" dy="1.8" layer="1"/>
<smd name="187" x="11.5" y="-4.1" dx="0.35" dy="1.8" layer="1"/>
<smd name="189" x="12" y="-4.1" dx="0.35" dy="1.8" layer="1"/>
<smd name="191" x="12.5" y="-4.1" dx="0.35" dy="1.8" layer="1"/>
<smd name="193" x="13" y="-4.1" dx="0.35" dy="1.8" layer="1"/>
<smd name="195" x="13.5" y="-4.1" dx="0.35" dy="1.8" layer="1"/>
<smd name="197" x="14" y="-4.1" dx="0.35" dy="1.8" layer="1"/>
<smd name="199" x="14.5" y="-4.1" dx="0.35" dy="1.8" layer="1"/>
<smd name="201" x="15" y="-4.1" dx="0.35" dy="1.8" layer="1"/>
<smd name="203" x="15.5" y="-4.1" dx="0.35" dy="1.8" layer="1"/>
<smd name="205" x="16" y="-4.1" dx="0.35" dy="1.8" layer="1"/>
<smd name="207" x="16.5" y="-4.1" dx="0.35" dy="1.8" layer="1"/>
<smd name="209" x="17" y="-4.1" dx="0.35" dy="1.8" layer="1"/>
<smd name="211" x="17.5" y="-4.1" dx="0.35" dy="1.8" layer="1"/>
<smd name="213" x="18" y="-4.1" dx="0.35" dy="1.8" layer="1"/>
<smd name="215" x="18.5" y="-4.1" dx="0.35" dy="1.8" layer="1"/>
<smd name="217" x="19" y="-4.1" dx="0.35" dy="1.8" layer="1"/>
<smd name="219" x="19.5" y="-4.1" dx="0.35" dy="1.8" layer="1"/>
<smd name="221" x="20" y="-4.1" dx="0.35" dy="1.8" layer="1"/>
<smd name="223" x="20.5" y="-4.1" dx="0.35" dy="1.8" layer="1"/>
<smd name="225" x="21" y="-4.1" dx="0.35" dy="1.8" layer="1"/>
<smd name="227" x="21.5" y="-4.1" dx="0.35" dy="1.8" layer="1"/>
<smd name="229" x="22" y="-4.1" dx="0.35" dy="1.8" layer="1"/>
<smd name="231" x="22.5" y="-4.1" dx="0.35" dy="1.8" layer="1"/>
<smd name="233" x="23" y="-4.1" dx="0.35" dy="1.8" layer="1"/>
<smd name="235" x="23.5" y="-4.1" dx="0.35" dy="1.8" layer="1"/>
<smd name="237" x="24" y="-4.1" dx="0.35" dy="1.8" layer="1"/>
<smd name="239" x="24.5" y="-4.1" dx="0.35" dy="1.8" layer="1"/>
<smd name="241" x="25" y="-4.1" dx="0.35" dy="1.8" layer="1"/>
<smd name="243" x="25.5" y="-4.1" dx="0.35" dy="1.8" layer="1"/>
<smd name="245" x="26" y="-4.1" dx="0.35" dy="1.8" layer="1"/>
<smd name="247" x="26.5" y="-4.1" dx="0.35" dy="1.8" layer="1"/>
<smd name="249" x="27" y="-4.1" dx="0.35" dy="1.8" layer="1"/>
<smd name="251" x="27.5" y="-4.1" dx="0.35" dy="1.8" layer="1"/>
<smd name="253" x="28" y="-4.1" dx="0.35" dy="1.8" layer="1"/>
<smd name="255" x="28.5" y="-4.1" dx="0.35" dy="1.8" layer="1"/>
<smd name="257" x="29" y="-4.1" dx="0.35" dy="1.8" layer="1"/>
<smd name="259" x="29.5" y="-4.1" dx="0.35" dy="1.8" layer="1"/>
<hole x="-38.025" y="0" drill="1.65"/>
<smd name="P$1" x="-41.375" y="-8" dx="2.1" dy="3.6" layer="1"/>
<hole x="30.775" y="0" drill="1.15"/>
<smd name="P$2" x="34.125" y="-12" dx="2.1" dy="3.6" layer="1"/>
<wire x1="-42.75" y1="-17.25" x2="-40" y2="-17.25" width="0.1524" layer="21"/>
<wire x1="-40" y1="-17.25" x2="-40" y2="-2.75" width="0.1524" layer="21"/>
<wire x1="-40" y1="-2.75" x2="-1" y2="-2.75" width="0.1524" layer="21"/>
<wire x1="-1" y1="-2.75" x2="-1" y2="-7" width="0.1524" layer="21"/>
<wire x1="-1" y1="-7" x2="0.5" y2="-7" width="0.1524" layer="21"/>
<wire x1="0.5" y1="-7" x2="0.5" y2="-2.75" width="0.1524" layer="21"/>
<wire x1="0.5" y1="-2.75" x2="32.75" y2="-2.75" width="0.1524" layer="21"/>
<wire x1="32.75" y1="-2.75" x2="32.75" y2="-17.25" width="0.1524" layer="21"/>
<wire x1="32.75" y1="-17.25" x2="35.5" y2="-17.25" width="0.1524" layer="21"/>
<wire x1="35.5" y1="-17.25" x2="35.5" y2="2.75" width="0.1524" layer="21"/>
<wire x1="35.5" y1="2.75" x2="-42.75" y2="2.75" width="0.1524" layer="21"/>
<wire x1="-42.75" y1="2.75" x2="-42.75" y2="-17.25" width="0.1524" layer="21"/>
<text x="-39.37" y="-6.35" size="0.6096" layer="25">&gt;NAME</text>
</package>
</packages>
<symbols>
<symbol name="PWR">
<pin name="VDD" x="0" y="7.62" visible="off" length="short" direction="pwr" rot="R270"/>
<pin name="VSS" x="0" y="-7.62" visible="off" length="short" direction="pwr" rot="R90"/>
<circle x="0" y="3.048" radius="1.016" width="0.1524" layer="94"/>
<circle x="0" y="-3.048" radius="1.016" width="0.1524" layer="94"/>
<wire x1="0" y1="5.08" x2="0" y2="4.064" width="0.1524" layer="94"/>
<wire x1="0" y1="-5.08" x2="0" y2="-4.064" width="0.1524" layer="94"/>
<text x="-0.635" y="5.08" size="0.8128" layer="95" font="vector" rot="R90">VDD</text>
<text x="-0.635" y="-5.08" size="0.8128" layer="95" font="vector" rot="R90" align="bottom-right">VSS</text>
<text x="0" y="0" size="0.8128" layer="95" font="vector" align="center">&gt;NAME</text>
</symbol>
<symbol name="SPI">
<pin name="MISO" x="5.08" y="5.08" visible="pin" length="short" rot="R180"/>
<pin name="MOSI" x="5.08" y="2.54" visible="pin" length="short" rot="R180"/>
<pin name="SCLK" x="5.08" y="0" visible="pin" length="short" rot="R180"/>
<pin name="!CS0" x="5.08" y="-2.54" visible="pin" length="short" rot="R180"/>
<pin name="!CS1" x="5.08" y="-5.08" visible="pin" length="short" rot="R180"/>
<wire x1="2.54" y1="6.35" x2="2.54" y2="-6.35" width="0.254" layer="94"/>
<wire x1="2.54" y1="-6.35" x2="-6.35" y2="-6.35" width="0.254" layer="94"/>
<wire x1="-6.35" y1="-6.35" x2="-6.35" y2="6.35" width="0.254" layer="94"/>
<wire x1="-6.35" y1="6.35" x2="2.54" y2="6.35" width="0.254" layer="94"/>
<text x="-6.35" y="7.62" size="1.27" layer="95">&gt;NAME</text>
</symbol>
<symbol name="PCIE">
<pin name="WAKE" x="-12.7" y="12.7" visible="pin" length="short" direction="in"/>
<pin name="RX0_P" x="-12.7" y="7.62" visible="pin" length="short" direction="in"/>
<pin name="RX0_N" x="-12.7" y="5.08" visible="pin" length="short" direction="in"/>
<pin name="RX1_P" x="-12.7" y="0" visible="pin" length="short" direction="in"/>
<pin name="RX1_N" x="-12.7" y="-2.54" visible="pin" length="short" direction="in"/>
<pin name="RX2_P" x="-12.7" y="-7.62" visible="pin" length="short" direction="in"/>
<pin name="RX2_N" x="-12.7" y="-10.16" visible="pin" length="short" direction="in"/>
<pin name="RX3_P" x="-12.7" y="-15.24" visible="pin" length="short" direction="in"/>
<pin name="RX3_N" x="-12.7" y="-17.78" visible="pin" length="short" direction="in"/>
<pin name="TX0_P" x="12.7" y="7.62" visible="pin" length="short" direction="out" rot="R180"/>
<pin name="TX0_N" x="12.7" y="5.08" visible="pin" length="short" direction="out" rot="R180"/>
<pin name="TX1_P" x="12.7" y="0" visible="pin" length="short" direction="out" rot="R180"/>
<pin name="TX1_N" x="12.7" y="-2.54" visible="pin" length="short" direction="out" rot="R180"/>
<pin name="TX2_P" x="12.7" y="-7.62" visible="pin" length="short" direction="out" rot="R180"/>
<pin name="TX2_N" x="12.7" y="-10.16" visible="pin" length="short" direction="out" rot="R180"/>
<pin name="TX3_P" x="12.7" y="-15.24" visible="pin" length="short" direction="out" rot="R180"/>
<pin name="TX3_N" x="12.7" y="-17.78" visible="pin" length="short" direction="out" rot="R180"/>
<pin name="CLK_N" x="12.7" y="20.32" visible="pin" length="short" direction="out" rot="R180"/>
<pin name="CLK_P" x="12.7" y="17.78" visible="pin" length="short" direction="out" rot="R180"/>
<pin name="CLKREQ" x="-12.7" y="17.78" visible="pin" length="short"/>
<pin name="RST" x="12.7" y="12.7" visible="pin" length="short" direction="out" rot="R180"/>
<wire x1="-10.16" y1="21.59" x2="-10.16" y2="-19.05" width="0.254" layer="94"/>
<wire x1="-10.16" y1="-19.05" x2="10.16" y2="-19.05" width="0.254" layer="94"/>
<wire x1="10.16" y1="-19.05" x2="10.16" y2="21.59" width="0.254" layer="94"/>
<wire x1="10.16" y1="21.59" x2="-10.16" y2="21.59" width="0.254" layer="94"/>
<text x="-10.16" y="22.86" size="1.27" layer="95">&gt;NAME</text>
</symbol>
<symbol name="NANO-GPIO">
<pin name="GPIO1" x="5.08" y="15.24" visible="pin" length="short" rot="R180"/>
<pin name="GPIO2" x="5.08" y="12.7" visible="pin" length="short" rot="R180"/>
<pin name="GPIO3" x="5.08" y="10.16" visible="pin" length="short" rot="R180"/>
<pin name="GPIO4" x="5.08" y="7.62" visible="pin" length="short" rot="R180"/>
<pin name="GPIO5" x="5.08" y="5.08" visible="pin" length="short" rot="R180"/>
<pin name="GPIO6" x="5.08" y="2.54" visible="pin" length="short" rot="R180"/>
<pin name="GPIO7" x="5.08" y="0" visible="pin" length="short" rot="R180"/>
<pin name="GPIO8" x="5.08" y="-2.54" visible="pin" length="short" rot="R180"/>
<pin name="GPIO9" x="5.08" y="-5.08" visible="pin" length="short" rot="R180"/>
<pin name="GPIO10" x="5.08" y="-7.62" visible="pin" length="short" rot="R180"/>
<pin name="GPIO11" x="5.08" y="-10.16" visible="pin" length="short" rot="R180"/>
<pin name="GPIO12" x="5.08" y="-12.7" visible="pin" length="short" rot="R180"/>
<pin name="GPIO13" x="5.08" y="-15.24" visible="pin" length="short" rot="R180"/>
<pin name="GPIO14" x="5.08" y="-17.78" visible="pin" length="short" rot="R180"/>
<wire x1="2.54" y1="16.51" x2="-8.89" y2="16.51" width="0.254" layer="94"/>
<wire x1="-8.89" y1="16.51" x2="-8.89" y2="-19.05" width="0.254" layer="94"/>
<wire x1="-8.89" y1="-19.05" x2="2.54" y2="-19.05" width="0.254" layer="94"/>
<wire x1="2.54" y1="-19.05" x2="2.54" y2="16.51" width="0.254" layer="94"/>
<text x="-8.89" y="17.78" size="1.27" layer="95">&gt;NAME</text>
</symbol>
</symbols>
<devicesets>
<deviceset name="NANO" prefix="JETSON">
<gates>
<gate name="PWR" symbol="PWR" x="0" y="0"/>
<gate name="SPI0" symbol="SPI" x="22.86" y="15.24"/>
<gate name="SPI1" symbol="SPI" x="22.86" y="-5.08"/>
<gate name="PCIE" symbol="PCIE" x="-17.78" y="38.1"/>
<gate name="GPIO" symbol="NANO-GPIO" x="20.32" y="48.26"/>
</gates>
<devices>
<device name="" package="SODIMM-260">
<connects>
<connect gate="GPIO" pin="GPIO1" pad="118"/>
<connect gate="GPIO" pin="GPIO10" pad="212"/>
<connect gate="GPIO" pin="GPIO11" pad="216"/>
<connect gate="GPIO" pin="GPIO12" pad="218"/>
<connect gate="GPIO" pin="GPIO13" pad="228"/>
<connect gate="GPIO" pin="GPIO14" pad="230"/>
<connect gate="GPIO" pin="GPIO2" pad="124"/>
<connect gate="GPIO" pin="GPIO3" pad="126"/>
<connect gate="GPIO" pin="GPIO4" pad="127"/>
<connect gate="GPIO" pin="GPIO5" pad="128"/>
<connect gate="GPIO" pin="GPIO6" pad="130"/>
<connect gate="GPIO" pin="GPIO7" pad="206"/>
<connect gate="GPIO" pin="GPIO8" pad="208"/>
<connect gate="GPIO" pin="GPIO9" pad="211"/>
<connect gate="PCIE" pin="CLKREQ" pad="180"/>
<connect gate="PCIE" pin="CLK_N" pad="160"/>
<connect gate="PCIE" pin="CLK_P" pad="162"/>
<connect gate="PCIE" pin="RST" pad="181"/>
<connect gate="PCIE" pin="RX0_N" pad="131"/>
<connect gate="PCIE" pin="RX0_P" pad="133"/>
<connect gate="PCIE" pin="RX1_N" pad="137"/>
<connect gate="PCIE" pin="RX1_P" pad="139"/>
<connect gate="PCIE" pin="RX2_N" pad="149"/>
<connect gate="PCIE" pin="RX2_P" pad="151"/>
<connect gate="PCIE" pin="RX3_N" pad="155"/>
<connect gate="PCIE" pin="RX3_P" pad="157"/>
<connect gate="PCIE" pin="TX0_N" pad="134"/>
<connect gate="PCIE" pin="TX0_P" pad="136"/>
<connect gate="PCIE" pin="TX1_N" pad="140"/>
<connect gate="PCIE" pin="TX1_P" pad="142"/>
<connect gate="PCIE" pin="TX2_N" pad="148"/>
<connect gate="PCIE" pin="TX2_P" pad="150"/>
<connect gate="PCIE" pin="TX3_N" pad="154"/>
<connect gate="PCIE" pin="TX3_P" pad="156"/>
<connect gate="PCIE" pin="WAKE" pad="179"/>
<connect gate="PWR" pin="VDD" pad="251 252 253 254 255 256 257 258 259 260" route="any"/>
<connect gate="PWR" pin="VSS" pad="1 2 7 8 13 14 19 20 25 26 31 32 37 38 43 44 49 50 55 56 61 62 67 68 73 74 79 80 85 86 102 107 113 119 125 129 132 135 138 141 144 146 147 152 153 158 159 164 165 170 171 176 177 200 201 217 231 241 242 243 244 245 246 247 248 249 250"/>
<connect gate="SPI0" pin="!CS0" pad="95"/>
<connect gate="SPI0" pin="!CS1" pad="97"/>
<connect gate="SPI0" pin="MISO" pad="93"/>
<connect gate="SPI0" pin="MOSI" pad="89"/>
<connect gate="SPI0" pin="SCLK" pad="91"/>
<connect gate="SPI1" pin="!CS0" pad="110"/>
<connect gate="SPI1" pin="!CS1" pad="112"/>
<connect gate="SPI1" pin="MISO" pad="108"/>
<connect gate="SPI1" pin="MOSI" pad="104"/>
<connect gate="SPI1" pin="SCLK" pad="106"/>
</connects>
<technologies>
<technology name=""/>
</technologies>
</device>
</devices>
</deviceset>
</devicesets>
</library>
</drawing>
</eagle>
