G04 EAGLE Gerber RS-274X export*
G75*
%MOMM*%
%FSLAX34Y34*%
%LPD*%
%INSolderpaste Top*%
%IPPOS*%
%AMOC8*
5,1,8,0,0,1.08239X$1,22.5*%
G01*
%ADD10R,0.680200X1.208800*%
%ADD11R,0.511800X0.611800*%
%ADD12R,0.611800X0.511800*%
%ADD13C,0.320000*%
%ADD14R,2.500000X1.700000*%
%ADD15R,0.300000X0.550000*%
%ADD16R,0.300000X0.350000*%
%ADD17R,0.350000X0.300000*%
%ADD18R,0.550000X0.300000*%

G36*
X78580Y176043D02*
X78580Y176043D01*
X78580Y176044D01*
X78580Y177544D01*
X78576Y177549D01*
X78575Y177548D01*
X78575Y177549D01*
X75575Y177549D01*
X75574Y177548D01*
X75572Y177548D01*
X75572Y177546D01*
X75570Y177544D01*
X75572Y177543D01*
X75571Y177540D01*
X77071Y176040D01*
X77074Y176040D01*
X77075Y176039D01*
X78575Y176039D01*
X78580Y176043D01*
G37*
G36*
X110076Y143040D02*
X110076Y143040D01*
X110078Y143040D01*
X110078Y143042D01*
X110080Y143044D01*
X110080Y146044D01*
X110076Y146049D01*
X110075Y146048D01*
X110075Y146049D01*
X108575Y146049D01*
X108570Y146044D01*
X108570Y144544D01*
X108572Y144542D01*
X108571Y144540D01*
X110071Y143040D01*
X110073Y143040D01*
X110074Y143039D01*
X110076Y143040D01*
G37*
G36*
X110080Y173043D02*
X110080Y173043D01*
X110080Y173044D01*
X110080Y176044D01*
X110079Y176045D01*
X110079Y176047D01*
X110077Y176047D01*
X110076Y176049D01*
X110074Y176047D01*
X110071Y176047D01*
X108571Y174547D01*
X108571Y174546D01*
X108571Y174545D01*
X108570Y174544D01*
X108570Y173044D01*
X108574Y173039D01*
X108575Y173039D01*
X110075Y173039D01*
X110080Y173043D01*
G37*
G36*
X74076Y143040D02*
X74076Y143040D01*
X74079Y143040D01*
X75579Y144540D01*
X75579Y144543D01*
X75580Y144544D01*
X75580Y146044D01*
X75576Y146049D01*
X75575Y146048D01*
X75575Y146049D01*
X74075Y146049D01*
X74070Y146044D01*
X74070Y143044D01*
X74071Y143042D01*
X74071Y143041D01*
X74073Y143041D01*
X74074Y143039D01*
X74076Y143040D01*
G37*
G36*
X78580Y141543D02*
X78580Y141543D01*
X78580Y141544D01*
X78580Y143044D01*
X78576Y143049D01*
X78575Y143048D01*
X78575Y143049D01*
X77075Y143049D01*
X77073Y143047D01*
X77071Y143047D01*
X75571Y141547D01*
X75571Y141546D01*
X75570Y141544D01*
X75571Y141543D01*
X75571Y141541D01*
X75573Y141541D01*
X75575Y141539D01*
X78575Y141539D01*
X78580Y141543D01*
G37*
G36*
X107077Y176040D02*
X107077Y176040D01*
X107079Y176040D01*
X108579Y177540D01*
X108579Y177542D01*
X108580Y177543D01*
X108579Y177544D01*
X108579Y177547D01*
X108577Y177547D01*
X108575Y177549D01*
X105575Y177549D01*
X105570Y177544D01*
X105570Y176044D01*
X105574Y176039D01*
X105575Y176039D01*
X107075Y176039D01*
X107077Y176040D01*
G37*
G36*
X108576Y141540D02*
X108576Y141540D01*
X108578Y141540D01*
X108578Y141542D01*
X108580Y141543D01*
X108578Y141545D01*
X108579Y141547D01*
X107079Y143047D01*
X107076Y143047D01*
X107075Y143049D01*
X105575Y143049D01*
X105570Y143044D01*
X105570Y141544D01*
X105574Y141539D01*
X105575Y141539D01*
X108575Y141539D01*
X108576Y141540D01*
G37*
G36*
X75580Y173043D02*
X75580Y173043D01*
X75580Y173044D01*
X75580Y174544D01*
X75578Y174546D01*
X75579Y174547D01*
X74079Y176047D01*
X74077Y176047D01*
X74076Y176049D01*
X74074Y176048D01*
X74072Y176048D01*
X74072Y176045D01*
X74070Y176044D01*
X74070Y173044D01*
X74074Y173039D01*
X74075Y173039D01*
X75575Y173039D01*
X75580Y173043D01*
G37*
D10*
X82575Y69223D03*
X92075Y69223D03*
X101575Y69223D03*
X101575Y94289D03*
X82575Y94289D03*
D11*
X99456Y57944D03*
X89456Y57944D03*
D12*
X66675Y81200D03*
X66675Y71200D03*
X119856Y159306D03*
X119856Y169306D03*
X82550Y18813D03*
X82550Y28813D03*
D11*
X107713Y57944D03*
X117713Y57944D03*
D13*
X114525Y50297D02*
X114525Y45391D01*
X108025Y45391D02*
X108025Y50297D01*
X101525Y50297D02*
X101525Y45391D01*
X95025Y45391D02*
X95025Y50297D01*
X95025Y21285D02*
X95025Y16379D01*
X101525Y16379D02*
X101525Y21285D01*
X108025Y21285D02*
X108025Y16379D01*
X114525Y16379D02*
X114525Y21285D01*
D14*
X104775Y33338D03*
D15*
X92075Y140794D03*
X87075Y140794D03*
X82075Y140794D03*
X97075Y140794D03*
X102075Y140794D03*
D16*
X77075Y139794D03*
X107075Y139794D03*
D17*
X72325Y144544D03*
D18*
X73325Y149544D03*
X73325Y154544D03*
X73325Y159544D03*
X73325Y164544D03*
X73325Y169544D03*
D17*
X72325Y174544D03*
D16*
X77075Y179294D03*
D15*
X82075Y178294D03*
X87075Y178294D03*
X92075Y178294D03*
X97075Y178294D03*
X102075Y178294D03*
D16*
X107075Y179294D03*
D17*
X111825Y174544D03*
D18*
X110825Y169544D03*
X110825Y164544D03*
X110825Y159544D03*
X110825Y154544D03*
X110825Y149544D03*
D17*
X111825Y144544D03*
D12*
X65088Y160894D03*
X65088Y170894D03*
M02*
