ISO-10303-21;
HEADER;
/* Generated by software containing ST-Developer
 * from STEP Tools, Inc. (www.steptools.com) 
 */

FILE_DESCRIPTION(
/* description */ (''),
/* implementation_level */ '2;1');

FILE_NAME(
/* name */ 
'C:\\Users\\mogei\\Projects\\Robot\\PCBs\\3D Packages\\L100115\\L10011
5.stp',
/* time_stamp */ '2019-07-11T16:50:00+02:00',
/* author */ ('mogei'),
/* organization */ (''),
/* preprocessor_version */ 'ST-DEVELOPER v18',
/* originating_system */ 'Autodesk Inventor 2020',
/* authorisation */ '');

FILE_SCHEMA (('AUTOMOTIVE_DESIGN { 1 0 10303 214 3 1 1 }'));
ENDSEC;

DATA;
#10=MECHANICAL_DESIGN_GEOMETRIC_PRESENTATION_REPRESENTATION('',(#23,#24,
#25),#2088);
#11=ITEM_DEFINED_TRANSFORMATION($,$,#1210,#1355);
#12=ITEM_DEFINED_TRANSFORMATION($,$,#1318,#1356);
#13=(
REPRESENTATION_RELATIONSHIP($,$,#2102,#2101)
REPRESENTATION_RELATIONSHIP_WITH_TRANSFORMATION(#11)
SHAPE_REPRESENTATION_RELATIONSHIP()
);
#14=(
REPRESENTATION_RELATIONSHIP($,$,#2103,#2101)
REPRESENTATION_RELATIONSHIP_WITH_TRANSFORMATION(#12)
SHAPE_REPRESENTATION_RELATIONSHIP()
);
#15=CONTEXT_DEPENDENT_SHAPE_REPRESENTATION(#13,#2099);
#16=CONTEXT_DEPENDENT_SHAPE_REPRESENTATION(#14,#2100);
#17=NEXT_ASSEMBLY_USAGE_OCCURRENCE('Coil:1','Coil:1','Coil:1',#2105,#2106,
'Coil:1');
#18=NEXT_ASSEMBLY_USAGE_OCCURRENCE('Pin:1','Pin:1','Pin:1',#2105,#2107,
'Pin:1');
#19=SHAPE_REPRESENTATION_RELATIONSHIP('SRR','None',#2102,#21);
#20=SHAPE_REPRESENTATION_RELATIONSHIP('SRR','None',#2103,#22);
#21=ADVANCED_BREP_SHAPE_REPRESENTATION('',(#26),#2086);
#22=ADVANCED_BREP_SHAPE_REPRESENTATION('',(#27,#28),#2087);
#23=STYLED_ITEM('',(#1173),#26);
#24=STYLED_ITEM('',(#1174),#27);
#25=STYLED_ITEM('',(#1174),#28);
#26=MANIFOLD_SOLID_BREP('Solid1',#1147);
#27=MANIFOLD_SOLID_BREP('Solid1',#1148);
#28=MANIFOLD_SOLID_BREP('Solid1',#1149);
#29=FACE_BOUND('',#362,.T.);
#30=PLANE('',#1235);
#31=PLANE('',#1238);
#32=PLANE('',#1241);
#33=PLANE('',#1257);
#34=PLANE('',#1295);
#35=PLANE('',#1296);
#36=PLANE('',#1301);
#37=PLANE('',#1304);
#38=PLANE('',#1307);
#39=PLANE('',#1308);
#40=PLANE('',#1311);
#41=PLANE('',#1314);
#42=PLANE('',#1316);
#43=PLANE('',#1319);
#44=PLANE('',#1323);
#45=PLANE('',#1327);
#46=PLANE('',#1331);
#47=PLANE('',#1335);
#48=PLANE('',#1336);
#49=PLANE('',#1340);
#50=PLANE('',#1344);
#51=PLANE('',#1348);
#52=PLANE('',#1352);
#53=PLANE('',#1353);
#54=PLANE('',#1354);
#55=LINE('',#1756,#143);
#56=LINE('',#1757,#144);
#57=LINE('',#1768,#145);
#58=LINE('',#1769,#146);
#59=LINE('',#1780,#147);
#60=LINE('',#1781,#148);
#61=LINE('',#1789,#149);
#62=LINE('',#1790,#150);
#63=LINE('',#1793,#151);
#64=LINE('',#1795,#152);
#65=LINE('',#1796,#153);
#66=LINE('',#1799,#154);
#67=LINE('',#1803,#155);
#68=LINE('',#1804,#156);
#69=LINE('',#1807,#157);
#70=LINE('',#1815,#158);
#71=LINE('',#1818,#159);
#72=LINE('',#1827,#160);
#73=LINE('',#1830,#161);
#74=LINE('',#1841,#162);
#75=LINE('',#1842,#163);
#76=LINE('',#1845,#164);
#77=LINE('',#1847,#165);
#78=LINE('',#1848,#166);
#79=LINE('',#1854,#167);
#80=LINE('',#1857,#168);
#81=LINE('',#1866,#169);
#82=LINE('',#1869,#170);
#83=LINE('',#1878,#171);
#84=LINE('',#1881,#172);
#85=LINE('',#1891,#173);
#86=LINE('',#1902,#174);
#87=LINE('',#1903,#175);
#88=LINE('',#1913,#176);
#89=LINE('',#1914,#177);
#90=LINE('',#1920,#178);
#91=LINE('',#1922,#179);
#92=LINE('',#1925,#180);
#93=LINE('',#1929,#181);
#94=LINE('',#1932,#182);
#95=LINE('',#1936,#183);
#96=LINE('',#1939,#184);
#97=LINE('',#1942,#185);
#98=LINE('',#1943,#186);
#99=LINE('',#1947,#187);
#100=LINE('',#1950,#188);
#101=LINE('',#1951,#189);
#102=LINE('',#1955,#190);
#103=LINE('',#1957,#191);
#104=LINE('',#1960,#192);
#105=LINE('',#1961,#193);
#106=LINE('',#1965,#194);
#107=LINE('',#1968,#195);
#108=LINE('',#1969,#196);
#109=LINE('',#1974,#197);
#110=LINE('',#1976,#198);
#111=LINE('',#1982,#199);
#112=LINE('',#1984,#200);
#113=LINE('',#1986,#201);
#114=LINE('',#1987,#202);
#115=LINE('',#1993,#203);
#116=LINE('',#1996,#204);
#117=LINE('',#1998,#205);
#118=LINE('',#1999,#206);
#119=LINE('',#2005,#207);
#120=LINE('',#2008,#208);
#121=LINE('',#2010,#209);
#122=LINE('',#2011,#210);
#123=LINE('',#2017,#211);
#124=LINE('',#2020,#212);
#125=LINE('',#2022,#213);
#126=LINE('',#2023,#214);
#127=LINE('',#2034,#215);
#128=LINE('',#2037,#216);
#129=LINE('',#2040,#217);
#130=LINE('',#2042,#218);
#131=LINE('',#2043,#219);
#132=LINE('',#2049,#220);
#133=LINE('',#2052,#221);
#134=LINE('',#2054,#222);
#135=LINE('',#2055,#223);
#136=LINE('',#2061,#224);
#137=LINE('',#2064,#225);
#138=LINE('',#2066,#226);
#139=LINE('',#2067,#227);
#140=LINE('',#2073,#228);
#141=LINE('',#2075,#229);
#142=LINE('',#2076,#230);
#143=VECTOR('',#1375,10.);
#144=VECTOR('',#1376,10.);
#145=VECTOR('',#1389,10.);
#146=VECTOR('',#1390,10.);
#147=VECTOR('',#1403,10.);
#148=VECTOR('',#1404,10.);
#149=VECTOR('',#1415,10.);
#150=VECTOR('',#1416,10.);
#151=VECTOR('',#1419,10.);
#152=VECTOR('',#1420,10.);
#153=VECTOR('',#1421,10.);
#154=VECTOR('',#1424,10.);
#155=VECTOR('',#1429,10.);
#156=VECTOR('',#1430,10.);
#157=VECTOR('',#1433,10.);
#158=VECTOR('',#1442,10.);
#159=VECTOR('',#1445,10.);
#160=VECTOR('',#1456,10.);
#161=VECTOR('',#1459,10.);
#162=VECTOR('',#1472,10.);
#163=VECTOR('',#1473,10.);
#164=VECTOR('',#1476,10.);
#165=VECTOR('',#1477,10.);
#166=VECTOR('',#1478,10.);
#167=VECTOR('',#1483,10.);
#168=VECTOR('',#1486,10.);
#169=VECTOR('',#1497,10.);
#170=VECTOR('',#1500,10.);
#171=VECTOR('',#1511,10.);
#172=VECTOR('',#1514,10.);
#173=VECTOR('',#1527,10.);
#174=VECTOR('',#1540,10.);
#175=VECTOR('',#1541,10.);
#176=VECTOR('',#1554,10.);
#177=VECTOR('',#1555,10.);
#178=VECTOR('',#1564,10.);
#179=VECTOR('',#1567,10.);
#180=VECTOR('',#1570,10.);
#181=VECTOR('',#1573,10.);
#182=VECTOR('',#1576,10.);
#183=VECTOR('',#1579,10.);
#184=VECTOR('',#1582,10.);
#185=VECTOR('',#1585,10.);
#186=VECTOR('',#1586,10.);
#187=VECTOR('',#1591,10.);
#188=VECTOR('',#1594,10.);
#189=VECTOR('',#1595,10.);
#190=VECTOR('',#1600,10.);
#191=VECTOR('',#1603,10.);
#192=VECTOR('',#1606,10.);
#193=VECTOR('',#1607,10.);
#194=VECTOR('',#1612,10.);
#195=VECTOR('',#1615,10.);
#196=VECTOR('',#1616,10.);
#197=VECTOR('',#1625,10.);
#198=VECTOR('',#1628,10.);
#199=VECTOR('',#1635,10.);
#200=VECTOR('',#1636,10.);
#201=VECTOR('',#1637,10.);
#202=VECTOR('',#1638,10.);
#203=VECTOR('',#1645,10.);
#204=VECTOR('',#1648,10.);
#205=VECTOR('',#1649,10.);
#206=VECTOR('',#1650,10.);
#207=VECTOR('',#1657,10.);
#208=VECTOR('',#1660,10.);
#209=VECTOR('',#1661,10.);
#210=VECTOR('',#1662,10.);
#211=VECTOR('',#1669,10.);
#212=VECTOR('',#1672,10.);
#213=VECTOR('',#1673,10.);
#214=VECTOR('',#1674,10.);
#215=VECTOR('',#1689,10.);
#216=VECTOR('',#1692,10.);
#217=VECTOR('',#1695,10.);
#218=VECTOR('',#1696,10.);
#219=VECTOR('',#1697,10.);
#220=VECTOR('',#1704,10.);
#221=VECTOR('',#1707,10.);
#222=VECTOR('',#1708,10.);
#223=VECTOR('',#1709,10.);
#224=VECTOR('',#1716,10.);
#225=VECTOR('',#1719,10.);
#226=VECTOR('',#1720,10.);
#227=VECTOR('',#1721,10.);
#228=VECTOR('',#1728,10.);
#229=VECTOR('',#1731,10.);
#230=VECTOR('',#1732,10.);
#231=CYLINDRICAL_SURFACE('',#1216,0.3);
#232=CYLINDRICAL_SURFACE('',#1222,0.3);
#233=CYLINDRICAL_SURFACE('',#1228,0.3);
#234=CYLINDRICAL_SURFACE('',#1234,0.3);
#235=CYLINDRICAL_SURFACE('',#1236,1.);
#236=CYLINDRICAL_SURFACE('',#1239,1.);
#237=CYLINDRICAL_SURFACE('',#1242,0.1);
#238=CYLINDRICAL_SURFACE('',#1249,0.1);
#239=CYLINDRICAL_SURFACE('',#1255,0.1);
#240=CYLINDRICAL_SURFACE('',#1258,0.1);
#241=CYLINDRICAL_SURFACE('',#1265,0.1);
#242=CYLINDRICAL_SURFACE('',#1271,0.1);
#243=CYLINDRICAL_SURFACE('',#1277,0.1);
#244=CYLINDRICAL_SURFACE('',#1283,0.1);
#245=CYLINDRICAL_SURFACE('',#1289,0.1);
#246=CYLINDRICAL_SURFACE('',#1294,0.1);
#247=CYLINDRICAL_SURFACE('',#1302,0.5);
#248=CYLINDRICAL_SURFACE('',#1305,0.5);
#249=CYLINDRICAL_SURFACE('',#1309,0.5);
#250=CYLINDRICAL_SURFACE('',#1312,0.5);
#251=CYLINDRICAL_SURFACE('',#1315,1.);
#252=CYLINDRICAL_SURFACE('',#1317,1.);
#253=CYLINDRICAL_SURFACE('',#1320,0.300000000000001);
#254=CYLINDRICAL_SURFACE('',#1324,0.3);
#255=CYLINDRICAL_SURFACE('',#1328,0.300000000000002);
#256=CYLINDRICAL_SURFACE('',#1332,0.300000000000001);
#257=CYLINDRICAL_SURFACE('',#1337,0.3);
#258=CYLINDRICAL_SURFACE('',#1341,0.3);
#259=CYLINDRICAL_SURFACE('',#1345,0.300000000000001);
#260=CYLINDRICAL_SURFACE('',#1349,0.3);
#261=FACE_OUTER_BOUND('',#328,.T.);
#262=FACE_OUTER_BOUND('',#329,.T.);
#263=FACE_OUTER_BOUND('',#330,.T.);
#264=FACE_OUTER_BOUND('',#331,.T.);
#265=FACE_OUTER_BOUND('',#332,.T.);
#266=FACE_OUTER_BOUND('',#333,.T.);
#267=FACE_OUTER_BOUND('',#334,.T.);
#268=FACE_OUTER_BOUND('',#335,.T.);
#269=FACE_OUTER_BOUND('',#336,.T.);
#270=FACE_OUTER_BOUND('',#337,.T.);
#271=FACE_OUTER_BOUND('',#338,.T.);
#272=FACE_OUTER_BOUND('',#339,.T.);
#273=FACE_OUTER_BOUND('',#340,.T.);
#274=FACE_OUTER_BOUND('',#341,.T.);
#275=FACE_OUTER_BOUND('',#342,.T.);
#276=FACE_OUTER_BOUND('',#343,.T.);
#277=FACE_OUTER_BOUND('',#344,.T.);
#278=FACE_OUTER_BOUND('',#345,.T.);
#279=FACE_OUTER_BOUND('',#346,.T.);
#280=FACE_OUTER_BOUND('',#347,.T.);
#281=FACE_OUTER_BOUND('',#348,.T.);
#282=FACE_OUTER_BOUND('',#349,.T.);
#283=FACE_OUTER_BOUND('',#350,.T.);
#284=FACE_OUTER_BOUND('',#351,.T.);
#285=FACE_OUTER_BOUND('',#352,.T.);
#286=FACE_OUTER_BOUND('',#353,.T.);
#287=FACE_OUTER_BOUND('',#354,.T.);
#288=FACE_OUTER_BOUND('',#355,.T.);
#289=FACE_OUTER_BOUND('',#356,.T.);
#290=FACE_OUTER_BOUND('',#357,.T.);
#291=FACE_OUTER_BOUND('',#358,.T.);
#292=FACE_OUTER_BOUND('',#359,.T.);
#293=FACE_OUTER_BOUND('',#360,.T.);
#294=FACE_OUTER_BOUND('',#361,.T.);
#295=FACE_OUTER_BOUND('',#363,.T.);
#296=FACE_OUTER_BOUND('',#364,.T.);
#297=FACE_OUTER_BOUND('',#365,.T.);
#298=FACE_OUTER_BOUND('',#366,.T.);
#299=FACE_OUTER_BOUND('',#367,.T.);
#300=FACE_OUTER_BOUND('',#368,.T.);
#301=FACE_OUTER_BOUND('',#369,.T.);
#302=FACE_OUTER_BOUND('',#370,.T.);
#303=FACE_OUTER_BOUND('',#371,.T.);
#304=FACE_OUTER_BOUND('',#372,.T.);
#305=FACE_OUTER_BOUND('',#373,.T.);
#306=FACE_OUTER_BOUND('',#374,.T.);
#307=FACE_OUTER_BOUND('',#375,.T.);
#308=FACE_OUTER_BOUND('',#376,.T.);
#309=FACE_OUTER_BOUND('',#377,.T.);
#310=FACE_OUTER_BOUND('',#378,.T.);
#311=FACE_OUTER_BOUND('',#379,.T.);
#312=FACE_OUTER_BOUND('',#380,.T.);
#313=FACE_OUTER_BOUND('',#381,.T.);
#314=FACE_OUTER_BOUND('',#382,.T.);
#315=FACE_OUTER_BOUND('',#383,.T.);
#316=FACE_OUTER_BOUND('',#384,.T.);
#317=FACE_OUTER_BOUND('',#385,.T.);
#318=FACE_OUTER_BOUND('',#386,.T.);
#319=FACE_OUTER_BOUND('',#387,.T.);
#320=FACE_OUTER_BOUND('',#388,.T.);
#321=FACE_OUTER_BOUND('',#389,.T.);
#322=FACE_OUTER_BOUND('',#390,.T.);
#323=FACE_OUTER_BOUND('',#391,.T.);
#324=FACE_OUTER_BOUND('',#392,.T.);
#325=FACE_OUTER_BOUND('',#393,.T.);
#326=FACE_OUTER_BOUND('',#394,.T.);
#327=FACE_OUTER_BOUND('',#395,.T.);
#328=EDGE_LOOP('',(#740,#741,#742,#743));
#329=EDGE_LOOP('',(#744,#745,#746,#747));
#330=EDGE_LOOP('',(#748,#749,#750,#751));
#331=EDGE_LOOP('',(#752,#753,#754,#755));
#332=EDGE_LOOP('',(#756,#757,#758,#759));
#333=EDGE_LOOP('',(#760,#761,#762,#763));
#334=EDGE_LOOP('',(#764,#765,#766,#767));
#335=EDGE_LOOP('',(#768,#769,#770,#771));
#336=EDGE_LOOP('',(#772,#773,#774,#775));
#337=EDGE_LOOP('',(#776,#777,#778,#779));
#338=EDGE_LOOP('',(#780,#781,#782,#783));
#339=EDGE_LOOP('',(#784,#785,#786,#787));
#340=EDGE_LOOP('',(#788,#789,#790,#791,#792,#793,#794,#795));
#341=EDGE_LOOP('',(#796,#797,#798,#799));
#342=EDGE_LOOP('',(#800,#801,#802,#803));
#343=EDGE_LOOP('',(#804,#805,#806,#807));
#344=EDGE_LOOP('',(#808,#809,#810,#811));
#345=EDGE_LOOP('',(#812,#813,#814,#815));
#346=EDGE_LOOP('',(#816,#817,#818,#819));
#347=EDGE_LOOP('',(#820,#821,#822,#823));
#348=EDGE_LOOP('',(#824,#825,#826,#827));
#349=EDGE_LOOP('',(#828,#829,#830,#831));
#350=EDGE_LOOP('',(#832,#833,#834,#835));
#351=EDGE_LOOP('',(#836,#837,#838,#839));
#352=EDGE_LOOP('',(#840,#841,#842,#843));
#353=EDGE_LOOP('',(#844,#845,#846,#847));
#354=EDGE_LOOP('',(#848,#849,#850,#851));
#355=EDGE_LOOP('',(#852,#853,#854,#855));
#356=EDGE_LOOP('',(#856,#857,#858,#859));
#357=EDGE_LOOP('',(#860,#861,#862,#863));
#358=EDGE_LOOP('',(#864,#865,#866,#867));
#359=EDGE_LOOP('',(#868,#869,#870,#871));
#360=EDGE_LOOP('',(#872,#873,#874,#875));
#361=EDGE_LOOP('',(#876,#877,#878,#879,#880,#881,#882,#883));
#362=EDGE_LOOP('',(#884,#885,#886,#887,#888,#889,#890,#891,#892,#893,#894,
#895,#896,#897,#898,#899,#900,#901,#902,#903));
#363=EDGE_LOOP('',(#904,#905,#906,#907));
#364=EDGE_LOOP('',(#908,#909,#910,#911));
#365=EDGE_LOOP('',(#912,#913,#914,#915));
#366=EDGE_LOOP('',(#916,#917,#918,#919));
#367=EDGE_LOOP('',(#920,#921,#922,#923));
#368=EDGE_LOOP('',(#924,#925,#926,#927));
#369=EDGE_LOOP('',(#928,#929,#930,#931));
#370=EDGE_LOOP('',(#932,#933,#934,#935));
#371=EDGE_LOOP('',(#936,#937,#938,#939));
#372=EDGE_LOOP('',(#940,#941,#942,#943,#944,#945,#946,#947,#948,#949,#950,
#951,#952,#953,#954,#955,#956,#957,#958,#959));
#373=EDGE_LOOP('',(#960,#961,#962,#963));
#374=EDGE_LOOP('',(#964,#965,#966,#967));
#375=EDGE_LOOP('',(#968,#969,#970,#971));
#376=EDGE_LOOP('',(#972,#973,#974,#975));
#377=EDGE_LOOP('',(#976,#977,#978,#979));
#378=EDGE_LOOP('',(#980,#981,#982,#983));
#379=EDGE_LOOP('',(#984,#985,#986,#987));
#380=EDGE_LOOP('',(#988,#989,#990,#991));
#381=EDGE_LOOP('',(#992,#993,#994,#995));
#382=EDGE_LOOP('',(#996,#997,#998,#999));
#383=EDGE_LOOP('',(#1000,#1001,#1002,#1003));
#384=EDGE_LOOP('',(#1004,#1005,#1006,#1007,#1008,#1009,#1010,#1011));
#385=EDGE_LOOP('',(#1012,#1013,#1014,#1015,#1016,#1017,#1018,#1019));
#386=EDGE_LOOP('',(#1020,#1021,#1022,#1023));
#387=EDGE_LOOP('',(#1024,#1025,#1026,#1027));
#388=EDGE_LOOP('',(#1028,#1029,#1030,#1031));
#389=EDGE_LOOP('',(#1032,#1033,#1034,#1035));
#390=EDGE_LOOP('',(#1036,#1037,#1038,#1039));
#391=EDGE_LOOP('',(#1040,#1041,#1042,#1043));
#392=EDGE_LOOP('',(#1044,#1045,#1046,#1047));
#393=EDGE_LOOP('',(#1048,#1049,#1050,#1051));
#394=EDGE_LOOP('',(#1052,#1053,#1054,#1055,#1056,#1057,#1058,#1059));
#395=EDGE_LOOP('',(#1060,#1061,#1062,#1063,#1064,#1065,#1066,#1067));
#396=CIRCLE('',#1212,0.3);
#397=CIRCLE('',#1213,1.);
#398=CIRCLE('',#1214,0.299999999999999);
#399=CIRCLE('',#1215,0.7);
#400=CIRCLE('',#1217,0.3);
#401=CIRCLE('',#1219,0.300000000000002);
#402=CIRCLE('',#1220,0.7);
#403=CIRCLE('',#1221,1.);
#404=CIRCLE('',#1223,0.300000000000001);
#405=CIRCLE('',#1225,0.300000000000001);
#406=CIRCLE('',#1226,0.7);
#407=CIRCLE('',#1227,1.);
#408=CIRCLE('',#1229,0.3);
#409=CIRCLE('',#1231,0.299999999999999);
#410=CIRCLE('',#1232,0.7);
#411=CIRCLE('',#1233,1.);
#412=CIRCLE('',#1237,1.);
#413=CIRCLE('',#1240,1.);
#414=CIRCLE('',#1243,0.1);
#415=CIRCLE('',#1244,0.1);
#416=CIRCLE('',#1246,0.7);
#417=CIRCLE('',#1247,0.100000000000002);
#418=CIRCLE('',#1248,0.6);
#419=CIRCLE('',#1250,0.100000000000001);
#420=CIRCLE('',#1252,0.7);
#421=CIRCLE('',#1253,0.100000000000003);
#422=CIRCLE('',#1254,0.6);
#423=CIRCLE('',#1256,0.1);
#424=CIRCLE('',#1259,0.100000000000001);
#425=CIRCLE('',#1260,0.1);
#426=CIRCLE('',#1262,0.7);
#427=CIRCLE('',#1263,0.100000000000004);
#428=CIRCLE('',#1264,0.8);
#429=CIRCLE('',#1266,0.100000000000001);
#430=CIRCLE('',#1268,0.7);
#431=CIRCLE('',#1269,0.0999999999999956);
#432=CIRCLE('',#1270,0.8);
#433=CIRCLE('',#1272,0.1);
#434=CIRCLE('',#1274,0.0999999999999995);
#435=CIRCLE('',#1275,0.9);
#436=CIRCLE('',#1276,0.1);
#437=CIRCLE('',#1278,0.1);
#438=CIRCLE('',#1280,0.1);
#439=CIRCLE('',#1281,1.);
#440=CIRCLE('',#1282,0.9);
#441=CIRCLE('',#1284,0.1);
#442=CIRCLE('',#1286,0.1);
#443=CIRCLE('',#1287,1.);
#444=CIRCLE('',#1288,0.899999999999999);
#445=CIRCLE('',#1290,0.1);
#446=CIRCLE('',#1292,0.1);
#447=CIRCLE('',#1293,0.9);
#448=CIRCLE('',#1297,0.5);
#449=CIRCLE('',#1298,0.5);
#450=CIRCLE('',#1299,0.5);
#451=CIRCLE('',#1300,0.5);
#452=CIRCLE('',#1303,0.5);
#453=CIRCLE('',#1306,0.5);
#454=CIRCLE('',#1310,0.5);
#455=CIRCLE('',#1313,0.5);
#456=CIRCLE('',#1321,0.300000000000001);
#457=CIRCLE('',#1322,0.300000000000001);
#458=CIRCLE('',#1325,0.3);
#459=CIRCLE('',#1326,0.3);
#460=CIRCLE('',#1329,0.300000000000002);
#461=CIRCLE('',#1330,0.300000000000002);
#462=CIRCLE('',#1333,0.300000000000001);
#463=CIRCLE('',#1334,0.300000000000001);
#464=CIRCLE('',#1338,0.3);
#465=CIRCLE('',#1339,0.3);
#466=CIRCLE('',#1342,0.3);
#467=CIRCLE('',#1343,0.3);
#468=CIRCLE('',#1346,0.300000000000001);
#469=CIRCLE('',#1347,0.300000000000001);
#470=CIRCLE('',#1350,0.3);
#471=CIRCLE('',#1351,0.3);
#472=VERTEX_POINT('',#1744);
#473=VERTEX_POINT('',#1745);
#474=VERTEX_POINT('',#1747);
#475=VERTEX_POINT('',#1749);
#476=VERTEX_POINT('',#1753);
#477=VERTEX_POINT('',#1754);
#478=VERTEX_POINT('',#1759);
#479=VERTEX_POINT('',#1760);
#480=VERTEX_POINT('',#1765);
#481=VERTEX_POINT('',#1766);
#482=VERTEX_POINT('',#1771);
#483=VERTEX_POINT('',#1772);
#484=VERTEX_POINT('',#1777);
#485=VERTEX_POINT('',#1778);
#486=VERTEX_POINT('',#1783);
#487=VERTEX_POINT('',#1784);
#488=VERTEX_POINT('',#1792);
#489=VERTEX_POINT('',#1794);
#490=VERTEX_POINT('',#1798);
#491=VERTEX_POINT('',#1802);
#492=VERTEX_POINT('',#1806);
#493=VERTEX_POINT('',#1811);
#494=VERTEX_POINT('',#1812);
#495=VERTEX_POINT('',#1814);
#496=VERTEX_POINT('',#1816);
#497=VERTEX_POINT('',#1820);
#498=VERTEX_POINT('',#1822);
#499=VERTEX_POINT('',#1826);
#500=VERTEX_POINT('',#1828);
#501=VERTEX_POINT('',#1832);
#502=VERTEX_POINT('',#1834);
#503=VERTEX_POINT('',#1838);
#504=VERTEX_POINT('',#1839);
#505=VERTEX_POINT('',#1844);
#506=VERTEX_POINT('',#1846);
#507=VERTEX_POINT('',#1850);
#508=VERTEX_POINT('',#1851);
#509=VERTEX_POINT('',#1853);
#510=VERTEX_POINT('',#1855);
#511=VERTEX_POINT('',#1859);
#512=VERTEX_POINT('',#1861);
#513=VERTEX_POINT('',#1865);
#514=VERTEX_POINT('',#1867);
#515=VERTEX_POINT('',#1871);
#516=VERTEX_POINT('',#1873);
#517=VERTEX_POINT('',#1877);
#518=VERTEX_POINT('',#1879);
#519=VERTEX_POINT('',#1883);
#520=VERTEX_POINT('',#1885);
#521=VERTEX_POINT('',#1889);
#522=VERTEX_POINT('',#1893);
#523=VERTEX_POINT('',#1894);
#524=VERTEX_POINT('',#1899);
#525=VERTEX_POINT('',#1900);
#526=VERTEX_POINT('',#1905);
#527=VERTEX_POINT('',#1906);
#528=VERTEX_POINT('',#1911);
#529=VERTEX_POINT('',#1916);
#530=VERTEX_POINT('',#1924);
#531=VERTEX_POINT('',#1926);
#532=VERTEX_POINT('',#1928);
#533=VERTEX_POINT('',#1931);
#534=VERTEX_POINT('',#1933);
#535=VERTEX_POINT('',#1935);
#536=VERTEX_POINT('',#1937);
#537=VERTEX_POINT('',#1941);
#538=VERTEX_POINT('',#1945);
#539=VERTEX_POINT('',#1949);
#540=VERTEX_POINT('',#1953);
#541=VERTEX_POINT('',#1959);
#542=VERTEX_POINT('',#1963);
#543=VERTEX_POINT('',#1967);
#544=VERTEX_POINT('',#1980);
#545=VERTEX_POINT('',#1981);
#546=VERTEX_POINT('',#1983);
#547=VERTEX_POINT('',#1985);
#548=VERTEX_POINT('',#1989);
#549=VERTEX_POINT('',#1991);
#550=VERTEX_POINT('',#1995);
#551=VERTEX_POINT('',#1997);
#552=VERTEX_POINT('',#2001);
#553=VERTEX_POINT('',#2003);
#554=VERTEX_POINT('',#2007);
#555=VERTEX_POINT('',#2009);
#556=VERTEX_POINT('',#2013);
#557=VERTEX_POINT('',#2015);
#558=VERTEX_POINT('',#2019);
#559=VERTEX_POINT('',#2021);
#560=VERTEX_POINT('',#2030);
#561=VERTEX_POINT('',#2031);
#562=VERTEX_POINT('',#2033);
#563=VERTEX_POINT('',#2035);
#564=VERTEX_POINT('',#2039);
#565=VERTEX_POINT('',#2041);
#566=VERTEX_POINT('',#2045);
#567=VERTEX_POINT('',#2047);
#568=VERTEX_POINT('',#2051);
#569=VERTEX_POINT('',#2053);
#570=VERTEX_POINT('',#2057);
#571=VERTEX_POINT('',#2059);
#572=VERTEX_POINT('',#2063);
#573=VERTEX_POINT('',#2065);
#574=VERTEX_POINT('',#2069);
#575=VERTEX_POINT('',#2071);
#576=EDGE_CURVE('',#472,#473,#396,.T.);
#577=EDGE_CURVE('',#473,#474,#397,.T.);
#578=EDGE_CURVE('',#474,#475,#398,.T.);
#579=EDGE_CURVE('',#475,#472,#399,.T.);
#580=EDGE_CURVE('',#476,#477,#400,.T.);
#581=EDGE_CURVE('',#477,#475,#55,.T.);
#582=EDGE_CURVE('',#474,#476,#56,.T.);
#583=EDGE_CURVE('',#478,#479,#401,.T.);
#584=EDGE_CURVE('',#479,#477,#402,.T.);
#585=EDGE_CURVE('',#476,#478,#403,.T.);
#586=EDGE_CURVE('',#480,#481,#404,.T.);
#587=EDGE_CURVE('',#481,#479,#57,.T.);
#588=EDGE_CURVE('',#478,#480,#58,.T.);
#589=EDGE_CURVE('',#482,#483,#405,.T.);
#590=EDGE_CURVE('',#483,#481,#406,.T.);
#591=EDGE_CURVE('',#480,#482,#407,.T.);
#592=EDGE_CURVE('',#484,#485,#408,.T.);
#593=EDGE_CURVE('',#485,#483,#59,.T.);
#594=EDGE_CURVE('',#482,#484,#60,.T.);
#595=EDGE_CURVE('',#486,#487,#409,.T.);
#596=EDGE_CURVE('',#487,#485,#410,.T.);
#597=EDGE_CURVE('',#484,#486,#411,.T.);
#598=EDGE_CURVE('',#472,#487,#61,.T.);
#599=EDGE_CURVE('',#486,#473,#62,.T.);
#600=EDGE_CURVE('',#488,#478,#63,.T.);
#601=EDGE_CURVE('',#489,#488,#64,.T.);
#602=EDGE_CURVE('',#489,#480,#65,.T.);
#603=EDGE_CURVE('',#490,#476,#66,.T.);
#604=EDGE_CURVE('',#488,#490,#412,.T.);
#605=EDGE_CURVE('',#491,#474,#67,.T.);
#606=EDGE_CURVE('',#490,#491,#68,.T.);
#607=EDGE_CURVE('',#492,#473,#69,.T.);
#608=EDGE_CURVE('',#491,#492,#413,.T.);
#609=EDGE_CURVE('',#493,#494,#414,.T.);
#610=EDGE_CURVE('',#495,#494,#70,.T.);
#611=EDGE_CURVE('',#495,#496,#415,.T.);
#612=EDGE_CURVE('',#496,#493,#71,.T.);
#613=EDGE_CURVE('',#497,#495,#416,.T.);
#614=EDGE_CURVE('',#497,#498,#417,.T.);
#615=EDGE_CURVE('',#498,#496,#418,.T.);
#616=EDGE_CURVE('',#499,#497,#72,.T.);
#617=EDGE_CURVE('',#499,#500,#419,.T.);
#618=EDGE_CURVE('',#500,#498,#73,.T.);
#619=EDGE_CURVE('',#501,#499,#420,.T.);
#620=EDGE_CURVE('',#501,#502,#421,.T.);
#621=EDGE_CURVE('',#502,#500,#422,.T.);
#622=EDGE_CURVE('',#503,#504,#423,.T.);
#623=EDGE_CURVE('',#504,#502,#74,.T.);
#624=EDGE_CURVE('',#503,#501,#75,.T.);
#625=EDGE_CURVE('',#505,#503,#76,.T.);
#626=EDGE_CURVE('',#505,#506,#77,.T.);
#627=EDGE_CURVE('',#504,#506,#78,.T.);
#628=EDGE_CURVE('',#507,#508,#424,.T.);
#629=EDGE_CURVE('',#508,#509,#79,.T.);
#630=EDGE_CURVE('',#509,#510,#425,.T.);
#631=EDGE_CURVE('',#507,#510,#80,.T.);
#632=EDGE_CURVE('',#511,#507,#426,.T.);
#633=EDGE_CURVE('',#511,#512,#427,.T.);
#634=EDGE_CURVE('',#512,#508,#428,.T.);
#635=EDGE_CURVE('',#513,#511,#81,.T.);
#636=EDGE_CURVE('',#513,#514,#429,.T.);
#637=EDGE_CURVE('',#514,#512,#82,.T.);
#638=EDGE_CURVE('',#515,#513,#430,.T.);
#639=EDGE_CURVE('',#515,#516,#431,.T.);
#640=EDGE_CURVE('',#516,#514,#432,.T.);
#641=EDGE_CURVE('',#517,#515,#83,.T.);
#642=EDGE_CURVE('',#517,#518,#433,.T.);
#643=EDGE_CURVE('',#518,#516,#84,.T.);
#644=EDGE_CURVE('',#490,#519,#434,.T.);
#645=EDGE_CURVE('',#519,#520,#435,.T.);
#646=EDGE_CURVE('',#520,#488,#436,.T.);
#647=EDGE_CURVE('',#521,#489,#437,.T.);
#648=EDGE_CURVE('',#520,#521,#85,.T.);
#649=EDGE_CURVE('',#522,#523,#438,.T.);
#650=EDGE_CURVE('',#523,#489,#439,.T.);
#651=EDGE_CURVE('',#521,#522,#440,.T.);
#652=EDGE_CURVE('',#524,#525,#441,.T.);
#653=EDGE_CURVE('',#525,#523,#86,.T.);
#654=EDGE_CURVE('',#522,#524,#87,.T.);
#655=EDGE_CURVE('',#526,#527,#442,.T.);
#656=EDGE_CURVE('',#527,#525,#443,.T.);
#657=EDGE_CURVE('',#524,#526,#444,.T.);
#658=EDGE_CURVE('',#528,#492,#445,.T.);
#659=EDGE_CURVE('',#492,#527,#88,.T.);
#660=EDGE_CURVE('',#526,#528,#89,.T.);
#661=EDGE_CURVE('',#529,#491,#446,.T.);
#662=EDGE_CURVE('',#528,#529,#447,.T.);
#663=EDGE_CURVE('',#529,#519,#90,.T.);
#664=EDGE_CURVE('',#527,#486,#91,.T.);
#665=EDGE_CURVE('',#518,#530,#92,.T.);
#666=EDGE_CURVE('',#530,#531,#448,.T.);
#667=EDGE_CURVE('',#531,#532,#93,.T.);
#668=EDGE_CURVE('',#532,#505,#449,.T.);
#669=EDGE_CURVE('',#494,#533,#94,.T.);
#670=EDGE_CURVE('',#533,#534,#450,.T.);
#671=EDGE_CURVE('',#534,#535,#95,.T.);
#672=EDGE_CURVE('',#535,#536,#451,.T.);
#673=EDGE_CURVE('',#536,#509,#96,.T.);
#674=EDGE_CURVE('',#537,#493,#97,.T.);
#675=EDGE_CURVE('',#533,#537,#98,.T.);
#676=EDGE_CURVE('',#538,#537,#452,.T.);
#677=EDGE_CURVE('',#534,#538,#99,.T.);
#678=EDGE_CURVE('',#539,#538,#100,.T.);
#679=EDGE_CURVE('',#535,#539,#101,.T.);
#680=EDGE_CURVE('',#540,#539,#453,.T.);
#681=EDGE_CURVE('',#536,#540,#102,.T.);
#682=EDGE_CURVE('',#510,#540,#103,.T.);
#683=EDGE_CURVE('',#541,#517,#104,.T.);
#684=EDGE_CURVE('',#530,#541,#105,.T.);
#685=EDGE_CURVE('',#542,#541,#454,.T.);
#686=EDGE_CURVE('',#531,#542,#106,.T.);
#687=EDGE_CURVE('',#543,#542,#107,.T.);
#688=EDGE_CURVE('',#532,#543,#108,.T.);
#689=EDGE_CURVE('',#506,#543,#455,.T.);
#690=EDGE_CURVE('',#525,#484,#109,.T.);
#691=EDGE_CURVE('',#523,#482,#110,.T.);
#692=EDGE_CURVE('',#544,#545,#111,.T.);
#693=EDGE_CURVE('',#544,#546,#112,.T.);
#694=EDGE_CURVE('',#547,#546,#113,.T.);
#695=EDGE_CURVE('',#545,#547,#114,.T.);
#696=EDGE_CURVE('',#545,#548,#456,.T.);
#697=EDGE_CURVE('',#549,#547,#457,.T.);
#698=EDGE_CURVE('',#548,#549,#115,.T.);
#699=EDGE_CURVE('',#548,#550,#116,.T.);
#700=EDGE_CURVE('',#551,#549,#117,.T.);
#701=EDGE_CURVE('',#550,#551,#118,.T.);
#702=EDGE_CURVE('',#550,#552,#458,.T.);
#703=EDGE_CURVE('',#553,#551,#459,.T.);
#704=EDGE_CURVE('',#552,#553,#119,.T.);
#705=EDGE_CURVE('',#552,#554,#120,.T.);
#706=EDGE_CURVE('',#555,#553,#121,.T.);
#707=EDGE_CURVE('',#554,#555,#122,.T.);
#708=EDGE_CURVE('',#554,#556,#460,.T.);
#709=EDGE_CURVE('',#557,#555,#461,.T.);
#710=EDGE_CURVE('',#556,#557,#123,.T.);
#711=EDGE_CURVE('',#556,#558,#124,.T.);
#712=EDGE_CURVE('',#559,#557,#125,.T.);
#713=EDGE_CURVE('',#558,#559,#126,.T.);
#714=EDGE_CURVE('',#558,#544,#462,.T.);
#715=EDGE_CURVE('',#546,#559,#463,.T.);
#716=EDGE_CURVE('',#560,#561,#464,.T.);
#717=EDGE_CURVE('',#560,#562,#127,.T.);
#718=EDGE_CURVE('',#563,#562,#465,.T.);
#719=EDGE_CURVE('',#561,#563,#128,.T.);
#720=EDGE_CURVE('',#561,#564,#129,.T.);
#721=EDGE_CURVE('',#565,#563,#130,.T.);
#722=EDGE_CURVE('',#564,#565,#131,.T.);
#723=EDGE_CURVE('',#564,#566,#466,.T.);
#724=EDGE_CURVE('',#567,#565,#467,.T.);
#725=EDGE_CURVE('',#566,#567,#132,.T.);
#726=EDGE_CURVE('',#566,#568,#133,.T.);
#727=EDGE_CURVE('',#569,#567,#134,.T.);
#728=EDGE_CURVE('',#568,#569,#135,.T.);
#729=EDGE_CURVE('',#568,#570,#468,.T.);
#730=EDGE_CURVE('',#571,#569,#469,.T.);
#731=EDGE_CURVE('',#570,#571,#136,.T.);
#732=EDGE_CURVE('',#570,#572,#137,.T.);
#733=EDGE_CURVE('',#573,#571,#138,.T.);
#734=EDGE_CURVE('',#572,#573,#139,.T.);
#735=EDGE_CURVE('',#572,#574,#470,.T.);
#736=EDGE_CURVE('',#575,#573,#471,.T.);
#737=EDGE_CURVE('',#574,#575,#140,.T.);
#738=EDGE_CURVE('',#574,#560,#141,.T.);
#739=EDGE_CURVE('',#562,#575,#142,.T.);
#740=ORIENTED_EDGE('',*,*,#576,.T.);
#741=ORIENTED_EDGE('',*,*,#577,.T.);
#742=ORIENTED_EDGE('',*,*,#578,.T.);
#743=ORIENTED_EDGE('',*,*,#579,.T.);
#744=ORIENTED_EDGE('',*,*,#580,.T.);
#745=ORIENTED_EDGE('',*,*,#581,.T.);
#746=ORIENTED_EDGE('',*,*,#578,.F.);
#747=ORIENTED_EDGE('',*,*,#582,.T.);
#748=ORIENTED_EDGE('',*,*,#583,.T.);
#749=ORIENTED_EDGE('',*,*,#584,.T.);
#750=ORIENTED_EDGE('',*,*,#580,.F.);
#751=ORIENTED_EDGE('',*,*,#585,.T.);
#752=ORIENTED_EDGE('',*,*,#586,.T.);
#753=ORIENTED_EDGE('',*,*,#587,.T.);
#754=ORIENTED_EDGE('',*,*,#583,.F.);
#755=ORIENTED_EDGE('',*,*,#588,.T.);
#756=ORIENTED_EDGE('',*,*,#589,.T.);
#757=ORIENTED_EDGE('',*,*,#590,.T.);
#758=ORIENTED_EDGE('',*,*,#586,.F.);
#759=ORIENTED_EDGE('',*,*,#591,.T.);
#760=ORIENTED_EDGE('',*,*,#592,.T.);
#761=ORIENTED_EDGE('',*,*,#593,.T.);
#762=ORIENTED_EDGE('',*,*,#589,.F.);
#763=ORIENTED_EDGE('',*,*,#594,.T.);
#764=ORIENTED_EDGE('',*,*,#595,.T.);
#765=ORIENTED_EDGE('',*,*,#596,.T.);
#766=ORIENTED_EDGE('',*,*,#592,.F.);
#767=ORIENTED_EDGE('',*,*,#597,.T.);
#768=ORIENTED_EDGE('',*,*,#576,.F.);
#769=ORIENTED_EDGE('',*,*,#598,.T.);
#770=ORIENTED_EDGE('',*,*,#595,.F.);
#771=ORIENTED_EDGE('',*,*,#599,.T.);
#772=ORIENTED_EDGE('',*,*,#588,.F.);
#773=ORIENTED_EDGE('',*,*,#600,.F.);
#774=ORIENTED_EDGE('',*,*,#601,.F.);
#775=ORIENTED_EDGE('',*,*,#602,.T.);
#776=ORIENTED_EDGE('',*,*,#585,.F.);
#777=ORIENTED_EDGE('',*,*,#603,.F.);
#778=ORIENTED_EDGE('',*,*,#604,.F.);
#779=ORIENTED_EDGE('',*,*,#600,.T.);
#780=ORIENTED_EDGE('',*,*,#582,.F.);
#781=ORIENTED_EDGE('',*,*,#605,.F.);
#782=ORIENTED_EDGE('',*,*,#606,.F.);
#783=ORIENTED_EDGE('',*,*,#603,.T.);
#784=ORIENTED_EDGE('',*,*,#577,.F.);
#785=ORIENTED_EDGE('',*,*,#607,.F.);
#786=ORIENTED_EDGE('',*,*,#608,.F.);
#787=ORIENTED_EDGE('',*,*,#605,.T.);
#788=ORIENTED_EDGE('',*,*,#579,.F.);
#789=ORIENTED_EDGE('',*,*,#581,.F.);
#790=ORIENTED_EDGE('',*,*,#584,.F.);
#791=ORIENTED_EDGE('',*,*,#587,.F.);
#792=ORIENTED_EDGE('',*,*,#590,.F.);
#793=ORIENTED_EDGE('',*,*,#593,.F.);
#794=ORIENTED_EDGE('',*,*,#596,.F.);
#795=ORIENTED_EDGE('',*,*,#598,.F.);
#796=ORIENTED_EDGE('',*,*,#609,.T.);
#797=ORIENTED_EDGE('',*,*,#610,.F.);
#798=ORIENTED_EDGE('',*,*,#611,.T.);
#799=ORIENTED_EDGE('',*,*,#612,.T.);
#800=ORIENTED_EDGE('',*,*,#611,.F.);
#801=ORIENTED_EDGE('',*,*,#613,.F.);
#802=ORIENTED_EDGE('',*,*,#614,.T.);
#803=ORIENTED_EDGE('',*,*,#615,.T.);
#804=ORIENTED_EDGE('',*,*,#614,.F.);
#805=ORIENTED_EDGE('',*,*,#616,.F.);
#806=ORIENTED_EDGE('',*,*,#617,.T.);
#807=ORIENTED_EDGE('',*,*,#618,.T.);
#808=ORIENTED_EDGE('',*,*,#617,.F.);
#809=ORIENTED_EDGE('',*,*,#619,.F.);
#810=ORIENTED_EDGE('',*,*,#620,.T.);
#811=ORIENTED_EDGE('',*,*,#621,.T.);
#812=ORIENTED_EDGE('',*,*,#622,.T.);
#813=ORIENTED_EDGE('',*,*,#623,.T.);
#814=ORIENTED_EDGE('',*,*,#620,.F.);
#815=ORIENTED_EDGE('',*,*,#624,.F.);
#816=ORIENTED_EDGE('',*,*,#622,.F.);
#817=ORIENTED_EDGE('',*,*,#625,.F.);
#818=ORIENTED_EDGE('',*,*,#626,.T.);
#819=ORIENTED_EDGE('',*,*,#627,.F.);
#820=ORIENTED_EDGE('',*,*,#628,.T.);
#821=ORIENTED_EDGE('',*,*,#629,.T.);
#822=ORIENTED_EDGE('',*,*,#630,.T.);
#823=ORIENTED_EDGE('',*,*,#631,.F.);
#824=ORIENTED_EDGE('',*,*,#628,.F.);
#825=ORIENTED_EDGE('',*,*,#632,.F.);
#826=ORIENTED_EDGE('',*,*,#633,.T.);
#827=ORIENTED_EDGE('',*,*,#634,.T.);
#828=ORIENTED_EDGE('',*,*,#633,.F.);
#829=ORIENTED_EDGE('',*,*,#635,.F.);
#830=ORIENTED_EDGE('',*,*,#636,.T.);
#831=ORIENTED_EDGE('',*,*,#637,.T.);
#832=ORIENTED_EDGE('',*,*,#636,.F.);
#833=ORIENTED_EDGE('',*,*,#638,.F.);
#834=ORIENTED_EDGE('',*,*,#639,.T.);
#835=ORIENTED_EDGE('',*,*,#640,.T.);
#836=ORIENTED_EDGE('',*,*,#639,.F.);
#837=ORIENTED_EDGE('',*,*,#641,.F.);
#838=ORIENTED_EDGE('',*,*,#642,.T.);
#839=ORIENTED_EDGE('',*,*,#643,.T.);
#840=ORIENTED_EDGE('',*,*,#644,.T.);
#841=ORIENTED_EDGE('',*,*,#645,.T.);
#842=ORIENTED_EDGE('',*,*,#646,.T.);
#843=ORIENTED_EDGE('',*,*,#604,.T.);
#844=ORIENTED_EDGE('',*,*,#647,.T.);
#845=ORIENTED_EDGE('',*,*,#601,.T.);
#846=ORIENTED_EDGE('',*,*,#646,.F.);
#847=ORIENTED_EDGE('',*,*,#648,.T.);
#848=ORIENTED_EDGE('',*,*,#649,.T.);
#849=ORIENTED_EDGE('',*,*,#650,.T.);
#850=ORIENTED_EDGE('',*,*,#647,.F.);
#851=ORIENTED_EDGE('',*,*,#651,.T.);
#852=ORIENTED_EDGE('',*,*,#652,.T.);
#853=ORIENTED_EDGE('',*,*,#653,.T.);
#854=ORIENTED_EDGE('',*,*,#649,.F.);
#855=ORIENTED_EDGE('',*,*,#654,.T.);
#856=ORIENTED_EDGE('',*,*,#655,.T.);
#857=ORIENTED_EDGE('',*,*,#656,.T.);
#858=ORIENTED_EDGE('',*,*,#652,.F.);
#859=ORIENTED_EDGE('',*,*,#657,.T.);
#860=ORIENTED_EDGE('',*,*,#658,.T.);
#861=ORIENTED_EDGE('',*,*,#659,.T.);
#862=ORIENTED_EDGE('',*,*,#655,.F.);
#863=ORIENTED_EDGE('',*,*,#660,.T.);
#864=ORIENTED_EDGE('',*,*,#661,.T.);
#865=ORIENTED_EDGE('',*,*,#608,.T.);
#866=ORIENTED_EDGE('',*,*,#658,.F.);
#867=ORIENTED_EDGE('',*,*,#662,.T.);
#868=ORIENTED_EDGE('',*,*,#644,.F.);
#869=ORIENTED_EDGE('',*,*,#606,.T.);
#870=ORIENTED_EDGE('',*,*,#661,.F.);
#871=ORIENTED_EDGE('',*,*,#663,.T.);
#872=ORIENTED_EDGE('',*,*,#599,.F.);
#873=ORIENTED_EDGE('',*,*,#664,.F.);
#874=ORIENTED_EDGE('',*,*,#659,.F.);
#875=ORIENTED_EDGE('',*,*,#607,.T.);
#876=ORIENTED_EDGE('',*,*,#645,.F.);
#877=ORIENTED_EDGE('',*,*,#663,.F.);
#878=ORIENTED_EDGE('',*,*,#662,.F.);
#879=ORIENTED_EDGE('',*,*,#660,.F.);
#880=ORIENTED_EDGE('',*,*,#657,.F.);
#881=ORIENTED_EDGE('',*,*,#654,.F.);
#882=ORIENTED_EDGE('',*,*,#651,.F.);
#883=ORIENTED_EDGE('',*,*,#648,.F.);
#884=ORIENTED_EDGE('',*,*,#665,.T.);
#885=ORIENTED_EDGE('',*,*,#666,.T.);
#886=ORIENTED_EDGE('',*,*,#667,.T.);
#887=ORIENTED_EDGE('',*,*,#668,.T.);
#888=ORIENTED_EDGE('',*,*,#625,.T.);
#889=ORIENTED_EDGE('',*,*,#624,.T.);
#890=ORIENTED_EDGE('',*,*,#619,.T.);
#891=ORIENTED_EDGE('',*,*,#616,.T.);
#892=ORIENTED_EDGE('',*,*,#613,.T.);
#893=ORIENTED_EDGE('',*,*,#610,.T.);
#894=ORIENTED_EDGE('',*,*,#669,.T.);
#895=ORIENTED_EDGE('',*,*,#670,.T.);
#896=ORIENTED_EDGE('',*,*,#671,.T.);
#897=ORIENTED_EDGE('',*,*,#672,.T.);
#898=ORIENTED_EDGE('',*,*,#673,.T.);
#899=ORIENTED_EDGE('',*,*,#629,.F.);
#900=ORIENTED_EDGE('',*,*,#634,.F.);
#901=ORIENTED_EDGE('',*,*,#637,.F.);
#902=ORIENTED_EDGE('',*,*,#640,.F.);
#903=ORIENTED_EDGE('',*,*,#643,.F.);
#904=ORIENTED_EDGE('',*,*,#609,.F.);
#905=ORIENTED_EDGE('',*,*,#674,.F.);
#906=ORIENTED_EDGE('',*,*,#675,.F.);
#907=ORIENTED_EDGE('',*,*,#669,.F.);
#908=ORIENTED_EDGE('',*,*,#670,.F.);
#909=ORIENTED_EDGE('',*,*,#675,.T.);
#910=ORIENTED_EDGE('',*,*,#676,.F.);
#911=ORIENTED_EDGE('',*,*,#677,.F.);
#912=ORIENTED_EDGE('',*,*,#671,.F.);
#913=ORIENTED_EDGE('',*,*,#677,.T.);
#914=ORIENTED_EDGE('',*,*,#678,.F.);
#915=ORIENTED_EDGE('',*,*,#679,.F.);
#916=ORIENTED_EDGE('',*,*,#672,.F.);
#917=ORIENTED_EDGE('',*,*,#679,.T.);
#918=ORIENTED_EDGE('',*,*,#680,.F.);
#919=ORIENTED_EDGE('',*,*,#681,.F.);
#920=ORIENTED_EDGE('',*,*,#673,.F.);
#921=ORIENTED_EDGE('',*,*,#681,.T.);
#922=ORIENTED_EDGE('',*,*,#682,.F.);
#923=ORIENTED_EDGE('',*,*,#630,.F.);
#924=ORIENTED_EDGE('',*,*,#665,.F.);
#925=ORIENTED_EDGE('',*,*,#642,.F.);
#926=ORIENTED_EDGE('',*,*,#683,.F.);
#927=ORIENTED_EDGE('',*,*,#684,.F.);
#928=ORIENTED_EDGE('',*,*,#666,.F.);
#929=ORIENTED_EDGE('',*,*,#684,.T.);
#930=ORIENTED_EDGE('',*,*,#685,.F.);
#931=ORIENTED_EDGE('',*,*,#686,.F.);
#932=ORIENTED_EDGE('',*,*,#667,.F.);
#933=ORIENTED_EDGE('',*,*,#686,.T.);
#934=ORIENTED_EDGE('',*,*,#687,.F.);
#935=ORIENTED_EDGE('',*,*,#688,.F.);
#936=ORIENTED_EDGE('',*,*,#668,.F.);
#937=ORIENTED_EDGE('',*,*,#688,.T.);
#938=ORIENTED_EDGE('',*,*,#689,.F.);
#939=ORIENTED_EDGE('',*,*,#626,.F.);
#940=ORIENTED_EDGE('',*,*,#623,.F.);
#941=ORIENTED_EDGE('',*,*,#627,.T.);
#942=ORIENTED_EDGE('',*,*,#689,.T.);
#943=ORIENTED_EDGE('',*,*,#687,.T.);
#944=ORIENTED_EDGE('',*,*,#685,.T.);
#945=ORIENTED_EDGE('',*,*,#683,.T.);
#946=ORIENTED_EDGE('',*,*,#641,.T.);
#947=ORIENTED_EDGE('',*,*,#638,.T.);
#948=ORIENTED_EDGE('',*,*,#635,.T.);
#949=ORIENTED_EDGE('',*,*,#632,.T.);
#950=ORIENTED_EDGE('',*,*,#631,.T.);
#951=ORIENTED_EDGE('',*,*,#682,.T.);
#952=ORIENTED_EDGE('',*,*,#680,.T.);
#953=ORIENTED_EDGE('',*,*,#678,.T.);
#954=ORIENTED_EDGE('',*,*,#676,.T.);
#955=ORIENTED_EDGE('',*,*,#674,.T.);
#956=ORIENTED_EDGE('',*,*,#612,.F.);
#957=ORIENTED_EDGE('',*,*,#615,.F.);
#958=ORIENTED_EDGE('',*,*,#618,.F.);
#959=ORIENTED_EDGE('',*,*,#621,.F.);
#960=ORIENTED_EDGE('',*,*,#597,.F.);
#961=ORIENTED_EDGE('',*,*,#690,.F.);
#962=ORIENTED_EDGE('',*,*,#656,.F.);
#963=ORIENTED_EDGE('',*,*,#664,.T.);
#964=ORIENTED_EDGE('',*,*,#594,.F.);
#965=ORIENTED_EDGE('',*,*,#691,.F.);
#966=ORIENTED_EDGE('',*,*,#653,.F.);
#967=ORIENTED_EDGE('',*,*,#690,.T.);
#968=ORIENTED_EDGE('',*,*,#591,.F.);
#969=ORIENTED_EDGE('',*,*,#602,.F.);
#970=ORIENTED_EDGE('',*,*,#650,.F.);
#971=ORIENTED_EDGE('',*,*,#691,.T.);
#972=ORIENTED_EDGE('',*,*,#692,.F.);
#973=ORIENTED_EDGE('',*,*,#693,.T.);
#974=ORIENTED_EDGE('',*,*,#694,.F.);
#975=ORIENTED_EDGE('',*,*,#695,.F.);
#976=ORIENTED_EDGE('',*,*,#696,.F.);
#977=ORIENTED_EDGE('',*,*,#695,.T.);
#978=ORIENTED_EDGE('',*,*,#697,.F.);
#979=ORIENTED_EDGE('',*,*,#698,.F.);
#980=ORIENTED_EDGE('',*,*,#699,.F.);
#981=ORIENTED_EDGE('',*,*,#698,.T.);
#982=ORIENTED_EDGE('',*,*,#700,.F.);
#983=ORIENTED_EDGE('',*,*,#701,.F.);
#984=ORIENTED_EDGE('',*,*,#702,.F.);
#985=ORIENTED_EDGE('',*,*,#701,.T.);
#986=ORIENTED_EDGE('',*,*,#703,.F.);
#987=ORIENTED_EDGE('',*,*,#704,.F.);
#988=ORIENTED_EDGE('',*,*,#705,.F.);
#989=ORIENTED_EDGE('',*,*,#704,.T.);
#990=ORIENTED_EDGE('',*,*,#706,.F.);
#991=ORIENTED_EDGE('',*,*,#707,.F.);
#992=ORIENTED_EDGE('',*,*,#708,.F.);
#993=ORIENTED_EDGE('',*,*,#707,.T.);
#994=ORIENTED_EDGE('',*,*,#709,.F.);
#995=ORIENTED_EDGE('',*,*,#710,.F.);
#996=ORIENTED_EDGE('',*,*,#711,.F.);
#997=ORIENTED_EDGE('',*,*,#710,.T.);
#998=ORIENTED_EDGE('',*,*,#712,.F.);
#999=ORIENTED_EDGE('',*,*,#713,.F.);
#1000=ORIENTED_EDGE('',*,*,#714,.F.);
#1001=ORIENTED_EDGE('',*,*,#713,.T.);
#1002=ORIENTED_EDGE('',*,*,#715,.F.);
#1003=ORIENTED_EDGE('',*,*,#693,.F.);
#1004=ORIENTED_EDGE('',*,*,#714,.T.);
#1005=ORIENTED_EDGE('',*,*,#692,.T.);
#1006=ORIENTED_EDGE('',*,*,#696,.T.);
#1007=ORIENTED_EDGE('',*,*,#699,.T.);
#1008=ORIENTED_EDGE('',*,*,#702,.T.);
#1009=ORIENTED_EDGE('',*,*,#705,.T.);
#1010=ORIENTED_EDGE('',*,*,#708,.T.);
#1011=ORIENTED_EDGE('',*,*,#711,.T.);
#1012=ORIENTED_EDGE('',*,*,#715,.T.);
#1013=ORIENTED_EDGE('',*,*,#712,.T.);
#1014=ORIENTED_EDGE('',*,*,#709,.T.);
#1015=ORIENTED_EDGE('',*,*,#706,.T.);
#1016=ORIENTED_EDGE('',*,*,#703,.T.);
#1017=ORIENTED_EDGE('',*,*,#700,.T.);
#1018=ORIENTED_EDGE('',*,*,#697,.T.);
#1019=ORIENTED_EDGE('',*,*,#694,.T.);
#1020=ORIENTED_EDGE('',*,*,#716,.F.);
#1021=ORIENTED_EDGE('',*,*,#717,.T.);
#1022=ORIENTED_EDGE('',*,*,#718,.F.);
#1023=ORIENTED_EDGE('',*,*,#719,.F.);
#1024=ORIENTED_EDGE('',*,*,#720,.F.);
#1025=ORIENTED_EDGE('',*,*,#719,.T.);
#1026=ORIENTED_EDGE('',*,*,#721,.F.);
#1027=ORIENTED_EDGE('',*,*,#722,.F.);
#1028=ORIENTED_EDGE('',*,*,#723,.F.);
#1029=ORIENTED_EDGE('',*,*,#722,.T.);
#1030=ORIENTED_EDGE('',*,*,#724,.F.);
#1031=ORIENTED_EDGE('',*,*,#725,.F.);
#1032=ORIENTED_EDGE('',*,*,#726,.F.);
#1033=ORIENTED_EDGE('',*,*,#725,.T.);
#1034=ORIENTED_EDGE('',*,*,#727,.F.);
#1035=ORIENTED_EDGE('',*,*,#728,.F.);
#1036=ORIENTED_EDGE('',*,*,#729,.F.);
#1037=ORIENTED_EDGE('',*,*,#728,.T.);
#1038=ORIENTED_EDGE('',*,*,#730,.F.);
#1039=ORIENTED_EDGE('',*,*,#731,.F.);
#1040=ORIENTED_EDGE('',*,*,#732,.F.);
#1041=ORIENTED_EDGE('',*,*,#731,.T.);
#1042=ORIENTED_EDGE('',*,*,#733,.F.);
#1043=ORIENTED_EDGE('',*,*,#734,.F.);
#1044=ORIENTED_EDGE('',*,*,#735,.F.);
#1045=ORIENTED_EDGE('',*,*,#734,.T.);
#1046=ORIENTED_EDGE('',*,*,#736,.F.);
#1047=ORIENTED_EDGE('',*,*,#737,.F.);
#1048=ORIENTED_EDGE('',*,*,#738,.F.);
#1049=ORIENTED_EDGE('',*,*,#737,.T.);
#1050=ORIENTED_EDGE('',*,*,#739,.F.);
#1051=ORIENTED_EDGE('',*,*,#717,.F.);
#1052=ORIENTED_EDGE('',*,*,#738,.T.);
#1053=ORIENTED_EDGE('',*,*,#716,.T.);
#1054=ORIENTED_EDGE('',*,*,#720,.T.);
#1055=ORIENTED_EDGE('',*,*,#723,.T.);
#1056=ORIENTED_EDGE('',*,*,#726,.T.);
#1057=ORIENTED_EDGE('',*,*,#729,.T.);
#1058=ORIENTED_EDGE('',*,*,#732,.T.);
#1059=ORIENTED_EDGE('',*,*,#735,.T.);
#1060=ORIENTED_EDGE('',*,*,#739,.T.);
#1061=ORIENTED_EDGE('',*,*,#736,.T.);
#1062=ORIENTED_EDGE('',*,*,#733,.T.);
#1063=ORIENTED_EDGE('',*,*,#730,.T.);
#1064=ORIENTED_EDGE('',*,*,#727,.T.);
#1065=ORIENTED_EDGE('',*,*,#724,.T.);
#1066=ORIENTED_EDGE('',*,*,#721,.T.);
#1067=ORIENTED_EDGE('',*,*,#718,.T.);
#1068=TOROIDAL_SURFACE('',#1211,0.7,0.3);
#1069=TOROIDAL_SURFACE('',#1218,0.7,0.3);
#1070=TOROIDAL_SURFACE('',#1224,0.7,0.3);
#1071=TOROIDAL_SURFACE('',#1230,0.7,0.3);
#1072=TOROIDAL_SURFACE('',#1245,0.6,0.1);
#1073=TOROIDAL_SURFACE('',#1251,0.6,0.1);
#1074=TOROIDAL_SURFACE('',#1261,0.8,0.1);
#1075=TOROIDAL_SURFACE('',#1267,0.8,0.1);
#1076=TOROIDAL_SURFACE('',#1273,0.9,0.1);
#1077=TOROIDAL_SURFACE('',#1279,0.9,0.1);
#1078=TOROIDAL_SURFACE('',#1285,0.9,0.1);
#1079=TOROIDAL_SURFACE('',#1291,0.9,0.1);
#1080=ADVANCED_FACE('',(#261),#1068,.T.);
#1081=ADVANCED_FACE('',(#262),#231,.T.);
#1082=ADVANCED_FACE('',(#263),#1069,.T.);
#1083=ADVANCED_FACE('',(#264),#232,.T.);
#1084=ADVANCED_FACE('',(#265),#1070,.T.);
#1085=ADVANCED_FACE('',(#266),#233,.T.);
#1086=ADVANCED_FACE('',(#267),#1071,.T.);
#1087=ADVANCED_FACE('',(#268),#234,.T.);
#1088=ADVANCED_FACE('',(#269),#30,.T.);
#1089=ADVANCED_FACE('',(#270),#235,.T.);
#1090=ADVANCED_FACE('',(#271),#31,.T.);
#1091=ADVANCED_FACE('',(#272),#236,.T.);
#1092=ADVANCED_FACE('',(#273),#32,.T.);
#1093=ADVANCED_FACE('',(#274),#237,.T.);
#1094=ADVANCED_FACE('',(#275),#1072,.T.);
#1095=ADVANCED_FACE('',(#276),#238,.T.);
#1096=ADVANCED_FACE('',(#277),#1073,.T.);
#1097=ADVANCED_FACE('',(#278),#239,.T.);
#1098=ADVANCED_FACE('',(#279),#33,.T.);
#1099=ADVANCED_FACE('',(#280),#240,.F.);
#1100=ADVANCED_FACE('',(#281),#1074,.F.);
#1101=ADVANCED_FACE('',(#282),#241,.F.);
#1102=ADVANCED_FACE('',(#283),#1075,.F.);
#1103=ADVANCED_FACE('',(#284),#242,.F.);
#1104=ADVANCED_FACE('',(#285),#1076,.T.);
#1105=ADVANCED_FACE('',(#286),#243,.T.);
#1106=ADVANCED_FACE('',(#287),#1077,.T.);
#1107=ADVANCED_FACE('',(#288),#244,.T.);
#1108=ADVANCED_FACE('',(#289),#1078,.T.);
#1109=ADVANCED_FACE('',(#290),#245,.T.);
#1110=ADVANCED_FACE('',(#291),#1079,.T.);
#1111=ADVANCED_FACE('',(#292),#246,.T.);
#1112=ADVANCED_FACE('',(#293),#34,.T.);
#1113=ADVANCED_FACE('',(#294,#29),#35,.F.);
#1114=ADVANCED_FACE('',(#295),#36,.T.);
#1115=ADVANCED_FACE('',(#296),#247,.F.);
#1116=ADVANCED_FACE('',(#297),#37,.T.);
#1117=ADVANCED_FACE('',(#298),#248,.F.);
#1118=ADVANCED_FACE('',(#299),#38,.T.);
#1119=ADVANCED_FACE('',(#300),#39,.T.);
#1120=ADVANCED_FACE('',(#301),#249,.F.);
#1121=ADVANCED_FACE('',(#302),#40,.T.);
#1122=ADVANCED_FACE('',(#303),#250,.F.);
#1123=ADVANCED_FACE('',(#304),#41,.T.);
#1124=ADVANCED_FACE('',(#305),#251,.T.);
#1125=ADVANCED_FACE('',(#306),#42,.T.);
#1126=ADVANCED_FACE('',(#307),#252,.T.);
#1127=ADVANCED_FACE('',(#308),#43,.T.);
#1128=ADVANCED_FACE('',(#309),#253,.T.);
#1129=ADVANCED_FACE('',(#310),#44,.T.);
#1130=ADVANCED_FACE('',(#311),#254,.T.);
#1131=ADVANCED_FACE('',(#312),#45,.T.);
#1132=ADVANCED_FACE('',(#313),#255,.T.);
#1133=ADVANCED_FACE('',(#314),#46,.T.);
#1134=ADVANCED_FACE('',(#315),#256,.T.);
#1135=ADVANCED_FACE('',(#316),#47,.T.);
#1136=ADVANCED_FACE('',(#317),#48,.F.);
#1137=ADVANCED_FACE('',(#318),#257,.T.);
#1138=ADVANCED_FACE('',(#319),#49,.T.);
#1139=ADVANCED_FACE('',(#320),#258,.T.);
#1140=ADVANCED_FACE('',(#321),#50,.T.);
#1141=ADVANCED_FACE('',(#322),#259,.T.);
#1142=ADVANCED_FACE('',(#323),#51,.T.);
#1143=ADVANCED_FACE('',(#324),#260,.T.);
#1144=ADVANCED_FACE('',(#325),#52,.T.);
#1145=ADVANCED_FACE('',(#326),#53,.T.);
#1146=ADVANCED_FACE('',(#327),#54,.F.);
#1147=CLOSED_SHELL('',(#1080,#1081,#1082,#1083,#1084,#1085,#1086,#1087,
#1088,#1089,#1090,#1091,#1092,#1093,#1094,#1095,#1096,#1097,#1098,#1099,
#1100,#1101,#1102,#1103,#1104,#1105,#1106,#1107,#1108,#1109,#1110,#1111,
#1112,#1113,#1114,#1115,#1116,#1117,#1118,#1119,#1120,#1121,#1122,#1123,
#1124,#1125,#1126));
#1148=CLOSED_SHELL('',(#1127,#1128,#1129,#1130,#1131,#1132,#1133,#1134,
#1135,#1136));
#1149=CLOSED_SHELL('',(#1137,#1138,#1139,#1140,#1141,#1142,#1143,#1144,
#1145,#1146));
#1150=DERIVED_UNIT_ELEMENT(#1154,1.);
#1151=DERIVED_UNIT_ELEMENT(#2090,3.);
#1152=DERIVED_UNIT_ELEMENT(#1154,1.);
#1153=DERIVED_UNIT_ELEMENT(#2090,3.);
#1154=(
MASS_UNIT()
NAMED_UNIT(*)
SI_UNIT($,.GRAM.)
);
#1155=DERIVED_UNIT((#1150,#1151));
#1156=DERIVED_UNIT((#1152,#1153));
#1157=MEASURE_REPRESENTATION_ITEM('density measure',
POSITIVE_RATIO_MEASURE(1.),#1155);
#1158=MEASURE_REPRESENTATION_ITEM('density measure',
POSITIVE_RATIO_MEASURE(1.),#1156);
#1159=PROPERTY_DEFINITION_REPRESENTATION(#1169,#1163);
#1160=PROPERTY_DEFINITION_REPRESENTATION(#1170,#1164);
#1161=PROPERTY_DEFINITION_REPRESENTATION(#1171,#1165);
#1162=PROPERTY_DEFINITION_REPRESENTATION(#1172,#1166);
#1163=REPRESENTATION('material name',(#1167),#2086);
#1164=REPRESENTATION('density',(#1157),#2086);
#1165=REPRESENTATION('material name',(#1168),#2087);
#1166=REPRESENTATION('density',(#1158),#2087);
#1167=DESCRIPTIVE_REPRESENTATION_ITEM('Generic','Generic');
#1168=DESCRIPTIVE_REPRESENTATION_ITEM('Generic','Generic');
#1169=PROPERTY_DEFINITION('material property','material name',#2106);
#1170=PROPERTY_DEFINITION('material property','density of part',#2106);
#1171=PROPERTY_DEFINITION('material property','material name',#2107);
#1172=PROPERTY_DEFINITION('material property','density of part',#2107);
#1173=PRESENTATION_STYLE_ASSIGNMENT((#1175));
#1174=PRESENTATION_STYLE_ASSIGNMENT((#1176));
#1175=SURFACE_STYLE_USAGE(.BOTH.,#1181);
#1176=SURFACE_STYLE_USAGE(.BOTH.,#1182);
#1177=SURFACE_STYLE_RENDERING_WITH_PROPERTIES($,#1189,(#1179));
#1178=SURFACE_STYLE_RENDERING_WITH_PROPERTIES($,#1190,(#1180));
#1179=SURFACE_STYLE_TRANSPARENT(0.);
#1180=SURFACE_STYLE_TRANSPARENT(0.);
#1181=SURFACE_SIDE_STYLE('',(#1183,#1177));
#1182=SURFACE_SIDE_STYLE('',(#1184,#1178));
#1183=SURFACE_STYLE_FILL_AREA(#1185);
#1184=SURFACE_STYLE_FILL_AREA(#1186);
#1185=FILL_AREA_STYLE('',(#1187));
#1186=FILL_AREA_STYLE('',(#1188));
#1187=FILL_AREA_STYLE_COLOUR('',#1189);
#1188=FILL_AREA_STYLE_COLOUR('',#1190);
#1189=COLOUR_RGB('',0.0196078431372549,0.0196078431372549,0.0196078431372549);
#1190=COLOUR_RGB('',0.749019607843137,0.749019607843137,0.749019607843137);
#1191=DATE_TIME_ROLE('creation_date');
#1192=DATE_TIME_ROLE('creation_date');
#1193=DATE_TIME_ROLE('creation_date');
#1194=APPLIED_DATE_AND_TIME_ASSIGNMENT(#1197,#1191,(#2105));
#1195=APPLIED_DATE_AND_TIME_ASSIGNMENT(#1198,#1192,(#2106));
#1196=APPLIED_DATE_AND_TIME_ASSIGNMENT(#1199,#1193,(#2107));
#1197=DATE_AND_TIME(#1200,#1203);
#1198=DATE_AND_TIME(#1201,#1204);
#1199=DATE_AND_TIME(#1202,#1205);
#1200=CALENDAR_DATE(2019,11,7);
#1201=CALENDAR_DATE(2019,11,7);
#1202=CALENDAR_DATE(2019,11,7);
#1203=LOCAL_TIME(14,12,40.,#1206);
#1204=LOCAL_TIME(14,15,44.,#1207);
#1205=LOCAL_TIME(14,16,3.,#1208);
#1206=COORDINATED_UNIVERSAL_TIME_OFFSET(0,0,.BEHIND.);
#1207=COORDINATED_UNIVERSAL_TIME_OFFSET(0,0,.BEHIND.);
#1208=COORDINATED_UNIVERSAL_TIME_OFFSET(0,0,.BEHIND.);
#1209=AXIS2_PLACEMENT_3D('placement',#1741,#1357,#1358);
#1210=AXIS2_PLACEMENT_3D('placement',#1742,#1359,#1360);
#1211=AXIS2_PLACEMENT_3D('',#1743,#1361,#1362);
#1212=AXIS2_PLACEMENT_3D('',#1746,#1363,#1364);
#1213=AXIS2_PLACEMENT_3D('',#1748,#1365,#1366);
#1214=AXIS2_PLACEMENT_3D('',#1750,#1367,#1368);
#1215=AXIS2_PLACEMENT_3D('',#1751,#1369,#1370);
#1216=AXIS2_PLACEMENT_3D('',#1752,#1371,#1372);
#1217=AXIS2_PLACEMENT_3D('',#1755,#1373,#1374);
#1218=AXIS2_PLACEMENT_3D('',#1758,#1377,#1378);
#1219=AXIS2_PLACEMENT_3D('',#1761,#1379,#1380);
#1220=AXIS2_PLACEMENT_3D('',#1762,#1381,#1382);
#1221=AXIS2_PLACEMENT_3D('',#1763,#1383,#1384);
#1222=AXIS2_PLACEMENT_3D('',#1764,#1385,#1386);
#1223=AXIS2_PLACEMENT_3D('',#1767,#1387,#1388);
#1224=AXIS2_PLACEMENT_3D('',#1770,#1391,#1392);
#1225=AXIS2_PLACEMENT_3D('',#1773,#1393,#1394);
#1226=AXIS2_PLACEMENT_3D('',#1774,#1395,#1396);
#1227=AXIS2_PLACEMENT_3D('',#1775,#1397,#1398);
#1228=AXIS2_PLACEMENT_3D('',#1776,#1399,#1400);
#1229=AXIS2_PLACEMENT_3D('',#1779,#1401,#1402);
#1230=AXIS2_PLACEMENT_3D('',#1782,#1405,#1406);
#1231=AXIS2_PLACEMENT_3D('',#1785,#1407,#1408);
#1232=AXIS2_PLACEMENT_3D('',#1786,#1409,#1410);
#1233=AXIS2_PLACEMENT_3D('',#1787,#1411,#1412);
#1234=AXIS2_PLACEMENT_3D('',#1788,#1413,#1414);
#1235=AXIS2_PLACEMENT_3D('',#1791,#1417,#1418);
#1236=AXIS2_PLACEMENT_3D('',#1797,#1422,#1423);
#1237=AXIS2_PLACEMENT_3D('',#1800,#1425,#1426);
#1238=AXIS2_PLACEMENT_3D('',#1801,#1427,#1428);
#1239=AXIS2_PLACEMENT_3D('',#1805,#1431,#1432);
#1240=AXIS2_PLACEMENT_3D('',#1808,#1434,#1435);
#1241=AXIS2_PLACEMENT_3D('',#1809,#1436,#1437);
#1242=AXIS2_PLACEMENT_3D('',#1810,#1438,#1439);
#1243=AXIS2_PLACEMENT_3D('',#1813,#1440,#1441);
#1244=AXIS2_PLACEMENT_3D('',#1817,#1443,#1444);
#1245=AXIS2_PLACEMENT_3D('',#1819,#1446,#1447);
#1246=AXIS2_PLACEMENT_3D('',#1821,#1448,#1449);
#1247=AXIS2_PLACEMENT_3D('',#1823,#1450,#1451);
#1248=AXIS2_PLACEMENT_3D('',#1824,#1452,#1453);
#1249=AXIS2_PLACEMENT_3D('',#1825,#1454,#1455);
#1250=AXIS2_PLACEMENT_3D('',#1829,#1457,#1458);
#1251=AXIS2_PLACEMENT_3D('',#1831,#1460,#1461);
#1252=AXIS2_PLACEMENT_3D('',#1833,#1462,#1463);
#1253=AXIS2_PLACEMENT_3D('',#1835,#1464,#1465);
#1254=AXIS2_PLACEMENT_3D('',#1836,#1466,#1467);
#1255=AXIS2_PLACEMENT_3D('',#1837,#1468,#1469);
#1256=AXIS2_PLACEMENT_3D('',#1840,#1470,#1471);
#1257=AXIS2_PLACEMENT_3D('',#1843,#1474,#1475);
#1258=AXIS2_PLACEMENT_3D('',#1849,#1479,#1480);
#1259=AXIS2_PLACEMENT_3D('',#1852,#1481,#1482);
#1260=AXIS2_PLACEMENT_3D('',#1856,#1484,#1485);
#1261=AXIS2_PLACEMENT_3D('',#1858,#1487,#1488);
#1262=AXIS2_PLACEMENT_3D('',#1860,#1489,#1490);
#1263=AXIS2_PLACEMENT_3D('',#1862,#1491,#1492);
#1264=AXIS2_PLACEMENT_3D('',#1863,#1493,#1494);
#1265=AXIS2_PLACEMENT_3D('',#1864,#1495,#1496);
#1266=AXIS2_PLACEMENT_3D('',#1868,#1498,#1499);
#1267=AXIS2_PLACEMENT_3D('',#1870,#1501,#1502);
#1268=AXIS2_PLACEMENT_3D('',#1872,#1503,#1504);
#1269=AXIS2_PLACEMENT_3D('',#1874,#1505,#1506);
#1270=AXIS2_PLACEMENT_3D('',#1875,#1507,#1508);
#1271=AXIS2_PLACEMENT_3D('',#1876,#1509,#1510);
#1272=AXIS2_PLACEMENT_3D('',#1880,#1512,#1513);
#1273=AXIS2_PLACEMENT_3D('',#1882,#1515,#1516);
#1274=AXIS2_PLACEMENT_3D('',#1884,#1517,#1518);
#1275=AXIS2_PLACEMENT_3D('',#1886,#1519,#1520);
#1276=AXIS2_PLACEMENT_3D('',#1887,#1521,#1522);
#1277=AXIS2_PLACEMENT_3D('',#1888,#1523,#1524);
#1278=AXIS2_PLACEMENT_3D('',#1890,#1525,#1526);
#1279=AXIS2_PLACEMENT_3D('',#1892,#1528,#1529);
#1280=AXIS2_PLACEMENT_3D('',#1895,#1530,#1531);
#1281=AXIS2_PLACEMENT_3D('',#1896,#1532,#1533);
#1282=AXIS2_PLACEMENT_3D('',#1897,#1534,#1535);
#1283=AXIS2_PLACEMENT_3D('',#1898,#1536,#1537);
#1284=AXIS2_PLACEMENT_3D('',#1901,#1538,#1539);
#1285=AXIS2_PLACEMENT_3D('',#1904,#1542,#1543);
#1286=AXIS2_PLACEMENT_3D('',#1907,#1544,#1545);
#1287=AXIS2_PLACEMENT_3D('',#1908,#1546,#1547);
#1288=AXIS2_PLACEMENT_3D('',#1909,#1548,#1549);
#1289=AXIS2_PLACEMENT_3D('',#1910,#1550,#1551);
#1290=AXIS2_PLACEMENT_3D('',#1912,#1552,#1553);
#1291=AXIS2_PLACEMENT_3D('',#1915,#1556,#1557);
#1292=AXIS2_PLACEMENT_3D('',#1917,#1558,#1559);
#1293=AXIS2_PLACEMENT_3D('',#1918,#1560,#1561);
#1294=AXIS2_PLACEMENT_3D('',#1919,#1562,#1563);
#1295=AXIS2_PLACEMENT_3D('',#1921,#1565,#1566);
#1296=AXIS2_PLACEMENT_3D('',#1923,#1568,#1569);
#1297=AXIS2_PLACEMENT_3D('',#1927,#1571,#1572);
#1298=AXIS2_PLACEMENT_3D('',#1930,#1574,#1575);
#1299=AXIS2_PLACEMENT_3D('',#1934,#1577,#1578);
#1300=AXIS2_PLACEMENT_3D('',#1938,#1580,#1581);
#1301=AXIS2_PLACEMENT_3D('',#1940,#1583,#1584);
#1302=AXIS2_PLACEMENT_3D('',#1944,#1587,#1588);
#1303=AXIS2_PLACEMENT_3D('',#1946,#1589,#1590);
#1304=AXIS2_PLACEMENT_3D('',#1948,#1592,#1593);
#1305=AXIS2_PLACEMENT_3D('',#1952,#1596,#1597);
#1306=AXIS2_PLACEMENT_3D('',#1954,#1598,#1599);
#1307=AXIS2_PLACEMENT_3D('',#1956,#1601,#1602);
#1308=AXIS2_PLACEMENT_3D('',#1958,#1604,#1605);
#1309=AXIS2_PLACEMENT_3D('',#1962,#1608,#1609);
#1310=AXIS2_PLACEMENT_3D('',#1964,#1610,#1611);
#1311=AXIS2_PLACEMENT_3D('',#1966,#1613,#1614);
#1312=AXIS2_PLACEMENT_3D('',#1970,#1617,#1618);
#1313=AXIS2_PLACEMENT_3D('',#1971,#1619,#1620);
#1314=AXIS2_PLACEMENT_3D('',#1972,#1621,#1622);
#1315=AXIS2_PLACEMENT_3D('',#1973,#1623,#1624);
#1316=AXIS2_PLACEMENT_3D('',#1975,#1626,#1627);
#1317=AXIS2_PLACEMENT_3D('',#1977,#1629,#1630);
#1318=AXIS2_PLACEMENT_3D('placement',#1978,#1631,#1632);
#1319=AXIS2_PLACEMENT_3D('',#1979,#1633,#1634);
#1320=AXIS2_PLACEMENT_3D('',#1988,#1639,#1640);
#1321=AXIS2_PLACEMENT_3D('',#1990,#1641,#1642);
#1322=AXIS2_PLACEMENT_3D('',#1992,#1643,#1644);
#1323=AXIS2_PLACEMENT_3D('',#1994,#1646,#1647);
#1324=AXIS2_PLACEMENT_3D('',#2000,#1651,#1652);
#1325=AXIS2_PLACEMENT_3D('',#2002,#1653,#1654);
#1326=AXIS2_PLACEMENT_3D('',#2004,#1655,#1656);
#1327=AXIS2_PLACEMENT_3D('',#2006,#1658,#1659);
#1328=AXIS2_PLACEMENT_3D('',#2012,#1663,#1664);
#1329=AXIS2_PLACEMENT_3D('',#2014,#1665,#1666);
#1330=AXIS2_PLACEMENT_3D('',#2016,#1667,#1668);
#1331=AXIS2_PLACEMENT_3D('',#2018,#1670,#1671);
#1332=AXIS2_PLACEMENT_3D('',#2024,#1675,#1676);
#1333=AXIS2_PLACEMENT_3D('',#2025,#1677,#1678);
#1334=AXIS2_PLACEMENT_3D('',#2026,#1679,#1680);
#1335=AXIS2_PLACEMENT_3D('',#2027,#1681,#1682);
#1336=AXIS2_PLACEMENT_3D('',#2028,#1683,#1684);
#1337=AXIS2_PLACEMENT_3D('',#2029,#1685,#1686);
#1338=AXIS2_PLACEMENT_3D('',#2032,#1687,#1688);
#1339=AXIS2_PLACEMENT_3D('',#2036,#1690,#1691);
#1340=AXIS2_PLACEMENT_3D('',#2038,#1693,#1694);
#1341=AXIS2_PLACEMENT_3D('',#2044,#1698,#1699);
#1342=AXIS2_PLACEMENT_3D('',#2046,#1700,#1701);
#1343=AXIS2_PLACEMENT_3D('',#2048,#1702,#1703);
#1344=AXIS2_PLACEMENT_3D('',#2050,#1705,#1706);
#1345=AXIS2_PLACEMENT_3D('',#2056,#1710,#1711);
#1346=AXIS2_PLACEMENT_3D('',#2058,#1712,#1713);
#1347=AXIS2_PLACEMENT_3D('',#2060,#1714,#1715);
#1348=AXIS2_PLACEMENT_3D('',#2062,#1717,#1718);
#1349=AXIS2_PLACEMENT_3D('',#2068,#1722,#1723);
#1350=AXIS2_PLACEMENT_3D('',#2070,#1724,#1725);
#1351=AXIS2_PLACEMENT_3D('',#2072,#1726,#1727);
#1352=AXIS2_PLACEMENT_3D('',#2074,#1729,#1730);
#1353=AXIS2_PLACEMENT_3D('',#2077,#1733,#1734);
#1354=AXIS2_PLACEMENT_3D('',#2078,#1735,#1736);
#1355=AXIS2_PLACEMENT_3D('',#2079,#1737,#1738);
#1356=AXIS2_PLACEMENT_3D('',#2080,#1739,#1740);
#1357=DIRECTION('axis',(0.,0.,1.));
#1358=DIRECTION('refdir',(1.,0.,0.));
#1359=DIRECTION('axis',(0.,0.,1.));
#1360=DIRECTION('refdir',(1.,0.,0.));
#1361=DIRECTION('center_axis',(0.,1.,0.));
#1362=DIRECTION('ref_axis',(0.,0.,1.));
#1363=DIRECTION('center_axis',(1.,0.,0.));
#1364=DIRECTION('ref_axis',(0.,1.,0.));
#1365=DIRECTION('center_axis',(0.,1.,0.));
#1366=DIRECTION('ref_axis',(0.707106781186548,0.,0.707106781186547));
#1367=DIRECTION('center_axis',(1.8503717077086E-15,0.,1.));
#1368=DIRECTION('ref_axis',(1.,0.,-1.8503717077086E-15));
#1369=DIRECTION('center_axis',(0.,-1.,0.));
#1370=DIRECTION('ref_axis',(0.707106781186548,0.,0.707106781186547));
#1371=DIRECTION('center_axis',(-1.1686558153949E-16,0.,-1.));
#1372=DIRECTION('ref_axis',(0.707106781186547,0.707106781186547,0.));
#1373=DIRECTION('center_axis',(1.85037170770859E-15,0.,1.));
#1374=DIRECTION('ref_axis',(1.,0.,-1.85037170770859E-15));
#1375=DIRECTION('',(1.1686558153949E-16,0.,1.));
#1376=DIRECTION('',(-1.1686558153949E-16,0.,-1.));
#1377=DIRECTION('center_axis',(0.,1.,0.));
#1378=DIRECTION('ref_axis',(0.,0.,1.));
#1379=DIRECTION('center_axis',(1.,0.,0.));
#1380=DIRECTION('ref_axis',(0.,0.,-1.));
#1381=DIRECTION('center_axis',(0.,-1.,0.));
#1382=DIRECTION('ref_axis',(0.707106781186547,0.,-0.707106781186548));
#1383=DIRECTION('center_axis',(0.,1.,0.));
#1384=DIRECTION('ref_axis',(0.707106781186547,0.,-0.707106781186548));
#1385=DIRECTION('center_axis',(-1.,0.,1.38777878078145E-16));
#1386=DIRECTION('ref_axis',(0.,0.707106781186545,-0.70710678118655));
#1387=DIRECTION('center_axis',(1.,0.,0.));
#1388=DIRECTION('ref_axis',(0.,0.,-1.));
#1389=DIRECTION('',(1.,0.,-1.38777878078145E-16));
#1390=DIRECTION('',(-1.,0.,1.38777878078145E-16));
#1391=DIRECTION('center_axis',(0.,1.,0.));
#1392=DIRECTION('ref_axis',(0.,0.,1.));
#1393=DIRECTION('center_axis',(0.,0.,-1.));
#1394=DIRECTION('ref_axis',(-1.,0.,0.));
#1395=DIRECTION('center_axis',(0.,-1.,0.));
#1396=DIRECTION('ref_axis',(-0.707106781186547,0.,-0.707106781186548));
#1397=DIRECTION('center_axis',(0.,1.,0.));
#1398=DIRECTION('ref_axis',(-0.707106781186547,0.,-0.707106781186548));
#1399=DIRECTION('center_axis',(1.1686558153949E-16,0.,1.));
#1400=DIRECTION('ref_axis',(-0.707106781186547,0.707106781186547,0.));
#1401=DIRECTION('center_axis',(1.85037170770859E-15,0.,-1.));
#1402=DIRECTION('ref_axis',(-1.,0.,-1.85037170770859E-15));
#1403=DIRECTION('',(-1.1686558153949E-16,0.,-1.));
#1404=DIRECTION('',(1.1686558153949E-16,0.,1.));
#1405=DIRECTION('center_axis',(0.,1.,0.));
#1406=DIRECTION('ref_axis',(0.,0.,1.));
#1407=DIRECTION('center_axis',(-1.,0.,0.));
#1408=DIRECTION('ref_axis',(0.,0.,1.));
#1409=DIRECTION('center_axis',(0.,-1.,0.));
#1410=DIRECTION('ref_axis',(-0.707106781186547,0.,0.707106781186547));
#1411=DIRECTION('center_axis',(0.,1.,0.));
#1412=DIRECTION('ref_axis',(-0.707106781186547,0.,0.707106781186547));
#1413=DIRECTION('center_axis',(1.,0.,0.));
#1414=DIRECTION('ref_axis',(0.,0.707106781186547,0.707106781186547));
#1415=DIRECTION('',(-1.,0.,0.));
#1416=DIRECTION('',(1.,0.,0.));
#1417=DIRECTION('center_axis',(-1.38777878078145E-16,0.,-1.));
#1418=DIRECTION('ref_axis',(-1.,0.,1.38777878078145E-16));
#1419=DIRECTION('',(0.,1.,0.));
#1420=DIRECTION('',(1.,0.,-1.38777878078145E-16));
#1421=DIRECTION('',(0.,1.,0.));
#1422=DIRECTION('center_axis',(0.,1.,0.));
#1423=DIRECTION('ref_axis',(1.,0.,0.));
#1424=DIRECTION('',(0.,1.,0.));
#1425=DIRECTION('center_axis',(0.,-1.,0.));
#1426=DIRECTION('ref_axis',(0.707106781186547,0.,-0.707106781186548));
#1427=DIRECTION('center_axis',(1.,0.,-1.1686558153949E-16));
#1428=DIRECTION('ref_axis',(-1.1686558153949E-16,0.,-1.));
#1429=DIRECTION('',(0.,1.,0.));
#1430=DIRECTION('',(1.1686558153949E-16,0.,1.));
#1431=DIRECTION('center_axis',(0.,1.,0.));
#1432=DIRECTION('ref_axis',(5.55111512312578E-16,0.,1.));
#1433=DIRECTION('',(0.,1.,0.));
#1434=DIRECTION('center_axis',(0.,-1.,0.));
#1435=DIRECTION('ref_axis',(0.707106781186548,0.,0.707106781186547));
#1436=DIRECTION('center_axis',(0.,1.,0.));
#1437=DIRECTION('ref_axis',(0.,0.,1.));
#1438=DIRECTION('center_axis',(-1.,0.,0.));
#1439=DIRECTION('ref_axis',(0.,-0.707106781186547,0.707106781186548));
#1440=DIRECTION('center_axis',(-1.,0.,-1.63268091856641E-16));
#1441=DIRECTION('ref_axis',(0.,-0.707106781186547,0.707106781186548));
#1442=DIRECTION('',(1.,0.,0.));
#1443=DIRECTION('center_axis',(1.,0.,0.));
#1444=DIRECTION('ref_axis',(0.,0.,1.));
#1445=DIRECTION('',(1.,0.,0.));
#1446=DIRECTION('center_axis',(0.,-1.,0.));
#1447=DIRECTION('ref_axis',(0.,0.,-1.));
#1448=DIRECTION('center_axis',(0.,1.,0.));
#1449=DIRECTION('ref_axis',(0.,0.,1.));
#1450=DIRECTION('center_axis',(0.,0.,1.));
#1451=DIRECTION('ref_axis',(-1.,0.,0.));
#1452=DIRECTION('center_axis',(0.,1.,0.));
#1453=DIRECTION('ref_axis',(-0.707106781186547,0.,0.707106781186547));
#1454=DIRECTION('center_axis',(1.1686558153949E-16,0.,-1.));
#1455=DIRECTION('ref_axis',(-0.707106781186548,-0.707106781186547,0.));
#1456=DIRECTION('',(-1.1686558153949E-16,0.,1.));
#1457=DIRECTION('center_axis',(5.55111512312575E-15,0.,1.));
#1458=DIRECTION('ref_axis',(-1.,0.,5.55111512312575E-15));
#1459=DIRECTION('',(-1.1686558153949E-16,0.,1.));
#1460=DIRECTION('center_axis',(0.,-1.,0.));
#1461=DIRECTION('ref_axis',(0.,0.,-1.));
#1462=DIRECTION('center_axis',(0.,1.,0.));
#1463=DIRECTION('ref_axis',(-1.,0.,0.));
#1464=DIRECTION('center_axis',(-1.,0.,0.));
#1465=DIRECTION('ref_axis',(0.,0.,-1.));
#1466=DIRECTION('center_axis',(0.,1.,0.));
#1467=DIRECTION('ref_axis',(-0.707106781186548,0.,-0.707106781186547));
#1468=DIRECTION('center_axis',(1.,0.,0.));
#1469=DIRECTION('ref_axis',(0.,-0.707106781186547,-0.707106781186548));
#1470=DIRECTION('center_axis',(-1.,0.,1.63268091856641E-16));
#1471=DIRECTION('ref_axis',(0.,-0.707106781186547,-0.707106781186548));
#1472=DIRECTION('',(-1.,0.,0.));
#1473=DIRECTION('',(-1.,0.,0.));
#1474=DIRECTION('center_axis',(1.,0.,-1.63268091856641E-16));
#1475=DIRECTION('ref_axis',(1.63268091856641E-16,0.,1.));
#1476=DIRECTION('',(-1.63268091856641E-16,0.,-1.));
#1477=DIRECTION('',(0.,-1.,0.));
#1478=DIRECTION('',(1.63268091856641E-16,0.,1.));
#1479=DIRECTION('center_axis',(1.,0.,0.));
#1480=DIRECTION('ref_axis',(0.,0.707106781186547,-0.707106781186548));
#1481=DIRECTION('center_axis',(1.,0.,0.));
#1482=DIRECTION('ref_axis',(0.,0.,-1.));
#1483=DIRECTION('',(-1.,0.,0.));
#1484=DIRECTION('center_axis',(-1.,0.,1.63268091856641E-16));
#1485=DIRECTION('ref_axis',(0.,0.707106781186547,-0.707106781186548));
#1486=DIRECTION('',(-1.,0.,0.));
#1487=DIRECTION('center_axis',(0.,1.,0.));
#1488=DIRECTION('ref_axis',(0.,0.,1.));
#1489=DIRECTION('center_axis',(0.,-1.,0.));
#1490=DIRECTION('ref_axis',(1.,0.,0.));
#1491=DIRECTION('center_axis',(0.,0.,-1.));
#1492=DIRECTION('ref_axis',(-1.,0.,0.));
#1493=DIRECTION('center_axis',(0.,-1.,0.));
#1494=DIRECTION('ref_axis',(0.707106781186548,0.,0.707106781186547));
#1495=DIRECTION('center_axis',(0.,0.,-1.));
#1496=DIRECTION('ref_axis',(-0.707106781186548,0.707106781186547,0.));
#1497=DIRECTION('',(0.,0.,1.));
#1498=DIRECTION('center_axis',(0.,0.,-1.));
#1499=DIRECTION('ref_axis',(-1.,0.,0.));
#1500=DIRECTION('',(0.,0.,1.));
#1501=DIRECTION('center_axis',(0.,1.,0.));
#1502=DIRECTION('ref_axis',(0.,0.,1.));
#1503=DIRECTION('center_axis',(0.,-1.,0.));
#1504=DIRECTION('ref_axis',(3.96508223080411E-15,0.,-1.));
#1505=DIRECTION('center_axis',(-1.,0.,0.));
#1506=DIRECTION('ref_axis',(0.,0.,1.));
#1507=DIRECTION('center_axis',(0.,-1.,0.));
#1508=DIRECTION('ref_axis',(0.70710678118655,0.,-0.707106781186545));
#1509=DIRECTION('center_axis',(-1.,0.,0.));
#1510=DIRECTION('ref_axis',(0.,0.707106781186547,0.707106781186548));
#1511=DIRECTION('',(1.,0.,0.));
#1512=DIRECTION('center_axis',(-1.,0.,-1.63268091856641E-16));
#1513=DIRECTION('ref_axis',(0.,0.707106781186547,0.707106781186548));
#1514=DIRECTION('',(1.,0.,0.));
#1515=DIRECTION('center_axis',(0.,1.,0.));
#1516=DIRECTION('ref_axis',(0.,0.,1.));
#1517=DIRECTION('center_axis',(0.,0.,-1.));
#1518=DIRECTION('ref_axis',(1.,0.,0.));
#1519=DIRECTION('center_axis',(0.,1.,0.));
#1520=DIRECTION('ref_axis',(0.707106781186547,0.,-0.707106781186548));
#1521=DIRECTION('center_axis',(1.,0.,0.));
#1522=DIRECTION('ref_axis',(0.,-1.,0.));
#1523=DIRECTION('center_axis',(-1.,0.,1.38777878078145E-16));
#1524=DIRECTION('ref_axis',(0.,-0.707106781186539,-0.707106781186556));
#1525=DIRECTION('center_axis',(1.,0.,0.));
#1526=DIRECTION('ref_axis',(0.,-1.,0.));
#1527=DIRECTION('',(-1.,0.,1.38777878078145E-16));
#1528=DIRECTION('center_axis',(0.,1.,0.));
#1529=DIRECTION('ref_axis',(0.,0.,1.));
#1530=DIRECTION('center_axis',(0.,0.,-1.));
#1531=DIRECTION('ref_axis',(0.,-1.,0.));
#1532=DIRECTION('center_axis',(0.,-1.,0.));
#1533=DIRECTION('ref_axis',(-0.707106781186547,0.,-0.707106781186548));
#1534=DIRECTION('center_axis',(0.,1.,0.));
#1535=DIRECTION('ref_axis',(-0.707106781186547,0.,-0.707106781186548));
#1536=DIRECTION('center_axis',(1.1686558153949E-16,0.,1.));
#1537=DIRECTION('ref_axis',(-0.707106781186548,-0.707106781186547,0.));
#1538=DIRECTION('center_axis',(5.55111512312578E-15,0.,-1.));
#1539=DIRECTION('ref_axis',(0.,-1.,0.));
#1540=DIRECTION('',(-1.1686558153949E-16,0.,-1.));
#1541=DIRECTION('',(1.1686558153949E-16,0.,1.));
#1542=DIRECTION('center_axis',(0.,1.,0.));
#1543=DIRECTION('ref_axis',(0.,0.,1.));
#1544=DIRECTION('center_axis',(-1.,0.,0.));
#1545=DIRECTION('ref_axis',(0.,-1.,0.));
#1546=DIRECTION('center_axis',(0.,-1.,0.));
#1547=DIRECTION('ref_axis',(-0.707106781186547,0.,0.707106781186547));
#1548=DIRECTION('center_axis',(0.,1.,0.));
#1549=DIRECTION('ref_axis',(-0.707106781186548,0.,0.707106781186548));
#1550=DIRECTION('center_axis',(1.,0.,0.));
#1551=DIRECTION('ref_axis',(0.,-0.707106781186547,0.707106781186548));
#1552=DIRECTION('center_axis',(-1.,0.,-5.55111512312578E-15));
#1553=DIRECTION('ref_axis',(0.,-1.,0.));
#1554=DIRECTION('',(-1.,0.,0.));
#1555=DIRECTION('',(1.,0.,0.));
#1556=DIRECTION('center_axis',(0.,1.,0.));
#1557=DIRECTION('ref_axis',(0.,0.,1.));
#1558=DIRECTION('center_axis',(5.55111512312584E-15,0.,1.));
#1559=DIRECTION('ref_axis',(0.,-1.,0.));
#1560=DIRECTION('center_axis',(0.,1.,0.));
#1561=DIRECTION('ref_axis',(0.707106781186548,0.,0.707106781186547));
#1562=DIRECTION('center_axis',(-1.1686558153949E-16,0.,-1.));
#1563=DIRECTION('ref_axis',(0.707106781186548,-0.707106781186547,0.));
#1564=DIRECTION('',(-1.1686558153949E-16,0.,-1.));
#1565=DIRECTION('center_axis',(0.,0.,1.));
#1566=DIRECTION('ref_axis',(1.,0.,0.));
#1567=DIRECTION('',(0.,1.,0.));
#1568=DIRECTION('center_axis',(0.,1.,0.));
#1569=DIRECTION('ref_axis',(0.,0.,1.));
#1570=DIRECTION('',(-1.63268091856641E-16,0.,1.));
#1571=DIRECTION('center_axis',(0.,-1.,0.));
#1572=DIRECTION('ref_axis',(-1.,0.,0.));
#1573=DIRECTION('',(-1.,0.,0.));
#1574=DIRECTION('center_axis',(0.,-1.,0.));
#1575=DIRECTION('ref_axis',(0.,0.,-1.));
#1576=DIRECTION('',(1.63268091856641E-16,0.,-1.));
#1577=DIRECTION('center_axis',(0.,-1.,0.));
#1578=DIRECTION('ref_axis',(1.,0.,0.));
#1579=DIRECTION('',(1.,0.,0.));
#1580=DIRECTION('center_axis',(0.,-1.,0.));
#1581=DIRECTION('ref_axis',(0.,0.,1.));
#1582=DIRECTION('',(1.63268091856641E-16,0.,1.));
#1583=DIRECTION('center_axis',(1.,0.,1.63268091856641E-16));
#1584=DIRECTION('ref_axis',(-1.63268091856641E-16,0.,1.));
#1585=DIRECTION('',(-1.63268091856641E-16,0.,1.));
#1586=DIRECTION('',(0.,-1.,0.));
#1587=DIRECTION('center_axis',(0.,-1.,0.));
#1588=DIRECTION('ref_axis',(1.,0.,0.));
#1589=DIRECTION('center_axis',(0.,1.,0.));
#1590=DIRECTION('ref_axis',(1.,0.,0.));
#1591=DIRECTION('',(0.,-1.,0.));
#1592=DIRECTION('center_axis',(0.,0.,1.));
#1593=DIRECTION('ref_axis',(-1.,0.,0.));
#1594=DIRECTION('',(-1.,0.,0.));
#1595=DIRECTION('',(0.,-1.,0.));
#1596=DIRECTION('center_axis',(0.,-1.,0.));
#1597=DIRECTION('ref_axis',(0.,0.,1.));
#1598=DIRECTION('center_axis',(0.,1.,0.));
#1599=DIRECTION('ref_axis',(0.,0.,1.));
#1600=DIRECTION('',(0.,-1.,0.));
#1601=DIRECTION('center_axis',(-1.,0.,1.63268091856641E-16));
#1602=DIRECTION('ref_axis',(-1.63268091856641E-16,0.,-1.));
#1603=DIRECTION('',(-1.63268091856641E-16,0.,-1.));
#1604=DIRECTION('center_axis',(-1.,0.,-1.63268091856641E-16));
#1605=DIRECTION('ref_axis',(1.63268091856641E-16,0.,-1.));
#1606=DIRECTION('',(1.63268091856641E-16,0.,-1.));
#1607=DIRECTION('',(0.,-1.,0.));
#1608=DIRECTION('center_axis',(0.,-1.,0.));
#1609=DIRECTION('ref_axis',(-1.,0.,0.));
#1610=DIRECTION('center_axis',(0.,1.,0.));
#1611=DIRECTION('ref_axis',(-1.,0.,0.));
#1612=DIRECTION('',(0.,-1.,0.));
#1613=DIRECTION('center_axis',(0.,0.,-1.));
#1614=DIRECTION('ref_axis',(1.,0.,0.));
#1615=DIRECTION('',(1.,0.,0.));
#1616=DIRECTION('',(0.,-1.,0.));
#1617=DIRECTION('center_axis',(0.,-1.,0.));
#1618=DIRECTION('ref_axis',(0.,0.,-1.));
#1619=DIRECTION('center_axis',(0.,1.,0.));
#1620=DIRECTION('ref_axis',(0.,0.,-1.));
#1621=DIRECTION('center_axis',(0.,-1.,0.));
#1622=DIRECTION('ref_axis',(0.,0.,-1.));
#1623=DIRECTION('center_axis',(0.,1.,0.));
#1624=DIRECTION('ref_axis',(-1.,0.,0.));
#1625=DIRECTION('',(0.,1.,0.));
#1626=DIRECTION('center_axis',(-1.,0.,1.1686558153949E-16));
#1627=DIRECTION('ref_axis',(1.1686558153949E-16,0.,1.));
#1628=DIRECTION('',(0.,1.,0.));
#1629=DIRECTION('center_axis',(0.,1.,0.));
#1630=DIRECTION('ref_axis',(0.,0.,-1.));
#1631=DIRECTION('axis',(0.,0.,1.));
#1632=DIRECTION('refdir',(1.,0.,0.));
#1633=DIRECTION('center_axis',(1.38777878078145E-16,0.,-1.));
#1634=DIRECTION('ref_axis',(1.,0.,1.38777878078145E-16));
#1635=DIRECTION('',(-1.,0.,-1.38777878078145E-16));
#1636=DIRECTION('',(0.,-1.,0.));
#1637=DIRECTION('',(1.,0.,1.38777878078145E-16));
#1638=DIRECTION('',(0.,-1.,0.));
#1639=DIRECTION('center_axis',(0.,-1.,0.));
#1640=DIRECTION('ref_axis',(-4.62592926927148E-16,0.,-1.));
#1641=DIRECTION('center_axis',(0.,1.,0.));
#1642=DIRECTION('ref_axis',(-4.62592926927148E-16,0.,-1.));
#1643=DIRECTION('center_axis',(0.,-1.,0.));
#1644=DIRECTION('ref_axis',(-4.62592926927148E-16,0.,-1.));
#1645=DIRECTION('',(0.,-1.,0.));
#1646=DIRECTION('center_axis',(-1.,0.,0.));
#1647=DIRECTION('ref_axis',(0.,0.,-1.));
#1648=DIRECTION('',(0.,0.,1.));
#1649=DIRECTION('',(0.,0.,-1.));
#1650=DIRECTION('',(0.,-1.,0.));
#1651=DIRECTION('center_axis',(0.,-1.,0.));
#1652=DIRECTION('ref_axis',(-1.,0.,0.));
#1653=DIRECTION('center_axis',(0.,1.,0.));
#1654=DIRECTION('ref_axis',(-1.,0.,0.));
#1655=DIRECTION('center_axis',(0.,-1.,0.));
#1656=DIRECTION('ref_axis',(-1.,0.,0.));
#1657=DIRECTION('',(0.,-1.,0.));
#1658=DIRECTION('center_axis',(7.56970244062607E-16,0.,1.));
#1659=DIRECTION('ref_axis',(-1.,0.,7.56970244062606E-16));
#1660=DIRECTION('',(1.,0.,-7.56970244062606E-16));
#1661=DIRECTION('',(-1.,0.,7.56970244062606E-16));
#1662=DIRECTION('',(0.,-1.,0.));
#1663=DIRECTION('center_axis',(0.,-1.,0.));
#1664=DIRECTION('ref_axis',(0.,0.,1.));
#1665=DIRECTION('center_axis',(0.,1.,0.));
#1666=DIRECTION('ref_axis',(0.,0.,1.));
#1667=DIRECTION('center_axis',(0.,-1.,0.));
#1668=DIRECTION('ref_axis',(0.,0.,1.));
#1669=DIRECTION('',(0.,-1.,0.));
#1670=DIRECTION('center_axis',(1.,0.,-3.96508223080413E-16));
#1671=DIRECTION('ref_axis',(3.96508223080413E-16,0.,1.));
#1672=DIRECTION('',(-3.96508223080413E-16,0.,-1.));
#1673=DIRECTION('',(3.96508223080413E-16,0.,1.));
#1674=DIRECTION('',(0.,-1.,0.));
#1675=DIRECTION('center_axis',(0.,-1.,0.));
#1676=DIRECTION('ref_axis',(1.,0.,0.));
#1677=DIRECTION('center_axis',(0.,1.,0.));
#1678=DIRECTION('ref_axis',(1.,0.,0.));
#1679=DIRECTION('center_axis',(0.,-1.,0.));
#1680=DIRECTION('ref_axis',(1.,0.,0.));
#1681=DIRECTION('center_axis',(0.,1.,0.));
#1682=DIRECTION('ref_axis',(0.,0.,1.));
#1683=DIRECTION('center_axis',(0.,1.,0.));
#1684=DIRECTION('ref_axis',(0.,0.,1.));
#1685=DIRECTION('center_axis',(0.,-1.,0.));
#1686=DIRECTION('ref_axis',(-1.,0.,0.));
#1687=DIRECTION('center_axis',(0.,1.,0.));
#1688=DIRECTION('ref_axis',(-1.,0.,0.));
#1689=DIRECTION('',(0.,-1.,0.));
#1690=DIRECTION('center_axis',(0.,-1.,0.));
#1691=DIRECTION('ref_axis',(-1.,0.,0.));
#1692=DIRECTION('',(0.,-1.,0.));
#1693=DIRECTION('center_axis',(-1.38777878078145E-16,0.,1.));
#1694=DIRECTION('ref_axis',(-1.,0.,-1.38777878078145E-16));
#1695=DIRECTION('',(1.,0.,1.38777878078145E-16));
#1696=DIRECTION('',(-1.,0.,-1.38777878078145E-16));
#1697=DIRECTION('',(0.,-1.,0.));
#1698=DIRECTION('center_axis',(0.,-1.,0.));
#1699=DIRECTION('ref_axis',(4.62592926927148E-16,0.,1.));
#1700=DIRECTION('center_axis',(0.,1.,0.));
#1701=DIRECTION('ref_axis',(4.62592926927148E-16,0.,1.));
#1702=DIRECTION('center_axis',(0.,-1.,0.));
#1703=DIRECTION('ref_axis',(4.62592926927148E-16,0.,1.));
#1704=DIRECTION('',(0.,-1.,0.));
#1705=DIRECTION('center_axis',(1.,0.,-3.96508223080413E-16));
#1706=DIRECTION('ref_axis',(3.96508223080413E-16,0.,1.));
#1707=DIRECTION('',(-3.96508223080413E-16,0.,-1.));
#1708=DIRECTION('',(3.96508223080413E-16,0.,1.));
#1709=DIRECTION('',(0.,-1.,0.));
#1710=DIRECTION('center_axis',(0.,-1.,0.));
#1711=DIRECTION('ref_axis',(1.,0.,0.));
#1712=DIRECTION('center_axis',(0.,1.,0.));
#1713=DIRECTION('ref_axis',(1.,0.,0.));
#1714=DIRECTION('center_axis',(0.,-1.,0.));
#1715=DIRECTION('ref_axis',(1.,0.,0.));
#1716=DIRECTION('',(0.,-1.,0.));
#1717=DIRECTION('center_axis',(2.52323414687536E-16,0.,-1.));
#1718=DIRECTION('ref_axis',(1.,0.,2.52323414687536E-16));
#1719=DIRECTION('',(-1.,0.,-2.52323414687536E-16));
#1720=DIRECTION('',(1.,0.,2.52323414687536E-16));
#1721=DIRECTION('',(0.,-1.,0.));
#1722=DIRECTION('center_axis',(0.,-1.,0.));
#1723=DIRECTION('ref_axis',(-4.62592926927148E-16,0.,-1.));
#1724=DIRECTION('center_axis',(0.,1.,0.));
#1725=DIRECTION('ref_axis',(-4.62592926927148E-16,0.,-1.));
#1726=DIRECTION('center_axis',(0.,-1.,0.));
#1727=DIRECTION('ref_axis',(-4.62592926927148E-16,0.,-1.));
#1728=DIRECTION('',(0.,-1.,0.));
#1729=DIRECTION('center_axis',(-1.,0.,3.96508223080413E-16));
#1730=DIRECTION('ref_axis',(-3.96508223080413E-16,0.,-1.));
#1731=DIRECTION('',(3.96508223080413E-16,0.,1.));
#1732=DIRECTION('',(-3.96508223080413E-16,0.,-1.));
#1733=DIRECTION('center_axis',(0.,1.,0.));
#1734=DIRECTION('ref_axis',(0.,0.,1.));
#1735=DIRECTION('center_axis',(0.,1.,0.));
#1736=DIRECTION('ref_axis',(0.,0.,1.));
#1737=DIRECTION('',(0.,0.,1.));
#1738=DIRECTION('',(1.,0.,0.));
#1739=DIRECTION('',(0.,0.,1.));
#1740=DIRECTION('',(1.,0.,0.));
#1741=CARTESIAN_POINT('',(0.,0.,0.));
#1742=CARTESIAN_POINT('',(0.,0.,0.));
#1743=CARTESIAN_POINT('Origin',(4.,4.7,4.75));
#1744=CARTESIAN_POINT('',(4.,5.,5.45));
#1745=CARTESIAN_POINT('',(4.,4.7,5.75));
#1746=CARTESIAN_POINT('Origin',(4.,4.7,5.45));
#1747=CARTESIAN_POINT('',(5.,4.7,4.75));
#1748=CARTESIAN_POINT('Origin',(4.,4.7,4.75));
#1749=CARTESIAN_POINT('',(4.7,5.,4.75));
#1750=CARTESIAN_POINT('Origin',(4.7,4.7,4.75));
#1751=CARTESIAN_POINT('Origin',(4.,5.,4.75));
#1752=CARTESIAN_POINT('Origin',(4.7,4.7,2.375));
#1753=CARTESIAN_POINT('',(5.,4.7,-4.75));
#1754=CARTESIAN_POINT('',(4.7,5.,-4.75));
#1755=CARTESIAN_POINT('Origin',(4.7,4.7,-4.75));
#1756=CARTESIAN_POINT('',(4.7,5.,2.375));
#1757=CARTESIAN_POINT('',(5.,4.7,2.375));
#1758=CARTESIAN_POINT('Origin',(4.,4.7,-4.75));
#1759=CARTESIAN_POINT('',(4.,4.7,-5.75));
#1760=CARTESIAN_POINT('',(4.,5.,-5.45));
#1761=CARTESIAN_POINT('Origin',(4.,4.7,-5.45));
#1762=CARTESIAN_POINT('Origin',(4.,5.,-4.75));
#1763=CARTESIAN_POINT('Origin',(4.,4.7,-4.75));
#1764=CARTESIAN_POINT('Origin',(2.,4.7,-5.45));
#1765=CARTESIAN_POINT('',(-4.,4.7,-5.75));
#1766=CARTESIAN_POINT('',(-4.,5.,-5.45));
#1767=CARTESIAN_POINT('Origin',(-4.,4.7,-5.45));
#1768=CARTESIAN_POINT('',(2.,5.,-5.45));
#1769=CARTESIAN_POINT('',(2.,4.7,-5.75));
#1770=CARTESIAN_POINT('Origin',(-4.,4.7,-4.75));
#1771=CARTESIAN_POINT('',(-5.,4.7,-4.75));
#1772=CARTESIAN_POINT('',(-4.7,5.,-4.75));
#1773=CARTESIAN_POINT('Origin',(-4.7,4.7,-4.75));
#1774=CARTESIAN_POINT('Origin',(-4.,5.,-4.75));
#1775=CARTESIAN_POINT('Origin',(-4.,4.7,-4.75));
#1776=CARTESIAN_POINT('Origin',(-4.7,4.7,-2.375));
#1777=CARTESIAN_POINT('',(-5.,4.7,4.75));
#1778=CARTESIAN_POINT('',(-4.7,5.,4.75));
#1779=CARTESIAN_POINT('Origin',(-4.7,4.7,4.75));
#1780=CARTESIAN_POINT('',(-4.7,5.,-2.375));
#1781=CARTESIAN_POINT('',(-5.,4.7,-2.375));
#1782=CARTESIAN_POINT('Origin',(-4.,4.7,4.75));
#1783=CARTESIAN_POINT('',(-4.,4.7,5.75));
#1784=CARTESIAN_POINT('',(-4.,5.,5.45));
#1785=CARTESIAN_POINT('Origin',(-4.,4.7,5.45));
#1786=CARTESIAN_POINT('Origin',(-4.,5.,4.75));
#1787=CARTESIAN_POINT('Origin',(-4.,4.7,4.75));
#1788=CARTESIAN_POINT('Origin',(-2.,4.7,5.45));
#1789=CARTESIAN_POINT('',(-2.,5.,5.45));
#1790=CARTESIAN_POINT('',(-2.,4.7,5.75));
#1791=CARTESIAN_POINT('Origin',(4.,0.,-5.75));
#1792=CARTESIAN_POINT('',(4.,0.1,-5.75));
#1793=CARTESIAN_POINT('',(4.,0.,-5.75));
#1794=CARTESIAN_POINT('',(-4.,0.1,-5.75));
#1795=CARTESIAN_POINT('',(2.,0.1,-5.75));
#1796=CARTESIAN_POINT('',(-4.,0.,-5.75));
#1797=CARTESIAN_POINT('Origin',(4.,0.,-4.75));
#1798=CARTESIAN_POINT('',(5.,0.1,-4.75));
#1799=CARTESIAN_POINT('',(5.,0.,-4.75));
#1800=CARTESIAN_POINT('Origin',(4.,0.1,-4.75));
#1801=CARTESIAN_POINT('Origin',(5.,0.,4.75));
#1802=CARTESIAN_POINT('',(5.,0.1,4.75));
#1803=CARTESIAN_POINT('',(5.,0.,4.75));
#1804=CARTESIAN_POINT('',(5.,0.1,2.375));
#1805=CARTESIAN_POINT('Origin',(4.,0.,4.75));
#1806=CARTESIAN_POINT('',(4.,0.1,5.75));
#1807=CARTESIAN_POINT('',(4.,0.,5.75));
#1808=CARTESIAN_POINT('Origin',(4.,0.1,4.75));
#1809=CARTESIAN_POINT('Origin',(-1.11022302462516E-15,5.,0.));
#1810=CARTESIAN_POINT('Origin',(-0.825000000000001,0.,5.35));
#1811=CARTESIAN_POINT('',(-1.65,-0.1,5.35));
#1812=CARTESIAN_POINT('',(-1.65,0.,5.45));
#1813=CARTESIAN_POINT('Origin',(-1.65,0.,5.35));
#1814=CARTESIAN_POINT('',(-4.,0.,5.45));
#1815=CARTESIAN_POINT('',(-0.825000000000001,0.,5.45));
#1816=CARTESIAN_POINT('',(-4.,-0.1,5.35));
#1817=CARTESIAN_POINT('Origin',(-4.,0.,5.35));
#1818=CARTESIAN_POINT('',(-0.825000000000001,-0.1,5.35));
#1819=CARTESIAN_POINT('Origin',(-4.,0.,4.75));
#1820=CARTESIAN_POINT('',(-4.7,0.,4.75));
#1821=CARTESIAN_POINT('Origin',(-4.,0.,4.75));
#1822=CARTESIAN_POINT('',(-4.6,-0.1,4.75));
#1823=CARTESIAN_POINT('Origin',(-4.6,0.,4.75));
#1824=CARTESIAN_POINT('Origin',(-4.,-0.1,4.75));
#1825=CARTESIAN_POINT('Origin',(-4.6,0.,2.375));
#1826=CARTESIAN_POINT('',(-4.7,0.,-4.75));
#1827=CARTESIAN_POINT('',(-4.7,0.,2.375));
#1828=CARTESIAN_POINT('',(-4.6,-0.1,-4.75));
#1829=CARTESIAN_POINT('Origin',(-4.6,0.,-4.75));
#1830=CARTESIAN_POINT('',(-4.6,-0.1,2.375));
#1831=CARTESIAN_POINT('Origin',(-4.,0.,-4.75));
#1832=CARTESIAN_POINT('',(-4.,0.,-5.45));
#1833=CARTESIAN_POINT('Origin',(-4.,0.,-4.75));
#1834=CARTESIAN_POINT('',(-4.,-0.1,-5.35));
#1835=CARTESIAN_POINT('Origin',(-4.,0.,-5.35));
#1836=CARTESIAN_POINT('Origin',(-4.,-0.1,-4.75));
#1837=CARTESIAN_POINT('Origin',(-2.,0.,-5.35));
#1838=CARTESIAN_POINT('',(-1.65,0.,-5.45));
#1839=CARTESIAN_POINT('',(-1.65,-0.1,-5.35));
#1840=CARTESIAN_POINT('Origin',(-1.65,0.,-5.35));
#1841=CARTESIAN_POINT('',(-2.,-0.1,-5.35));
#1842=CARTESIAN_POINT('',(-2.,0.,-5.45));
#1843=CARTESIAN_POINT('Origin',(-1.65,0.,-5.45));
#1844=CARTESIAN_POINT('',(-1.65,0.,-3.75));
#1845=CARTESIAN_POINT('',(-1.65,0.,-2.725));
#1846=CARTESIAN_POINT('',(-1.65,-0.1,-3.75));
#1847=CARTESIAN_POINT('',(-1.65,0.,-3.75));
#1848=CARTESIAN_POINT('',(-1.65,-0.1,-5.45));
#1849=CARTESIAN_POINT('Origin',(2.,-0.1,5.55));
#1850=CARTESIAN_POINT('',(4.,-0.1,5.45));
#1851=CARTESIAN_POINT('',(4.,0.,5.55));
#1852=CARTESIAN_POINT('Origin',(4.,-0.1,5.55));
#1853=CARTESIAN_POINT('',(1.65,0.,5.55));
#1854=CARTESIAN_POINT('',(2.,0.,5.55));
#1855=CARTESIAN_POINT('',(1.65,-0.1,5.45));
#1856=CARTESIAN_POINT('Origin',(1.65,-0.1,5.55));
#1857=CARTESIAN_POINT('',(4.,-0.1,5.45));
#1858=CARTESIAN_POINT('Origin',(4.,-0.1,4.75));
#1859=CARTESIAN_POINT('',(4.7,-0.1,4.75));
#1860=CARTESIAN_POINT('Origin',(4.,-0.1,4.75));
#1861=CARTESIAN_POINT('',(4.8,0.,4.75));
#1862=CARTESIAN_POINT('Origin',(4.8,-0.1,4.75));
#1863=CARTESIAN_POINT('Origin',(4.,0.,4.75));
#1864=CARTESIAN_POINT('Origin',(4.8,-0.1,-2.375));
#1865=CARTESIAN_POINT('',(4.7,-0.1,-4.75));
#1866=CARTESIAN_POINT('',(4.7,-0.1,-4.75));
#1867=CARTESIAN_POINT('',(4.8,0.,-4.75));
#1868=CARTESIAN_POINT('Origin',(4.8,-0.1,-4.75));
#1869=CARTESIAN_POINT('',(4.8,0.,-2.375));
#1870=CARTESIAN_POINT('Origin',(4.,-0.1,-4.75));
#1871=CARTESIAN_POINT('',(4.,-0.1,-5.45));
#1872=CARTESIAN_POINT('Origin',(4.,-0.1,-4.75));
#1873=CARTESIAN_POINT('',(4.,0.,-5.55));
#1874=CARTESIAN_POINT('Origin',(4.,-0.1,-5.55));
#1875=CARTESIAN_POINT('Origin',(4.,0.,-4.75));
#1876=CARTESIAN_POINT('Origin',(0.824999999999999,-0.1,-5.55));
#1877=CARTESIAN_POINT('',(1.65,-0.1,-5.45));
#1878=CARTESIAN_POINT('',(-4.,-0.1,-5.45));
#1879=CARTESIAN_POINT('',(1.65,0.,-5.55));
#1880=CARTESIAN_POINT('Origin',(1.65,-0.1,-5.55));
#1881=CARTESIAN_POINT('',(0.824999999999999,0.,-5.55));
#1882=CARTESIAN_POINT('Origin',(4.,0.1,-4.75));
#1883=CARTESIAN_POINT('',(4.9,0.,-4.75));
#1884=CARTESIAN_POINT('Origin',(4.9,0.1,-4.75));
#1885=CARTESIAN_POINT('',(4.,0.,-5.65));
#1886=CARTESIAN_POINT('Origin',(4.,0.,-4.75));
#1887=CARTESIAN_POINT('Origin',(4.,0.1,-5.65));
#1888=CARTESIAN_POINT('Origin',(2.,0.1,-5.65));
#1889=CARTESIAN_POINT('',(-4.,0.,-5.65));
#1890=CARTESIAN_POINT('Origin',(-4.,0.1,-5.65));
#1891=CARTESIAN_POINT('',(2.,0.,-5.65));
#1892=CARTESIAN_POINT('Origin',(-4.,0.1,-4.75));
#1893=CARTESIAN_POINT('',(-4.9,0.,-4.75));
#1894=CARTESIAN_POINT('',(-5.,0.1,-4.75));
#1895=CARTESIAN_POINT('Origin',(-4.9,0.1,-4.75));
#1896=CARTESIAN_POINT('Origin',(-4.,0.1,-4.75));
#1897=CARTESIAN_POINT('Origin',(-4.,0.,-4.75));
#1898=CARTESIAN_POINT('Origin',(-4.9,0.1,-2.375));
#1899=CARTESIAN_POINT('',(-4.9,0.,4.75));
#1900=CARTESIAN_POINT('',(-5.,0.1,4.75));
#1901=CARTESIAN_POINT('Origin',(-4.9,0.1,4.75));
#1902=CARTESIAN_POINT('',(-5.,0.1,-2.375));
#1903=CARTESIAN_POINT('',(-4.9,0.,-2.375));
#1904=CARTESIAN_POINT('Origin',(-4.,0.1,4.75));
#1905=CARTESIAN_POINT('',(-4.,0.,5.65));
#1906=CARTESIAN_POINT('',(-4.,0.1,5.75));
#1907=CARTESIAN_POINT('Origin',(-4.,0.1,5.65));
#1908=CARTESIAN_POINT('Origin',(-4.,0.1,4.75));
#1909=CARTESIAN_POINT('Origin',(-4.,0.,4.75));
#1910=CARTESIAN_POINT('Origin',(-2.,0.1,5.65));
#1911=CARTESIAN_POINT('',(4.,0.,5.65));
#1912=CARTESIAN_POINT('Origin',(4.,0.1,5.65));
#1913=CARTESIAN_POINT('',(-2.,0.1,5.75));
#1914=CARTESIAN_POINT('',(-2.,0.,5.65));
#1915=CARTESIAN_POINT('Origin',(4.,0.1,4.75));
#1916=CARTESIAN_POINT('',(4.9,0.,4.75));
#1917=CARTESIAN_POINT('Origin',(4.9,0.1,4.75));
#1918=CARTESIAN_POINT('Origin',(4.,0.,4.75));
#1919=CARTESIAN_POINT('Origin',(4.9,0.1,2.375));
#1920=CARTESIAN_POINT('',(4.9,0.,2.375));
#1921=CARTESIAN_POINT('Origin',(-4.,0.,5.75));
#1922=CARTESIAN_POINT('',(-4.,0.,5.75));
#1923=CARTESIAN_POINT('Origin',(-1.11022302462516E-15,0.,0.));
#1924=CARTESIAN_POINT('',(1.65,0.,-3.75));
#1925=CARTESIAN_POINT('',(1.65,0.,-1.875));
#1926=CARTESIAN_POINT('',(1.15,0.,-3.25));
#1927=CARTESIAN_POINT('Origin',(1.15,0.,-3.75));
#1928=CARTESIAN_POINT('',(-1.15,0.,-3.25));
#1929=CARTESIAN_POINT('',(-0.575000000000001,0.,-3.25));
#1930=CARTESIAN_POINT('Origin',(-1.15,0.,-3.75));
#1931=CARTESIAN_POINT('',(-1.65,0.,3.75));
#1932=CARTESIAN_POINT('',(-1.65,0.,1.875));
#1933=CARTESIAN_POINT('',(-1.15,0.,3.25));
#1934=CARTESIAN_POINT('Origin',(-1.15,0.,3.75));
#1935=CARTESIAN_POINT('',(1.15,0.,3.25));
#1936=CARTESIAN_POINT('',(0.574999999999999,0.,3.25));
#1937=CARTESIAN_POINT('',(1.65,0.,3.75));
#1938=CARTESIAN_POINT('Origin',(1.15,0.,3.75));
#1939=CARTESIAN_POINT('',(1.65,0.,2.725));
#1940=CARTESIAN_POINT('Origin',(-1.65,0.,3.75));
#1941=CARTESIAN_POINT('',(-1.65,-0.1,3.75));
#1942=CARTESIAN_POINT('',(-1.65,-0.1,3.75));
#1943=CARTESIAN_POINT('',(-1.65,0.,3.75));
#1944=CARTESIAN_POINT('Origin',(-1.15,0.,3.75));
#1945=CARTESIAN_POINT('',(-1.15,-0.1,3.25));
#1946=CARTESIAN_POINT('Origin',(-1.15,-0.1,3.75));
#1947=CARTESIAN_POINT('',(-1.15,0.,3.25));
#1948=CARTESIAN_POINT('Origin',(1.15,0.,3.25));
#1949=CARTESIAN_POINT('',(1.15,-0.1,3.25));
#1950=CARTESIAN_POINT('',(1.15,-0.1,3.25));
#1951=CARTESIAN_POINT('',(1.15,0.,3.25));
#1952=CARTESIAN_POINT('Origin',(1.15,0.,3.75));
#1953=CARTESIAN_POINT('',(1.65,-0.1,3.75));
#1954=CARTESIAN_POINT('Origin',(1.15,-0.1,3.75));
#1955=CARTESIAN_POINT('',(1.65,0.,3.75));
#1956=CARTESIAN_POINT('Origin',(1.65,0.,5.45));
#1957=CARTESIAN_POINT('',(1.65,-0.1,5.45));
#1958=CARTESIAN_POINT('Origin',(1.65,0.,-3.75));
#1959=CARTESIAN_POINT('',(1.65,-0.1,-3.75));
#1960=CARTESIAN_POINT('',(1.65,-0.1,-3.75));
#1961=CARTESIAN_POINT('',(1.65,0.,-3.75));
#1962=CARTESIAN_POINT('Origin',(1.15,0.,-3.75));
#1963=CARTESIAN_POINT('',(1.15,-0.1,-3.25));
#1964=CARTESIAN_POINT('Origin',(1.15,-0.1,-3.75));
#1965=CARTESIAN_POINT('',(1.15,0.,-3.25));
#1966=CARTESIAN_POINT('Origin',(-1.15,0.,-3.25));
#1967=CARTESIAN_POINT('',(-1.15,-0.1,-3.25));
#1968=CARTESIAN_POINT('',(-1.15,-0.1,-3.25));
#1969=CARTESIAN_POINT('',(-1.15,0.,-3.25));
#1970=CARTESIAN_POINT('Origin',(-1.15,0.,-3.75));
#1971=CARTESIAN_POINT('Origin',(-1.15,-0.1,-3.75));
#1972=CARTESIAN_POINT('Origin',(-1.38777878078145E-15,-0.1,-1.11022302462516E-15));
#1973=CARTESIAN_POINT('Origin',(-4.,0.,4.75));
#1974=CARTESIAN_POINT('',(-5.,0.,4.75));
#1975=CARTESIAN_POINT('Origin',(-5.,0.,-4.75));
#1976=CARTESIAN_POINT('',(-5.,0.,-4.75));
#1977=CARTESIAN_POINT('Origin',(-4.,0.,-4.75));
#1978=CARTESIAN_POINT('',(0.,0.,0.));
#1979=CARTESIAN_POINT('Origin',(-1.1,0.,-5.65));
#1980=CARTESIAN_POINT('',(1.1,0.,-5.65));
#1981=CARTESIAN_POINT('',(-1.1,0.,-5.65));
#1982=CARTESIAN_POINT('',(4.,0.,-5.65));
#1983=CARTESIAN_POINT('',(1.1,-0.25,-5.65));
#1984=CARTESIAN_POINT('',(1.1,0.,-5.65));
#1985=CARTESIAN_POINT('',(-1.1,-0.25,-5.65));
#1986=CARTESIAN_POINT('',(4.,-0.25,-5.65));
#1987=CARTESIAN_POINT('',(-1.1,0.,-5.65));
#1988=CARTESIAN_POINT('Origin',(-1.1,0.,-5.35));
#1989=CARTESIAN_POINT('',(-1.4,0.,-5.35));
#1990=CARTESIAN_POINT('Origin',(-1.1,0.,-5.35));
#1991=CARTESIAN_POINT('',(-1.4,-0.25,-5.35));
#1992=CARTESIAN_POINT('Origin',(-1.1,-0.25,-5.35));
#1993=CARTESIAN_POINT('',(-1.4,0.,-5.35));
#1994=CARTESIAN_POINT('Origin',(-1.4,0.,-3.95));
#1995=CARTESIAN_POINT('',(-1.4,0.,-3.95));
#1996=CARTESIAN_POINT('',(-1.4,0.,-5.35));
#1997=CARTESIAN_POINT('',(-1.4,-0.25,-3.95));
#1998=CARTESIAN_POINT('',(-1.4,-0.25,-5.35));
#1999=CARTESIAN_POINT('',(-1.4,0.,-3.95));
#2000=CARTESIAN_POINT('Origin',(-1.1,0.,-3.95));
#2001=CARTESIAN_POINT('',(-1.1,0.,-3.65));
#2002=CARTESIAN_POINT('Origin',(-1.1,0.,-3.95));
#2003=CARTESIAN_POINT('',(-1.1,-0.25,-3.65));
#2004=CARTESIAN_POINT('Origin',(-1.1,-0.25,-3.95));
#2005=CARTESIAN_POINT('',(-1.1,0.,-3.65));
#2006=CARTESIAN_POINT('Origin',(1.1,0.,-3.65));
#2007=CARTESIAN_POINT('',(1.1,0.,-3.65));
#2008=CARTESIAN_POINT('',(-1.1,0.,-3.65));
#2009=CARTESIAN_POINT('',(1.1,-0.25,-3.65));
#2010=CARTESIAN_POINT('',(-1.1,-0.25,-3.65));
#2011=CARTESIAN_POINT('',(1.1,0.,-3.65));
#2012=CARTESIAN_POINT('Origin',(1.1,0.,-3.95));
#2013=CARTESIAN_POINT('',(1.4,0.,-3.95));
#2014=CARTESIAN_POINT('Origin',(1.1,0.,-3.95));
#2015=CARTESIAN_POINT('',(1.4,-0.25,-3.95));
#2016=CARTESIAN_POINT('Origin',(1.1,-0.25,-3.95));
#2017=CARTESIAN_POINT('',(1.4,0.,-3.95));
#2018=CARTESIAN_POINT('Origin',(1.4,0.,-5.35));
#2019=CARTESIAN_POINT('',(1.4,0.,-5.35));
#2020=CARTESIAN_POINT('',(1.4,0.,-3.95));
#2021=CARTESIAN_POINT('',(1.4,-0.25,-5.35));
#2022=CARTESIAN_POINT('',(1.4,-0.25,-3.95));
#2023=CARTESIAN_POINT('',(1.4,0.,-5.35));
#2024=CARTESIAN_POINT('Origin',(1.1,0.,-5.35));
#2025=CARTESIAN_POINT('Origin',(1.1,0.,-5.35));
#2026=CARTESIAN_POINT('Origin',(1.1,-0.25,-5.35));
#2027=CARTESIAN_POINT('Origin',(-2.4980018054066E-15,0.,-4.65));
#2028=CARTESIAN_POINT('Origin',(-2.4980018054066E-15,-0.25,-4.65));
#2029=CARTESIAN_POINT('Origin',(-1.1,0.,5.35));
#2030=CARTESIAN_POINT('',(-1.4,0.,5.35));
#2031=CARTESIAN_POINT('',(-1.1,0.,5.65));
#2032=CARTESIAN_POINT('Origin',(-1.1,0.,5.35));
#2033=CARTESIAN_POINT('',(-1.4,-0.25,5.35));
#2034=CARTESIAN_POINT('',(-1.4,0.,5.35));
#2035=CARTESIAN_POINT('',(-1.1,-0.25,5.65));
#2036=CARTESIAN_POINT('Origin',(-1.1,-0.25,5.35));
#2037=CARTESIAN_POINT('',(-1.1,0.,5.65));
#2038=CARTESIAN_POINT('Origin',(1.1,0.,5.65));
#2039=CARTESIAN_POINT('',(1.1,0.,5.65));
#2040=CARTESIAN_POINT('',(-4.,0.,5.65));
#2041=CARTESIAN_POINT('',(1.1,-0.25,5.65));
#2042=CARTESIAN_POINT('',(-4.,-0.25,5.65));
#2043=CARTESIAN_POINT('',(1.1,0.,5.65));
#2044=CARTESIAN_POINT('Origin',(1.1,0.,5.35));
#2045=CARTESIAN_POINT('',(1.4,0.,5.35));
#2046=CARTESIAN_POINT('Origin',(1.1,0.,5.35));
#2047=CARTESIAN_POINT('',(1.4,-0.25,5.35));
#2048=CARTESIAN_POINT('Origin',(1.1,-0.25,5.35));
#2049=CARTESIAN_POINT('',(1.4,0.,5.35));
#2050=CARTESIAN_POINT('Origin',(1.4,0.,3.95));
#2051=CARTESIAN_POINT('',(1.4,0.,3.95));
#2052=CARTESIAN_POINT('',(1.4,0.,5.35));
#2053=CARTESIAN_POINT('',(1.4,-0.25,3.95));
#2054=CARTESIAN_POINT('',(1.4,-0.25,5.35));
#2055=CARTESIAN_POINT('',(1.4,0.,3.95));
#2056=CARTESIAN_POINT('Origin',(1.1,0.,3.95));
#2057=CARTESIAN_POINT('',(1.1,0.,3.65));
#2058=CARTESIAN_POINT('Origin',(1.1,0.,3.95));
#2059=CARTESIAN_POINT('',(1.1,-0.25,3.65));
#2060=CARTESIAN_POINT('Origin',(1.1,-0.25,3.95));
#2061=CARTESIAN_POINT('',(1.1,0.,3.65));
#2062=CARTESIAN_POINT('Origin',(-1.1,0.,3.65));
#2063=CARTESIAN_POINT('',(-1.1,0.,3.65));
#2064=CARTESIAN_POINT('',(1.1,0.,3.65));
#2065=CARTESIAN_POINT('',(-1.1,-0.25,3.65));
#2066=CARTESIAN_POINT('',(1.1,-0.25,3.65));
#2067=CARTESIAN_POINT('',(-1.1,0.,3.65));
#2068=CARTESIAN_POINT('Origin',(-1.1,0.,3.95));
#2069=CARTESIAN_POINT('',(-1.4,0.,3.95));
#2070=CARTESIAN_POINT('Origin',(-1.1,0.,3.95));
#2071=CARTESIAN_POINT('',(-1.4,-0.25,3.95));
#2072=CARTESIAN_POINT('Origin',(-1.1,-0.25,3.95));
#2073=CARTESIAN_POINT('',(-1.4,0.,3.95));
#2074=CARTESIAN_POINT('Origin',(-1.4,0.,5.35));
#2075=CARTESIAN_POINT('',(-1.4,0.,3.95));
#2076=CARTESIAN_POINT('',(-1.4,-0.25,3.95));
#2077=CARTESIAN_POINT('Origin',(-2.77555756156289E-16,0.,4.65));
#2078=CARTESIAN_POINT('Origin',(-2.77555756156289E-16,-0.25,4.65));
#2079=CARTESIAN_POINT('',(0.,0.,0.));
#2080=CARTESIAN_POINT('',(0.,0.,0.));
#2081=UNCERTAINTY_MEASURE_WITH_UNIT(LENGTH_MEASURE(0.01),#2089,
'DISTANCE_ACCURACY_VALUE',
'Maximum model space distance between geometric entities at asserted c
onnectivities');
#2082=UNCERTAINTY_MEASURE_WITH_UNIT(LENGTH_MEASURE(0.01),#2089,
'DISTANCE_ACCURACY_VALUE',
'Maximum model space distance between geometric entities at asserted c
onnectivities');
#2083=UNCERTAINTY_MEASURE_WITH_UNIT(LENGTH_MEASURE(0.01),#2089,
'DISTANCE_ACCURACY_VALUE',
'Maximum model space distance between geometric entities at asserted c
onnectivities');
#2084=UNCERTAINTY_MEASURE_WITH_UNIT(LENGTH_MEASURE(0.01),#2089,
'DISTANCE_ACCURACY_VALUE',
'Maximum model space distance between geometric entities at asserted c
onnectivities');
#2085=(
GEOMETRIC_REPRESENTATION_CONTEXT(3)
GLOBAL_UNCERTAINTY_ASSIGNED_CONTEXT((#2081))
GLOBAL_UNIT_ASSIGNED_CONTEXT((#2089,#2091,#2092))
REPRESENTATION_CONTEXT('','3D')
);
#2086=(
GEOMETRIC_REPRESENTATION_CONTEXT(3)
GLOBAL_UNCERTAINTY_ASSIGNED_CONTEXT((#2082))
GLOBAL_UNIT_ASSIGNED_CONTEXT((#2089,#2091,#2092))
REPRESENTATION_CONTEXT('','3D')
);
#2087=(
GEOMETRIC_REPRESENTATION_CONTEXT(3)
GLOBAL_UNCERTAINTY_ASSIGNED_CONTEXT((#2083))
GLOBAL_UNIT_ASSIGNED_CONTEXT((#2089,#2091,#2092))
REPRESENTATION_CONTEXT('','3D')
);
#2088=(
GEOMETRIC_REPRESENTATION_CONTEXT(3)
GLOBAL_UNCERTAINTY_ASSIGNED_CONTEXT((#2084))
GLOBAL_UNIT_ASSIGNED_CONTEXT((#2089,#2091,#2092))
REPRESENTATION_CONTEXT('','3D')
);
#2089=(
LENGTH_UNIT()
NAMED_UNIT(*)
SI_UNIT(.MILLI.,.METRE.)
);
#2090=(
LENGTH_UNIT()
NAMED_UNIT(*)
SI_UNIT(.CENTI.,.METRE.)
);
#2091=(
NAMED_UNIT(*)
PLANE_ANGLE_UNIT()
SI_UNIT($,.RADIAN.)
);
#2092=(
NAMED_UNIT(*)
SI_UNIT($,.STERADIAN.)
SOLID_ANGLE_UNIT()
);
#2093=SHAPE_DEFINITION_REPRESENTATION(#2096,#2101);
#2094=SHAPE_DEFINITION_REPRESENTATION(#2097,#2102);
#2095=SHAPE_DEFINITION_REPRESENTATION(#2098,#2103);
#2096=PRODUCT_DEFINITION_SHAPE('',$,#2105);
#2097=PRODUCT_DEFINITION_SHAPE('',$,#2106);
#2098=PRODUCT_DEFINITION_SHAPE('',$,#2107);
#2099=PRODUCT_DEFINITION_SHAPE($,$,#17);
#2100=PRODUCT_DEFINITION_SHAPE($,$,#18);
#2101=SHAPE_REPRESENTATION('',(#1209,#1355,#1356),#2085);
#2102=SHAPE_REPRESENTATION('',(#1210),#2086);
#2103=SHAPE_REPRESENTATION('',(#1318),#2087);
#2104=PRODUCT_DEFINITION_CONTEXT('part definition',#2115,'design');
#2105=PRODUCT_DEFINITION('L140120','L100115',#2108,#2104);
#2106=PRODUCT_DEFINITION('Coil','Coil',#2109,#2104);
#2107=PRODUCT_DEFINITION('Pin','Pin',#2110,#2104);
#2108=PRODUCT_DEFINITION_FORMATION('',$,#2117);
#2109=PRODUCT_DEFINITION_FORMATION('',$,#2118);
#2110=PRODUCT_DEFINITION_FORMATION('',$,#2119);
#2111=PRODUCT_RELATED_PRODUCT_CATEGORY('L100115','L100115',(#2117));
#2112=PRODUCT_RELATED_PRODUCT_CATEGORY('Coil','Coil',(#2118));
#2113=PRODUCT_RELATED_PRODUCT_CATEGORY('Pin','Pin',(#2119));
#2114=APPLICATION_PROTOCOL_DEFINITION('international standard',
'automotive_design',2009,#2115);
#2115=APPLICATION_CONTEXT(
'Core Data for Automotive Mechanical Design Process');
#2116=PRODUCT_CONTEXT('part definition',#2115,'mechanical');
#2117=PRODUCT('L140120','L100115',$,(#2116));
#2118=PRODUCT('Coil','Coil',$,(#2116));
#2119=PRODUCT('Pin','Pin',$,(#2116));
ENDSEC;
END-ISO-10303-21;
