G04 EAGLE Gerber RS-274X export*
G75*
%MOMM*%
%FSLAX34Y34*%
%LPD*%
%INSoldermask Top*%
%IPPOS*%
%AMOC8*
5,1,8,0,0,1.08239X$1,22.5*%
G01*
%ADD10C,3.403200*%
%ADD11R,0.815000X0.715000*%
%ADD12R,0.715000X0.815000*%
%ADD13C,0.523200*%
%ADD14R,1.903200X2.703200*%
%ADD15C,0.423200*%
%ADD16R,1.793200X1.953200*%
%ADD17C,1.111200*%
%ADD18C,1.211200*%
%ADD19R,4.266800X2.318500*%
%ADD20R,0.610000X1.775100*%
%ADD21R,5.463200X3.403200*%
%ADD22R,3.505200X4.013200*%
%ADD23R,1.219200X4.013200*%
%ADD24C,9.203200*%
%ADD25R,3.203200X7.203200*%
%ADD26C,1.461200*%
%ADD27R,2.318500X4.266800*%
%ADD28R,1.775100X0.610000*%
%ADD29R,3.403200X5.463200*%
%ADD30R,4.013200X3.505200*%
%ADD31R,4.013200X1.219200*%
%ADD32R,7.203200X3.203200*%
%ADD33R,1.412000X0.883400*%
%ADD34C,0.909600*%
%ADD35C,0.959600*%
%ADD36C,1.009600*%
%ADD37C,1.059600*%
%ADD38C,1.159600*%


D10*
X39050Y32700D03*
X169050Y32700D03*
X169050Y194600D03*
X39050Y194600D03*
D11*
X131763Y89931D03*
X131763Y79931D03*
X100806Y73263D03*
X100806Y63263D03*
X136525Y154225D03*
X136525Y144225D03*
D12*
X93425Y171450D03*
X103425Y171450D03*
D11*
X108744Y73263D03*
X108744Y63263D03*
D13*
X120003Y139475D02*
X124909Y139475D01*
X124909Y145975D02*
X120003Y145975D01*
X120003Y152475D02*
X124909Y152475D01*
X124909Y158975D02*
X120003Y158975D01*
X95897Y158975D02*
X90991Y158975D01*
X90991Y152475D02*
X95897Y152475D01*
X95897Y145975D02*
X90991Y145975D01*
X90991Y139475D02*
X95897Y139475D01*
D14*
X107950Y149225D03*
D15*
X95323Y106838D02*
X90665Y106838D01*
X90404Y102838D02*
X95584Y102838D01*
X95584Y98838D02*
X90404Y98838D01*
X90404Y94838D02*
X95584Y94838D01*
X95584Y90838D02*
X90404Y90838D01*
X90665Y86838D02*
X95323Y86838D01*
X97950Y84211D02*
X97950Y79553D01*
X101950Y79292D02*
X101950Y84472D01*
X105950Y84472D02*
X105950Y79292D01*
X109950Y79292D02*
X109950Y84472D01*
X113950Y84472D02*
X113950Y79292D01*
X117950Y79553D02*
X117950Y84211D01*
X120577Y86838D02*
X125235Y86838D01*
X125496Y90838D02*
X120316Y90838D01*
X120316Y94838D02*
X125496Y94838D01*
X125496Y98838D02*
X120316Y98838D01*
X120316Y102838D02*
X125496Y102838D01*
X125235Y106838D02*
X120577Y106838D01*
X117950Y109465D02*
X117950Y114123D01*
X113950Y114384D02*
X113950Y109204D01*
X109950Y109204D02*
X109950Y114384D01*
X105950Y114384D02*
X105950Y109204D01*
X101950Y109204D02*
X101950Y114384D01*
X97950Y114123D02*
X97950Y109465D01*
D16*
X107950Y96838D03*
D17*
X69850Y108050D03*
X69850Y120550D03*
X69850Y133050D03*
X69850Y145550D03*
X69850Y95550D03*
X69850Y83050D03*
D18*
X157956Y88900D03*
X157956Y139700D03*
X157956Y101600D03*
X157956Y114300D03*
X157956Y127000D03*
D11*
X530225Y228363D03*
X530225Y238363D03*
X549275Y320438D03*
X549275Y330438D03*
D19*
X522391Y117475D03*
X607909Y117475D03*
D11*
X615950Y309800D03*
X615950Y299800D03*
X536575Y320438D03*
X536575Y330438D03*
D20*
X530988Y250683D03*
X537488Y250683D03*
X543988Y250683D03*
X550488Y250683D03*
X556988Y250683D03*
X563488Y250683D03*
X569988Y250683D03*
X576488Y250683D03*
X582988Y250683D03*
X589488Y250683D03*
X595988Y250683D03*
X602488Y250683D03*
X602488Y308117D03*
X595988Y308117D03*
X589488Y308117D03*
X582988Y308117D03*
X576488Y308117D03*
X569988Y308117D03*
X563488Y308117D03*
X556988Y308117D03*
X550488Y308117D03*
X543988Y308117D03*
X537488Y308117D03*
X530988Y308117D03*
D21*
X566738Y279400D03*
D22*
X604838Y31750D03*
X528638Y31750D03*
D23*
X576263Y31750D03*
X557213Y31750D03*
D24*
X566588Y466350D03*
D25*
X484088Y466350D03*
X646588Y466350D03*
D26*
X669925Y149225D03*
X669925Y133985D03*
X669925Y164465D03*
D11*
X538163Y228363D03*
X538163Y238363D03*
X588963Y238363D03*
X588963Y228363D03*
X603250Y238363D03*
X603250Y228363D03*
D18*
X669925Y225425D03*
X669925Y276225D03*
X669925Y238125D03*
X669925Y250825D03*
X669925Y263525D03*
D11*
X85725Y482363D03*
X85725Y492363D03*
X104775Y574438D03*
X104775Y584438D03*
D19*
X77891Y371475D03*
X163409Y371475D03*
D11*
X171450Y563800D03*
X171450Y553800D03*
X92075Y574438D03*
X92075Y584438D03*
D20*
X86488Y504683D03*
X92988Y504683D03*
X99488Y504683D03*
X105988Y504683D03*
X112488Y504683D03*
X118988Y504683D03*
X125488Y504683D03*
X131988Y504683D03*
X138488Y504683D03*
X144988Y504683D03*
X151488Y504683D03*
X157988Y504683D03*
X157988Y562117D03*
X151488Y562117D03*
X144988Y562117D03*
X138488Y562117D03*
X131988Y562117D03*
X125488Y562117D03*
X118988Y562117D03*
X112488Y562117D03*
X105988Y562117D03*
X99488Y562117D03*
X92988Y562117D03*
X86488Y562117D03*
D21*
X122238Y533400D03*
D22*
X160338Y285750D03*
X84138Y285750D03*
D23*
X131763Y285750D03*
X112713Y285750D03*
D24*
X122088Y720350D03*
D25*
X39588Y720350D03*
X202088Y720350D03*
D26*
X225425Y403225D03*
X225425Y387985D03*
X225425Y418465D03*
D11*
X93663Y482363D03*
X93663Y492363D03*
X144463Y492363D03*
X144463Y482363D03*
X158750Y492363D03*
X158750Y482363D03*
D18*
X225425Y479425D03*
X225425Y530225D03*
X225425Y492125D03*
X225425Y504825D03*
X225425Y517525D03*
D12*
X635238Y708025D03*
X625238Y708025D03*
X543163Y727075D03*
X533163Y727075D03*
D27*
X746125Y700191D03*
X746125Y785709D03*
D12*
X553800Y793750D03*
X563800Y793750D03*
X543163Y714375D03*
X533163Y714375D03*
D28*
X612917Y708788D03*
X612917Y715288D03*
X612917Y721788D03*
X612917Y728288D03*
X612917Y734788D03*
X612917Y741288D03*
X612917Y747788D03*
X612917Y754288D03*
X612917Y760788D03*
X612917Y767288D03*
X612917Y773788D03*
X612917Y780288D03*
X555483Y780288D03*
X555483Y773788D03*
X555483Y767288D03*
X555483Y760788D03*
X555483Y754288D03*
X555483Y747788D03*
X555483Y741288D03*
X555483Y734788D03*
X555483Y728288D03*
X555483Y721788D03*
X555483Y715288D03*
X555483Y708788D03*
D29*
X584200Y744538D03*
D30*
X831850Y782638D03*
X831850Y706438D03*
D31*
X831850Y754063D03*
X831850Y735013D03*
D24*
X397250Y744388D03*
D32*
X397250Y661888D03*
X397250Y824388D03*
D26*
X714375Y847725D03*
X729615Y847725D03*
X699135Y847725D03*
D12*
X635238Y715963D03*
X625238Y715963D03*
X625238Y766763D03*
X635238Y766763D03*
X625238Y781050D03*
X635238Y781050D03*
D18*
X638175Y847725D03*
X587375Y847725D03*
X625475Y847725D03*
X612775Y847725D03*
X600075Y847725D03*
D11*
X784225Y228363D03*
X784225Y238363D03*
X803275Y320438D03*
X803275Y330438D03*
D19*
X776391Y117475D03*
X861909Y117475D03*
D11*
X869950Y309800D03*
X869950Y299800D03*
X790575Y320438D03*
X790575Y330438D03*
D20*
X784988Y250683D03*
X791488Y250683D03*
X797988Y250683D03*
X804488Y250683D03*
X810988Y250683D03*
X817488Y250683D03*
X823988Y250683D03*
X830488Y250683D03*
X836988Y250683D03*
X843488Y250683D03*
X849988Y250683D03*
X856488Y250683D03*
X856488Y308117D03*
X849988Y308117D03*
X843488Y308117D03*
X836988Y308117D03*
X830488Y308117D03*
X823988Y308117D03*
X817488Y308117D03*
X810988Y308117D03*
X804488Y308117D03*
X797988Y308117D03*
X791488Y308117D03*
X784988Y308117D03*
D21*
X820738Y279400D03*
D22*
X858838Y31750D03*
X782638Y31750D03*
D23*
X830263Y31750D03*
X811213Y31750D03*
D24*
X820588Y466350D03*
D25*
X738088Y466350D03*
X900588Y466350D03*
D26*
X923925Y149225D03*
X923925Y133985D03*
X923925Y164465D03*
D11*
X792163Y228363D03*
X792163Y238363D03*
X842963Y238363D03*
X842963Y228363D03*
X857250Y238363D03*
X857250Y228363D03*
D18*
X923925Y225425D03*
X923925Y276225D03*
X923925Y238125D03*
X923925Y250825D03*
X923925Y263525D03*
D12*
X304272Y116259D03*
X314272Y116259D03*
X294019Y75103D03*
X284019Y75103D03*
X297569Y116289D03*
X287569Y116289D03*
D11*
X322733Y137915D03*
X322733Y127915D03*
X403169Y92279D03*
X403169Y82279D03*
D13*
X397297Y77333D02*
X392391Y77333D01*
X392391Y83833D02*
X397297Y83833D01*
X397297Y90333D02*
X392391Y90333D01*
X392391Y96833D02*
X397297Y96833D01*
X368285Y96833D02*
X363379Y96833D01*
X363379Y90333D02*
X368285Y90333D01*
X368285Y83833D02*
X363379Y83833D01*
X363379Y77333D02*
X368285Y77333D01*
D14*
X380338Y87083D03*
D22*
X380048Y50901D03*
X303848Y50901D03*
D23*
X351473Y50901D03*
X332423Y50901D03*
D22*
X314423Y176451D03*
X352523Y176451D03*
D18*
X271304Y91383D03*
X271304Y142183D03*
X271304Y104083D03*
X271304Y116783D03*
X271304Y129483D03*
D33*
X311950Y128226D03*
X311950Y137726D03*
X311950Y147226D03*
X286884Y147226D03*
X286884Y128226D03*
X312613Y85919D03*
X312613Y95419D03*
X312613Y104919D03*
X287547Y104919D03*
X287547Y85919D03*
D26*
X272509Y53283D03*
X272509Y68523D03*
X272509Y38043D03*
D12*
X381624Y138675D03*
X371624Y138675D03*
X351871Y138675D03*
X361871Y138675D03*
X316972Y319459D03*
X326972Y319459D03*
X306719Y278303D03*
X296719Y278303D03*
X310269Y319489D03*
X300269Y319489D03*
D11*
X335433Y341115D03*
X335433Y331115D03*
X415869Y295479D03*
X415869Y285479D03*
D13*
X409997Y280533D02*
X405091Y280533D01*
X405091Y287033D02*
X409997Y287033D01*
X409997Y293533D02*
X405091Y293533D01*
X405091Y300033D02*
X409997Y300033D01*
X380985Y300033D02*
X376079Y300033D01*
X376079Y293533D02*
X380985Y293533D01*
X380985Y287033D02*
X376079Y287033D01*
X376079Y280533D02*
X380985Y280533D01*
D14*
X393038Y290283D03*
D22*
X392748Y254101D03*
X316548Y254101D03*
D23*
X364173Y254101D03*
X345123Y254101D03*
D22*
X327123Y379651D03*
X365223Y379651D03*
D18*
X284004Y294583D03*
X284004Y345383D03*
X284004Y307283D03*
X284004Y319983D03*
X284004Y332683D03*
D33*
X324650Y331426D03*
X324650Y340926D03*
X324650Y350426D03*
X299584Y350426D03*
X299584Y331426D03*
X325313Y289119D03*
X325313Y298619D03*
X325313Y308119D03*
X300247Y308119D03*
X300247Y289119D03*
D26*
X285209Y256483D03*
X285209Y271723D03*
X285209Y241243D03*
D12*
X394324Y341875D03*
X384324Y341875D03*
X364571Y341875D03*
X374571Y341875D03*
X316972Y522659D03*
X326972Y522659D03*
X306719Y481503D03*
X296719Y481503D03*
X310269Y522689D03*
X300269Y522689D03*
D11*
X335433Y544315D03*
X335433Y534315D03*
X415869Y498679D03*
X415869Y488679D03*
D13*
X409997Y483733D02*
X405091Y483733D01*
X405091Y490233D02*
X409997Y490233D01*
X409997Y496733D02*
X405091Y496733D01*
X405091Y503233D02*
X409997Y503233D01*
X380985Y503233D02*
X376079Y503233D01*
X376079Y496733D02*
X380985Y496733D01*
X380985Y490233D02*
X376079Y490233D01*
X376079Y483733D02*
X380985Y483733D01*
D14*
X393038Y493483D03*
D22*
X392748Y457301D03*
X316548Y457301D03*
D23*
X364173Y457301D03*
X345123Y457301D03*
D22*
X327123Y582851D03*
X365223Y582851D03*
D18*
X284004Y497783D03*
X284004Y548583D03*
X284004Y510483D03*
X284004Y523183D03*
X284004Y535883D03*
D33*
X324650Y534626D03*
X324650Y544126D03*
X324650Y553626D03*
X299584Y553626D03*
X299584Y534626D03*
X325313Y492319D03*
X325313Y501819D03*
X325313Y511319D03*
X300247Y511319D03*
X300247Y492319D03*
D26*
X285209Y459683D03*
X285209Y474923D03*
X285209Y444443D03*
D12*
X394324Y545075D03*
X384324Y545075D03*
X364571Y545075D03*
X374571Y545075D03*
D34*
X92075Y65088D03*
X117475Y64294D03*
X84569Y159210D03*
X44450Y65088D03*
X66675Y177800D03*
X122456Y139319D03*
X142875Y162634D03*
X95250Y120650D03*
X103838Y121333D03*
X125413Y69850D03*
D35*
X596900Y60325D03*
X595313Y219075D03*
D34*
X595313Y205624D03*
X563563Y117041D03*
X549275Y147638D03*
X563587Y157163D03*
D35*
X493713Y361950D03*
X495300Y373063D03*
X504825Y373063D03*
X514350Y361950D03*
X514350Y373063D03*
X504825Y361950D03*
X523875Y361950D03*
X523875Y373063D03*
X533400Y373063D03*
X533400Y361950D03*
X542925Y361950D03*
X542925Y373063D03*
X552450Y373063D03*
X552450Y361950D03*
X604838Y363538D03*
X606425Y374650D03*
X614363Y363538D03*
X615950Y374650D03*
X625475Y374650D03*
X622300Y363538D03*
X631825Y363538D03*
X641350Y363538D03*
X635000Y374650D03*
X531813Y46038D03*
D34*
X611018Y233363D03*
X555625Y190500D03*
X541338Y228600D03*
X587138Y93663D03*
D35*
X576037Y107540D03*
X550412Y107950D03*
D34*
X581025Y147638D03*
X563563Y147638D03*
X582535Y120650D03*
X582613Y138113D03*
D35*
X560825Y58738D03*
X569913Y58738D03*
D34*
X663575Y182563D03*
X563563Y230188D03*
X566738Y180975D03*
X580848Y228600D03*
X563563Y196682D03*
X608013Y250825D03*
X609407Y211931D03*
X578906Y212725D03*
X663575Y191151D03*
X572237Y173888D03*
D35*
X152400Y314325D03*
X150813Y473075D03*
D34*
X150813Y459624D03*
X119063Y371041D03*
X104775Y401638D03*
X119087Y411163D03*
D35*
X49213Y615950D03*
X50800Y627063D03*
X60325Y627063D03*
X69850Y615950D03*
X69850Y627063D03*
X60325Y615950D03*
X79375Y615950D03*
X79375Y627063D03*
X88900Y627063D03*
X88900Y615950D03*
X98425Y615950D03*
X98425Y627063D03*
X107950Y627063D03*
X107950Y615950D03*
X160338Y617538D03*
X161925Y628650D03*
X169863Y617538D03*
X171450Y628650D03*
X180975Y628650D03*
X177800Y617538D03*
X187325Y617538D03*
X196850Y617538D03*
X190500Y628650D03*
X87313Y300038D03*
D34*
X166518Y487363D03*
X111125Y444500D03*
X96838Y482600D03*
X142638Y347663D03*
D35*
X131537Y361540D03*
X105912Y361950D03*
D34*
X136525Y401638D03*
X119063Y401638D03*
X138035Y374650D03*
X138113Y392113D03*
D35*
X116325Y312738D03*
X125413Y312738D03*
D34*
X219075Y436563D03*
X119063Y484188D03*
X122238Y434975D03*
X136348Y482600D03*
X119063Y450682D03*
X163513Y504825D03*
X164907Y465931D03*
X134406Y466725D03*
X219075Y445151D03*
X127737Y427888D03*
D35*
X803275Y774700D03*
X644525Y773113D03*
D34*
X657976Y773113D03*
X746559Y741363D03*
X715963Y727075D03*
X706438Y741387D03*
D35*
X501650Y671513D03*
X490538Y673100D03*
X490538Y682625D03*
X501650Y692150D03*
X490538Y692150D03*
X501650Y682625D03*
X501650Y701675D03*
X490538Y701675D03*
X490538Y711200D03*
X501650Y711200D03*
X501650Y720725D03*
X490538Y720725D03*
X490538Y730250D03*
X501650Y730250D03*
X500063Y782638D03*
X488950Y784225D03*
X500063Y792163D03*
X488950Y793750D03*
X488950Y803275D03*
X500063Y800100D03*
X500063Y809625D03*
X500063Y819150D03*
X488950Y812800D03*
X817563Y709613D03*
D34*
X630238Y788818D03*
X673100Y733425D03*
X635000Y719138D03*
X769938Y764938D03*
D35*
X756060Y753837D03*
X755650Y728212D03*
D34*
X715963Y758825D03*
X715963Y741363D03*
X742950Y760335D03*
X725488Y760413D03*
D35*
X804863Y738625D03*
X804863Y747713D03*
D34*
X681038Y841375D03*
X633413Y741363D03*
X682625Y744538D03*
X635000Y758648D03*
X666919Y741363D03*
X612775Y785813D03*
X651669Y787207D03*
X650875Y756706D03*
X672450Y841375D03*
X689712Y750037D03*
D35*
X850900Y60325D03*
X849313Y219075D03*
D34*
X849313Y205624D03*
X817563Y117041D03*
X803275Y147638D03*
X817587Y157163D03*
D35*
X747713Y361950D03*
X749300Y373063D03*
X758825Y373063D03*
X768350Y361950D03*
X768350Y373063D03*
X758825Y361950D03*
X777875Y361950D03*
X777875Y373063D03*
X787400Y373063D03*
X787400Y361950D03*
X796925Y361950D03*
X796925Y373063D03*
X806450Y373063D03*
X806450Y361950D03*
X858838Y363538D03*
X860425Y374650D03*
X868363Y363538D03*
X869950Y374650D03*
X879475Y374650D03*
X876300Y363538D03*
X885825Y363538D03*
X895350Y363538D03*
X889000Y374650D03*
X785813Y46038D03*
D34*
X865018Y233363D03*
X809625Y190500D03*
X795338Y228600D03*
X841138Y93663D03*
D35*
X830037Y107540D03*
X804412Y107950D03*
D34*
X835025Y147638D03*
X817563Y147638D03*
X836535Y120650D03*
X836613Y138113D03*
D35*
X814825Y58738D03*
X823913Y58738D03*
D34*
X917575Y182563D03*
X817563Y230188D03*
X820738Y180975D03*
X834848Y228600D03*
X817563Y196682D03*
X862013Y250825D03*
X863407Y211931D03*
X832906Y212725D03*
X917575Y191151D03*
X826237Y173888D03*
D36*
X366404Y55026D03*
X366404Y69314D03*
X372754Y62163D03*
X403363Y35797D03*
X403363Y44608D03*
D34*
X291749Y136997D03*
X315247Y95342D03*
X323525Y148478D03*
D37*
X315629Y43355D03*
X303720Y43355D03*
X292195Y43355D03*
D34*
X297812Y95241D03*
X311386Y76270D03*
X403321Y100222D03*
X406369Y148057D03*
X402660Y139620D03*
X337295Y109268D03*
X345711Y138370D03*
X334632Y94467D03*
X395724Y121468D03*
X350284Y102781D03*
X341890Y84531D03*
X335289Y78211D03*
X275496Y81456D03*
X399942Y129128D03*
X342697Y116022D03*
D38*
X324465Y166675D03*
X314093Y166675D03*
X303720Y166675D03*
X362499Y177048D03*
X362114Y164370D03*
X362499Y189726D03*
D34*
X386205Y138370D03*
X343754Y97165D03*
D36*
X379104Y258226D03*
X379104Y272514D03*
X385454Y265363D03*
X416063Y238997D03*
X416063Y247808D03*
D34*
X304449Y340197D03*
X327947Y298542D03*
X336225Y351678D03*
D37*
X328329Y246555D03*
X316420Y246555D03*
X304895Y246555D03*
D34*
X310512Y298441D03*
X324086Y279470D03*
X416021Y303422D03*
X419069Y351257D03*
X415360Y342820D03*
X349995Y312468D03*
X358411Y341570D03*
X347332Y297667D03*
X408424Y324668D03*
X362984Y305981D03*
X354590Y287731D03*
X347989Y281411D03*
X288196Y284656D03*
X412642Y332328D03*
X355397Y319222D03*
D38*
X337165Y369875D03*
X326793Y369875D03*
X316420Y369875D03*
X375199Y380248D03*
X374814Y367570D03*
X375199Y392926D03*
D34*
X398905Y341570D03*
X356454Y300365D03*
D36*
X379104Y461426D03*
X379104Y475714D03*
X385454Y468563D03*
X416063Y442197D03*
X416063Y451008D03*
D34*
X304449Y543397D03*
X327947Y501742D03*
X336225Y554878D03*
D37*
X328329Y449755D03*
X316420Y449755D03*
X304895Y449755D03*
D34*
X310512Y501641D03*
X324086Y482670D03*
X416021Y506622D03*
X419069Y554457D03*
X415360Y546020D03*
X349995Y515668D03*
X358411Y544770D03*
X347332Y500867D03*
X408424Y527868D03*
X362984Y509181D03*
X354590Y490931D03*
X347989Y484611D03*
X288196Y487856D03*
X412642Y535528D03*
X355397Y522422D03*
D38*
X337165Y573075D03*
X326793Y573075D03*
X316420Y573075D03*
X375199Y583448D03*
X374814Y570770D03*
X375199Y596126D03*
D34*
X398905Y544770D03*
X356454Y503565D03*
M02*
