G04 EAGLE Gerber RS-274X export*
G75*
%MOMM*%
%FSLAX34Y34*%
%LPD*%
%INSolderpaste Bottom*%
%IPPOS*%
%AMOC8*
5,1,8,0,0,1.08239X$1,22.5*%
G01*
%ADD10R,0.511800X0.611800*%
%ADD11R,0.611800X0.511800*%
%ADD12R,0.300000X0.550000*%
%ADD13R,0.300000X0.350000*%
%ADD14R,0.350000X0.300000*%
%ADD15R,0.550000X0.300000*%
%ADD16R,0.680200X1.208800*%
%ADD17R,0.961800X0.961800*%
%ADD18C,0.320000*%
%ADD19R,2.500000X1.700000*%
%ADD20R,3.000000X7.000000*%
%ADD21R,1.700000X2.500000*%
%ADD22R,7.000000X3.000000*%
%ADD23R,1.208800X0.680200*%
%ADD24C,0.337100*%
%ADD25R,2.200000X2.200000*%

G36*
X664367Y761037D02*
X664367Y761037D01*
X664368Y761038D01*
X664368Y762538D01*
X664363Y762542D01*
X664363Y762543D01*
X661363Y762543D01*
X661361Y762541D01*
X661359Y762541D01*
X661359Y762540D01*
X661358Y762538D01*
X661359Y762536D01*
X661359Y762534D01*
X662859Y761034D01*
X662861Y761034D01*
X662863Y761033D01*
X664363Y761033D01*
X664367Y761037D01*
G37*
G36*
X108742Y456237D02*
X108742Y456237D01*
X108743Y456238D01*
X108743Y457738D01*
X108738Y457742D01*
X108738Y457743D01*
X105738Y457743D01*
X105736Y457741D01*
X105734Y457741D01*
X105734Y457740D01*
X105733Y457738D01*
X105734Y457736D01*
X105734Y457734D01*
X107234Y456234D01*
X107236Y456234D01*
X107238Y456233D01*
X108738Y456233D01*
X108742Y456237D01*
G37*
G36*
X307815Y518251D02*
X307815Y518251D01*
X307815Y519751D01*
X307811Y519756D01*
X307810Y519756D01*
X304810Y519756D01*
X304809Y519755D01*
X304807Y519755D01*
X304807Y519753D01*
X304805Y519752D01*
X304807Y519750D01*
X304807Y519748D01*
X306307Y518248D01*
X306309Y518248D01*
X306310Y518246D01*
X307810Y518246D01*
X307815Y518251D01*
G37*
G36*
X97630Y165724D02*
X97630Y165724D01*
X97630Y165725D01*
X97630Y167225D01*
X97626Y167230D01*
X97625Y167230D01*
X94625Y167230D01*
X94624Y167229D01*
X94622Y167229D01*
X94622Y167227D01*
X94620Y167226D01*
X94622Y167224D01*
X94621Y167221D01*
X96121Y165721D01*
X96124Y165721D01*
X96125Y165720D01*
X97625Y165720D01*
X97630Y165724D01*
G37*
G36*
X807242Y202237D02*
X807242Y202237D01*
X807243Y202238D01*
X807243Y203738D01*
X807238Y203742D01*
X807238Y203743D01*
X804238Y203743D01*
X804236Y203741D01*
X804234Y203741D01*
X804234Y203740D01*
X804233Y203738D01*
X804234Y203736D01*
X804234Y203734D01*
X805734Y202234D01*
X805736Y202234D01*
X805738Y202233D01*
X807238Y202233D01*
X807242Y202237D01*
G37*
G36*
X295115Y111851D02*
X295115Y111851D01*
X295115Y113351D01*
X295111Y113356D01*
X295110Y113356D01*
X292110Y113356D01*
X292109Y113355D01*
X292107Y113355D01*
X292107Y113353D01*
X292105Y113352D01*
X292107Y113350D01*
X292107Y113348D01*
X293607Y111848D01*
X293609Y111848D01*
X293610Y111846D01*
X295110Y111846D01*
X295115Y111851D01*
G37*
G36*
X553242Y202237D02*
X553242Y202237D01*
X553243Y202238D01*
X553243Y203738D01*
X553238Y203742D01*
X553238Y203743D01*
X550238Y203743D01*
X550236Y203741D01*
X550234Y203741D01*
X550234Y203740D01*
X550233Y203738D01*
X550234Y203736D01*
X550234Y203734D01*
X551734Y202234D01*
X551736Y202234D01*
X551738Y202233D01*
X553238Y202233D01*
X553242Y202237D01*
G37*
G36*
X307815Y315051D02*
X307815Y315051D01*
X307815Y316551D01*
X307811Y316556D01*
X307810Y316556D01*
X304810Y316556D01*
X304809Y316555D01*
X304807Y316555D01*
X304807Y316553D01*
X304805Y316552D01*
X304807Y316550D01*
X304807Y316548D01*
X306307Y315048D01*
X306309Y315048D01*
X306310Y315046D01*
X307810Y315046D01*
X307815Y315051D01*
G37*
G36*
X129126Y132721D02*
X129126Y132721D01*
X129128Y132721D01*
X129128Y132723D01*
X129130Y132725D01*
X129130Y135725D01*
X129126Y135730D01*
X129125Y135730D01*
X127625Y135730D01*
X127620Y135726D01*
X127620Y135725D01*
X127620Y134225D01*
X127622Y134223D01*
X127621Y134221D01*
X129121Y132721D01*
X129123Y132721D01*
X129124Y132720D01*
X129126Y132721D01*
G37*
G36*
X326611Y78847D02*
X326611Y78847D01*
X326613Y78847D01*
X326613Y78850D01*
X326615Y78851D01*
X326615Y81851D01*
X326611Y81856D01*
X326610Y81856D01*
X325110Y81856D01*
X325105Y81852D01*
X325105Y81851D01*
X325105Y80351D01*
X325107Y80350D01*
X325107Y80348D01*
X326607Y78848D01*
X326608Y78848D01*
X326610Y78846D01*
X326611Y78847D01*
G37*
G36*
X339311Y485247D02*
X339311Y485247D01*
X339313Y485247D01*
X339313Y485250D01*
X339315Y485251D01*
X339315Y488251D01*
X339311Y488256D01*
X339310Y488256D01*
X337810Y488256D01*
X337805Y488252D01*
X337805Y488251D01*
X337805Y486751D01*
X337807Y486750D01*
X337807Y486748D01*
X339307Y485248D01*
X339308Y485248D01*
X339310Y485246D01*
X339311Y485247D01*
G37*
G36*
X140238Y423234D02*
X140238Y423234D01*
X140241Y423234D01*
X140241Y423236D01*
X140243Y423238D01*
X140243Y426238D01*
X140238Y426242D01*
X140238Y426243D01*
X138738Y426243D01*
X138733Y426238D01*
X138733Y424738D01*
X138734Y424736D01*
X138734Y424734D01*
X140234Y423234D01*
X140236Y423234D01*
X140237Y423233D01*
X140238Y423234D01*
G37*
G36*
X695863Y728034D02*
X695863Y728034D01*
X695866Y728034D01*
X695866Y728036D01*
X695868Y728038D01*
X695868Y731038D01*
X695863Y731042D01*
X695863Y731043D01*
X694363Y731043D01*
X694358Y731038D01*
X694358Y729538D01*
X694359Y729536D01*
X694359Y729534D01*
X695859Y728034D01*
X695861Y728034D01*
X695862Y728033D01*
X695863Y728034D01*
G37*
G36*
X339311Y282047D02*
X339311Y282047D01*
X339313Y282047D01*
X339313Y282050D01*
X339315Y282051D01*
X339315Y285051D01*
X339311Y285056D01*
X339310Y285056D01*
X337810Y285056D01*
X337805Y285052D01*
X337805Y285051D01*
X337805Y283551D01*
X337807Y283550D01*
X337807Y283548D01*
X339307Y282048D01*
X339308Y282048D01*
X339310Y282046D01*
X339311Y282047D01*
G37*
G36*
X584738Y169234D02*
X584738Y169234D01*
X584741Y169234D01*
X584741Y169236D01*
X584743Y169238D01*
X584743Y172238D01*
X584738Y172242D01*
X584738Y172243D01*
X583238Y172243D01*
X583233Y172238D01*
X583233Y170738D01*
X583234Y170736D01*
X583234Y170734D01*
X584734Y169234D01*
X584736Y169234D01*
X584737Y169233D01*
X584738Y169234D01*
G37*
G36*
X838738Y169234D02*
X838738Y169234D01*
X838741Y169234D01*
X838741Y169236D01*
X838743Y169238D01*
X838743Y172238D01*
X838738Y172242D01*
X838738Y172243D01*
X837238Y172243D01*
X837233Y172238D01*
X837233Y170738D01*
X837234Y170736D01*
X837234Y170734D01*
X838734Y169234D01*
X838736Y169234D01*
X838737Y169233D01*
X838738Y169234D01*
G37*
G36*
X339315Y515251D02*
X339315Y515251D01*
X339315Y518251D01*
X339314Y518253D01*
X339314Y518254D01*
X339312Y518254D01*
X339311Y518256D01*
X339309Y518255D01*
X339307Y518255D01*
X337807Y516755D01*
X337807Y516753D01*
X337806Y516752D01*
X337805Y516751D01*
X337805Y515251D01*
X337810Y515246D01*
X337810Y515247D01*
X337810Y515246D01*
X339310Y515246D01*
X339315Y515251D01*
G37*
G36*
X695867Y758037D02*
X695867Y758037D01*
X695868Y758038D01*
X695868Y761038D01*
X695866Y761039D01*
X695866Y761041D01*
X695865Y761041D01*
X695863Y761042D01*
X695861Y761041D01*
X695859Y761041D01*
X694359Y759541D01*
X694359Y759539D01*
X694358Y759539D01*
X694358Y759538D01*
X694358Y758038D01*
X694362Y758033D01*
X694363Y758033D01*
X695863Y758033D01*
X695867Y758037D01*
G37*
G36*
X584742Y199237D02*
X584742Y199237D01*
X584743Y199238D01*
X584743Y202238D01*
X584741Y202239D01*
X584741Y202241D01*
X584740Y202241D01*
X584738Y202242D01*
X584736Y202241D01*
X584734Y202241D01*
X583234Y200741D01*
X583234Y200739D01*
X583233Y200739D01*
X583233Y200738D01*
X583233Y199238D01*
X583237Y199233D01*
X583238Y199233D01*
X584738Y199233D01*
X584742Y199237D01*
G37*
G36*
X129130Y162724D02*
X129130Y162724D01*
X129130Y162725D01*
X129130Y165725D01*
X129129Y165726D01*
X129129Y165728D01*
X129127Y165728D01*
X129126Y165730D01*
X129124Y165728D01*
X129121Y165729D01*
X127621Y164229D01*
X127621Y164227D01*
X127621Y164226D01*
X127620Y164225D01*
X127620Y162725D01*
X127624Y162720D01*
X127625Y162720D01*
X129125Y162720D01*
X129130Y162724D01*
G37*
G36*
X838742Y199237D02*
X838742Y199237D01*
X838743Y199238D01*
X838743Y202238D01*
X838741Y202239D01*
X838741Y202241D01*
X838740Y202241D01*
X838738Y202242D01*
X838736Y202241D01*
X838734Y202241D01*
X837234Y200741D01*
X837234Y200739D01*
X837233Y200739D01*
X837233Y200738D01*
X837233Y199238D01*
X837237Y199233D01*
X837238Y199233D01*
X838738Y199233D01*
X838742Y199237D01*
G37*
G36*
X140242Y453237D02*
X140242Y453237D01*
X140243Y453238D01*
X140243Y456238D01*
X140241Y456239D01*
X140241Y456241D01*
X140240Y456241D01*
X140238Y456242D01*
X140236Y456241D01*
X140234Y456241D01*
X138734Y454741D01*
X138734Y454739D01*
X138733Y454739D01*
X138733Y454738D01*
X138733Y453238D01*
X138737Y453233D01*
X138738Y453233D01*
X140238Y453233D01*
X140242Y453237D01*
G37*
G36*
X339315Y312051D02*
X339315Y312051D01*
X339315Y315051D01*
X339314Y315053D01*
X339314Y315054D01*
X339312Y315054D01*
X339311Y315056D01*
X339309Y315055D01*
X339307Y315055D01*
X337807Y313555D01*
X337807Y313553D01*
X337806Y313552D01*
X337805Y313551D01*
X337805Y312051D01*
X337810Y312046D01*
X337810Y312047D01*
X337810Y312046D01*
X339310Y312046D01*
X339315Y312051D01*
G37*
G36*
X326615Y108851D02*
X326615Y108851D01*
X326615Y111851D01*
X326614Y111853D01*
X326614Y111854D01*
X326612Y111854D01*
X326611Y111856D01*
X326609Y111855D01*
X326607Y111855D01*
X325107Y110355D01*
X325107Y110353D01*
X325106Y110352D01*
X325105Y110351D01*
X325105Y108851D01*
X325110Y108846D01*
X325110Y108847D01*
X325110Y108846D01*
X326610Y108846D01*
X326615Y108851D01*
G37*
G36*
X659864Y728034D02*
X659864Y728034D01*
X659866Y728034D01*
X661366Y729534D01*
X661366Y729536D01*
X661367Y729537D01*
X661368Y729538D01*
X661368Y731038D01*
X661363Y731042D01*
X661363Y731043D01*
X659863Y731043D01*
X659858Y731038D01*
X659858Y728038D01*
X659859Y728036D01*
X659859Y728034D01*
X659860Y728034D01*
X659862Y728033D01*
X659864Y728034D01*
G37*
G36*
X93126Y132722D02*
X93126Y132722D01*
X93129Y132721D01*
X94629Y134221D01*
X94629Y134224D01*
X94630Y134225D01*
X94630Y135725D01*
X94626Y135730D01*
X94625Y135730D01*
X93125Y135730D01*
X93120Y135726D01*
X93120Y135725D01*
X93120Y132725D01*
X93121Y132724D01*
X93121Y132722D01*
X93123Y132722D01*
X93124Y132720D01*
X93126Y132722D01*
G37*
G36*
X303311Y485248D02*
X303311Y485248D01*
X303314Y485248D01*
X304814Y486748D01*
X304814Y486750D01*
X304815Y486751D01*
X304815Y488251D01*
X304811Y488256D01*
X304810Y488256D01*
X303310Y488256D01*
X303305Y488252D01*
X303305Y488251D01*
X303305Y485251D01*
X303306Y485250D01*
X303306Y485248D01*
X303308Y485248D01*
X303310Y485246D01*
X303311Y485248D01*
G37*
G36*
X303311Y282048D02*
X303311Y282048D01*
X303314Y282048D01*
X304814Y283548D01*
X304814Y283550D01*
X304815Y283551D01*
X304815Y285051D01*
X304811Y285056D01*
X304810Y285056D01*
X303310Y285056D01*
X303305Y285052D01*
X303305Y285051D01*
X303305Y282051D01*
X303306Y282050D01*
X303306Y282048D01*
X303308Y282048D01*
X303310Y282046D01*
X303311Y282048D01*
G37*
G36*
X548739Y169234D02*
X548739Y169234D01*
X548741Y169234D01*
X550241Y170734D01*
X550241Y170736D01*
X550242Y170737D01*
X550243Y170738D01*
X550243Y172238D01*
X550238Y172242D01*
X550238Y172243D01*
X548738Y172243D01*
X548733Y172238D01*
X548733Y169238D01*
X548734Y169236D01*
X548734Y169234D01*
X548735Y169234D01*
X548737Y169233D01*
X548739Y169234D01*
G37*
G36*
X104239Y423234D02*
X104239Y423234D01*
X104241Y423234D01*
X105741Y424734D01*
X105741Y424736D01*
X105742Y424737D01*
X105743Y424738D01*
X105743Y426238D01*
X105738Y426242D01*
X105738Y426243D01*
X104238Y426243D01*
X104233Y426238D01*
X104233Y423238D01*
X104234Y423236D01*
X104234Y423234D01*
X104235Y423234D01*
X104237Y423233D01*
X104239Y423234D01*
G37*
G36*
X802739Y169234D02*
X802739Y169234D01*
X802741Y169234D01*
X804241Y170734D01*
X804241Y170736D01*
X804242Y170737D01*
X804243Y170738D01*
X804243Y172238D01*
X804238Y172242D01*
X804238Y172243D01*
X802738Y172243D01*
X802733Y172238D01*
X802733Y169238D01*
X802734Y169236D01*
X802734Y169234D01*
X802735Y169234D01*
X802737Y169233D01*
X802739Y169234D01*
G37*
G36*
X290611Y78848D02*
X290611Y78848D01*
X290614Y78848D01*
X292114Y80348D01*
X292114Y80350D01*
X292115Y80351D01*
X292115Y81851D01*
X292111Y81856D01*
X292110Y81856D01*
X290610Y81856D01*
X290605Y81852D01*
X290605Y81851D01*
X290605Y78851D01*
X290606Y78850D01*
X290606Y78848D01*
X290608Y78848D01*
X290610Y78846D01*
X290611Y78848D01*
G37*
G36*
X295115Y77351D02*
X295115Y77351D01*
X295115Y78851D01*
X295111Y78856D01*
X295110Y78856D01*
X293610Y78856D01*
X293608Y78855D01*
X293607Y78855D01*
X292107Y77355D01*
X292107Y77353D01*
X292105Y77352D01*
X292106Y77351D01*
X292106Y77348D01*
X292109Y77348D01*
X292110Y77346D01*
X295110Y77346D01*
X295115Y77351D01*
G37*
G36*
X664367Y726537D02*
X664367Y726537D01*
X664368Y726538D01*
X664368Y728038D01*
X664363Y728042D01*
X664363Y728043D01*
X662863Y728043D01*
X662861Y728041D01*
X662859Y728041D01*
X661359Y726541D01*
X661359Y726539D01*
X661358Y726538D01*
X661359Y726537D01*
X661359Y726534D01*
X661361Y726534D01*
X661363Y726533D01*
X664363Y726533D01*
X664367Y726537D01*
G37*
G36*
X307815Y483751D02*
X307815Y483751D01*
X307815Y485251D01*
X307811Y485256D01*
X307810Y485256D01*
X306310Y485256D01*
X306308Y485255D01*
X306307Y485255D01*
X304807Y483755D01*
X304807Y483753D01*
X304805Y483752D01*
X304806Y483751D01*
X304806Y483748D01*
X304809Y483748D01*
X304810Y483746D01*
X307810Y483746D01*
X307815Y483751D01*
G37*
G36*
X97630Y131224D02*
X97630Y131224D01*
X97630Y131225D01*
X97630Y132725D01*
X97626Y132730D01*
X97625Y132730D01*
X96125Y132730D01*
X96123Y132728D01*
X96121Y132729D01*
X94621Y131229D01*
X94621Y131227D01*
X94620Y131226D01*
X94621Y131224D01*
X94621Y131222D01*
X94623Y131222D01*
X94625Y131220D01*
X97625Y131220D01*
X97630Y131224D01*
G37*
G36*
X807242Y167737D02*
X807242Y167737D01*
X807243Y167738D01*
X807243Y169238D01*
X807238Y169242D01*
X807238Y169243D01*
X805738Y169243D01*
X805736Y169241D01*
X805734Y169241D01*
X804234Y167741D01*
X804234Y167739D01*
X804233Y167738D01*
X804234Y167737D01*
X804234Y167734D01*
X804236Y167734D01*
X804238Y167733D01*
X807238Y167733D01*
X807242Y167737D01*
G37*
G36*
X108742Y421737D02*
X108742Y421737D01*
X108743Y421738D01*
X108743Y423238D01*
X108738Y423242D01*
X108738Y423243D01*
X107238Y423243D01*
X107236Y423241D01*
X107234Y423241D01*
X105734Y421741D01*
X105734Y421739D01*
X105733Y421738D01*
X105734Y421737D01*
X105734Y421734D01*
X105736Y421734D01*
X105738Y421733D01*
X108738Y421733D01*
X108742Y421737D01*
G37*
G36*
X553242Y167737D02*
X553242Y167737D01*
X553243Y167738D01*
X553243Y169238D01*
X553238Y169242D01*
X553238Y169243D01*
X551738Y169243D01*
X551736Y169241D01*
X551734Y169241D01*
X550234Y167741D01*
X550234Y167739D01*
X550233Y167738D01*
X550234Y167737D01*
X550234Y167734D01*
X550236Y167734D01*
X550238Y167733D01*
X553238Y167733D01*
X553242Y167737D01*
G37*
G36*
X307815Y280551D02*
X307815Y280551D01*
X307815Y282051D01*
X307811Y282056D01*
X307810Y282056D01*
X306310Y282056D01*
X306308Y282055D01*
X306307Y282055D01*
X304807Y280555D01*
X304807Y280553D01*
X304805Y280552D01*
X304806Y280551D01*
X304806Y280548D01*
X304809Y280548D01*
X304810Y280546D01*
X307810Y280546D01*
X307815Y280551D01*
G37*
G36*
X336312Y315048D02*
X336312Y315048D01*
X336314Y315048D01*
X337814Y316548D01*
X337814Y316549D01*
X337815Y316551D01*
X337814Y316552D01*
X337814Y316554D01*
X337812Y316554D01*
X337810Y316556D01*
X334810Y316556D01*
X334805Y316552D01*
X334805Y316551D01*
X334805Y315051D01*
X334810Y315046D01*
X334810Y315047D01*
X334810Y315046D01*
X336310Y315046D01*
X336312Y315048D01*
G37*
G36*
X835739Y202234D02*
X835739Y202234D01*
X835741Y202234D01*
X837241Y203734D01*
X837241Y203736D01*
X837242Y203737D01*
X837241Y203738D01*
X837241Y203741D01*
X837239Y203741D01*
X837238Y203743D01*
X834238Y203743D01*
X834233Y203738D01*
X834233Y202238D01*
X834237Y202233D01*
X834238Y202233D01*
X835738Y202233D01*
X835739Y202234D01*
G37*
G36*
X126127Y165722D02*
X126127Y165722D01*
X126129Y165721D01*
X127629Y167221D01*
X127629Y167223D01*
X127630Y167224D01*
X127629Y167226D01*
X127629Y167228D01*
X127627Y167228D01*
X127625Y167230D01*
X124625Y167230D01*
X124620Y167226D01*
X124620Y167225D01*
X124620Y165725D01*
X124624Y165720D01*
X124625Y165720D01*
X126125Y165720D01*
X126127Y165722D01*
G37*
G36*
X581739Y202234D02*
X581739Y202234D01*
X581741Y202234D01*
X583241Y203734D01*
X583241Y203736D01*
X583242Y203737D01*
X583241Y203738D01*
X583241Y203741D01*
X583239Y203741D01*
X583238Y203743D01*
X580238Y203743D01*
X580233Y203738D01*
X580233Y202238D01*
X580237Y202233D01*
X580238Y202233D01*
X581738Y202233D01*
X581739Y202234D01*
G37*
G36*
X323612Y111848D02*
X323612Y111848D01*
X323614Y111848D01*
X325114Y113348D01*
X325114Y113349D01*
X325115Y113351D01*
X325114Y113352D01*
X325114Y113354D01*
X325112Y113354D01*
X325110Y113356D01*
X322110Y113356D01*
X322105Y113352D01*
X322105Y113351D01*
X322105Y111851D01*
X322110Y111846D01*
X322110Y111847D01*
X322110Y111846D01*
X323610Y111846D01*
X323612Y111848D01*
G37*
G36*
X692864Y761034D02*
X692864Y761034D01*
X692866Y761034D01*
X694366Y762534D01*
X694366Y762536D01*
X694367Y762537D01*
X694366Y762538D01*
X694366Y762541D01*
X694364Y762541D01*
X694363Y762543D01*
X691363Y762543D01*
X691358Y762538D01*
X691358Y761038D01*
X691362Y761033D01*
X691363Y761033D01*
X692863Y761033D01*
X692864Y761034D01*
G37*
G36*
X336312Y518248D02*
X336312Y518248D01*
X336314Y518248D01*
X337814Y519748D01*
X337814Y519749D01*
X337815Y519751D01*
X337814Y519752D01*
X337814Y519754D01*
X337812Y519754D01*
X337810Y519756D01*
X334810Y519756D01*
X334805Y519752D01*
X334805Y519751D01*
X334805Y518251D01*
X334810Y518246D01*
X334810Y518247D01*
X334810Y518246D01*
X336310Y518246D01*
X336312Y518248D01*
G37*
G36*
X137239Y456234D02*
X137239Y456234D01*
X137241Y456234D01*
X138741Y457734D01*
X138741Y457736D01*
X138742Y457737D01*
X138741Y457738D01*
X138741Y457741D01*
X138739Y457741D01*
X138738Y457743D01*
X135738Y457743D01*
X135733Y457738D01*
X135733Y456238D01*
X135737Y456233D01*
X135738Y456233D01*
X137238Y456233D01*
X137239Y456234D01*
G37*
G36*
X337811Y280547D02*
X337811Y280547D01*
X337813Y280547D01*
X337813Y280549D01*
X337815Y280551D01*
X337814Y280552D01*
X337814Y280555D01*
X336314Y282055D01*
X336311Y282055D01*
X336310Y282056D01*
X334810Y282056D01*
X334805Y282052D01*
X334805Y282051D01*
X334805Y280551D01*
X334810Y280546D01*
X334810Y280547D01*
X334810Y280546D01*
X337810Y280546D01*
X337811Y280547D01*
G37*
G36*
X337811Y483747D02*
X337811Y483747D01*
X337813Y483747D01*
X337813Y483749D01*
X337815Y483751D01*
X337814Y483752D01*
X337814Y483755D01*
X336314Y485255D01*
X336311Y485255D01*
X336310Y485256D01*
X334810Y485256D01*
X334805Y485252D01*
X334805Y485251D01*
X334805Y483751D01*
X334810Y483746D01*
X334810Y483747D01*
X334810Y483746D01*
X337810Y483746D01*
X337811Y483747D01*
G37*
G36*
X694364Y726534D02*
X694364Y726534D01*
X694366Y726534D01*
X694366Y726535D01*
X694367Y726537D01*
X694366Y726539D01*
X694366Y726541D01*
X692866Y728041D01*
X692864Y728041D01*
X692863Y728043D01*
X691363Y728043D01*
X691358Y728038D01*
X691358Y726538D01*
X691362Y726533D01*
X691363Y726533D01*
X694363Y726533D01*
X694364Y726534D01*
G37*
G36*
X127626Y131221D02*
X127626Y131221D01*
X127628Y131221D01*
X127628Y131223D01*
X127630Y131224D01*
X127628Y131226D01*
X127629Y131229D01*
X126129Y132729D01*
X126126Y132729D01*
X126125Y132730D01*
X124625Y132730D01*
X124620Y132726D01*
X124620Y132725D01*
X124620Y131225D01*
X124624Y131220D01*
X124625Y131220D01*
X127625Y131220D01*
X127626Y131221D01*
G37*
G36*
X138739Y421734D02*
X138739Y421734D01*
X138741Y421734D01*
X138741Y421735D01*
X138742Y421737D01*
X138741Y421739D01*
X138741Y421741D01*
X137241Y423241D01*
X137239Y423241D01*
X137238Y423243D01*
X135738Y423243D01*
X135733Y423238D01*
X135733Y421738D01*
X135737Y421733D01*
X135738Y421733D01*
X138738Y421733D01*
X138739Y421734D01*
G37*
G36*
X583239Y167734D02*
X583239Y167734D01*
X583241Y167734D01*
X583241Y167735D01*
X583242Y167737D01*
X583241Y167739D01*
X583241Y167741D01*
X581741Y169241D01*
X581739Y169241D01*
X581738Y169243D01*
X580238Y169243D01*
X580233Y169238D01*
X580233Y167738D01*
X580237Y167733D01*
X580238Y167733D01*
X583238Y167733D01*
X583239Y167734D01*
G37*
G36*
X837239Y167734D02*
X837239Y167734D01*
X837241Y167734D01*
X837241Y167735D01*
X837242Y167737D01*
X837241Y167739D01*
X837241Y167741D01*
X835741Y169241D01*
X835739Y169241D01*
X835738Y169243D01*
X834238Y169243D01*
X834233Y169238D01*
X834233Y167738D01*
X834237Y167733D01*
X834238Y167733D01*
X837238Y167733D01*
X837239Y167734D01*
G37*
G36*
X325111Y77347D02*
X325111Y77347D01*
X325113Y77347D01*
X325113Y77349D01*
X325115Y77351D01*
X325114Y77352D01*
X325114Y77355D01*
X323614Y78855D01*
X323611Y78855D01*
X323610Y78856D01*
X322110Y78856D01*
X322105Y78852D01*
X322105Y78851D01*
X322105Y77351D01*
X322110Y77346D01*
X322110Y77347D01*
X322110Y77346D01*
X325110Y77346D01*
X325111Y77347D01*
G37*
G36*
X94630Y162724D02*
X94630Y162724D01*
X94630Y162725D01*
X94630Y164225D01*
X94628Y164227D01*
X94629Y164229D01*
X93129Y165729D01*
X93127Y165729D01*
X93126Y165730D01*
X93124Y165729D01*
X93122Y165729D01*
X93122Y165727D01*
X93120Y165725D01*
X93120Y162725D01*
X93124Y162720D01*
X93125Y162720D01*
X94625Y162720D01*
X94630Y162724D01*
G37*
G36*
X304815Y515251D02*
X304815Y515251D01*
X304815Y516751D01*
X304814Y516753D01*
X304814Y516755D01*
X303314Y518255D01*
X303312Y518255D01*
X303311Y518256D01*
X303309Y518255D01*
X303307Y518255D01*
X303307Y518253D01*
X303305Y518251D01*
X303305Y515251D01*
X303310Y515246D01*
X303310Y515247D01*
X303310Y515246D01*
X304810Y515246D01*
X304815Y515251D01*
G37*
G36*
X550242Y199237D02*
X550242Y199237D01*
X550243Y199238D01*
X550243Y200738D01*
X550241Y200739D01*
X550241Y200741D01*
X548741Y202241D01*
X548739Y202241D01*
X548738Y202242D01*
X548737Y202241D01*
X548734Y202241D01*
X548734Y202239D01*
X548733Y202238D01*
X548733Y199238D01*
X548737Y199233D01*
X548738Y199233D01*
X550238Y199233D01*
X550242Y199237D01*
G37*
G36*
X661367Y758037D02*
X661367Y758037D01*
X661368Y758038D01*
X661368Y759538D01*
X661366Y759539D01*
X661366Y759541D01*
X659866Y761041D01*
X659864Y761041D01*
X659863Y761042D01*
X659862Y761041D01*
X659859Y761041D01*
X659859Y761039D01*
X659858Y761038D01*
X659858Y758038D01*
X659862Y758033D01*
X659863Y758033D01*
X661363Y758033D01*
X661367Y758037D01*
G37*
G36*
X292115Y108851D02*
X292115Y108851D01*
X292115Y110351D01*
X292114Y110353D01*
X292114Y110355D01*
X290614Y111855D01*
X290612Y111855D01*
X290611Y111856D01*
X290609Y111855D01*
X290607Y111855D01*
X290607Y111853D01*
X290605Y111851D01*
X290605Y108851D01*
X290610Y108846D01*
X290610Y108847D01*
X290610Y108846D01*
X292110Y108846D01*
X292115Y108851D01*
G37*
G36*
X804242Y199237D02*
X804242Y199237D01*
X804243Y199238D01*
X804243Y200738D01*
X804241Y200739D01*
X804241Y200741D01*
X802741Y202241D01*
X802739Y202241D01*
X802738Y202242D01*
X802737Y202241D01*
X802734Y202241D01*
X802734Y202239D01*
X802733Y202238D01*
X802733Y199238D01*
X802737Y199233D01*
X802738Y199233D01*
X804238Y199233D01*
X804242Y199237D01*
G37*
G36*
X105742Y453237D02*
X105742Y453237D01*
X105743Y453238D01*
X105743Y454738D01*
X105741Y454739D01*
X105741Y454741D01*
X104241Y456241D01*
X104239Y456241D01*
X104238Y456242D01*
X104237Y456241D01*
X104234Y456241D01*
X104234Y456239D01*
X104233Y456238D01*
X104233Y453238D01*
X104237Y453233D01*
X104238Y453233D01*
X105738Y453233D01*
X105742Y453237D01*
G37*
G36*
X304815Y312051D02*
X304815Y312051D01*
X304815Y313551D01*
X304814Y313553D01*
X304814Y313555D01*
X303314Y315055D01*
X303312Y315055D01*
X303311Y315056D01*
X303309Y315055D01*
X303307Y315055D01*
X303307Y315053D01*
X303305Y315051D01*
X303305Y312051D01*
X303310Y312046D01*
X303310Y312047D01*
X303310Y312046D01*
X304810Y312046D01*
X304815Y312051D01*
G37*
D10*
X46275Y101600D03*
X36275Y101600D03*
D11*
X66675Y165338D03*
X66675Y155338D03*
X85725Y97869D03*
X85725Y87869D03*
X127000Y86281D03*
X127000Y96281D03*
X65881Y74056D03*
X65881Y64056D03*
X139700Y151050D03*
X139700Y141050D03*
D10*
X54213Y127000D03*
X44213Y127000D03*
D12*
X111125Y167975D03*
X106125Y167975D03*
X101125Y167975D03*
X116125Y167975D03*
X121125Y167975D03*
D13*
X96125Y168975D03*
X126125Y168975D03*
D14*
X91375Y164225D03*
D15*
X92375Y159225D03*
X92375Y154225D03*
X92375Y149225D03*
X92375Y144225D03*
X92375Y139225D03*
D14*
X91375Y134225D03*
D13*
X96125Y129475D03*
D12*
X101125Y130475D03*
X106125Y130475D03*
X111125Y130475D03*
X116125Y130475D03*
X121125Y130475D03*
D13*
X126125Y129475D03*
D14*
X130875Y134225D03*
D15*
X129875Y139225D03*
X129875Y144225D03*
X129875Y149225D03*
X129875Y154225D03*
X129875Y159225D03*
D14*
X130875Y164225D03*
D11*
X78581Y151369D03*
X78581Y161369D03*
X85725Y114538D03*
X85725Y104538D03*
D16*
X53950Y138280D03*
X44450Y138280D03*
X34950Y138280D03*
X34950Y163346D03*
X53950Y163346D03*
X34950Y90321D03*
X44450Y90321D03*
X53950Y90321D03*
X53950Y65255D03*
X34950Y65255D03*
D17*
X115406Y85825D03*
X98906Y85825D03*
X98906Y98325D03*
X115406Y98325D03*
D10*
X617300Y58738D03*
X627300Y58738D03*
X528875Y158750D03*
X518875Y158750D03*
X518875Y196850D03*
X528875Y196850D03*
X617300Y106363D03*
X627300Y106363D03*
X515700Y106363D03*
X525700Y106363D03*
X515700Y58738D03*
X525700Y58738D03*
X603488Y195263D03*
X593488Y195263D03*
D11*
X569913Y107713D03*
X569913Y117713D03*
D10*
X587138Y68263D03*
X597138Y68263D03*
D18*
X556988Y94603D02*
X556988Y99509D01*
X563488Y99509D02*
X563488Y94603D01*
X569988Y94603D02*
X569988Y99509D01*
X576488Y99509D02*
X576488Y94603D01*
X576488Y70497D02*
X576488Y65591D01*
X569988Y65591D02*
X569988Y70497D01*
X563488Y70497D02*
X563488Y65591D01*
X556988Y65591D02*
X556988Y70497D01*
D19*
X566738Y82550D03*
D20*
X484188Y466350D03*
X646588Y466350D03*
D12*
X566738Y204488D03*
X561738Y204488D03*
X556738Y204488D03*
X571738Y204488D03*
X576738Y204488D03*
D13*
X551738Y205488D03*
X581738Y205488D03*
D14*
X546988Y200738D03*
D15*
X547988Y195738D03*
X547988Y190738D03*
X547988Y185738D03*
X547988Y180738D03*
X547988Y175738D03*
D14*
X546988Y170738D03*
D13*
X551738Y165988D03*
D12*
X556738Y166988D03*
X561738Y166988D03*
X566738Y166988D03*
X571738Y166988D03*
X576738Y166988D03*
D13*
X581738Y165988D03*
D14*
X586488Y170738D03*
D15*
X585488Y175738D03*
X585488Y180738D03*
X585488Y185738D03*
X585488Y190738D03*
X585488Y195738D03*
D14*
X586488Y200738D03*
D11*
X541338Y209313D03*
X541338Y219313D03*
X508000Y174388D03*
X508000Y184388D03*
D16*
X525438Y70017D03*
X515938Y70017D03*
X506438Y70017D03*
X506438Y95083D03*
X525438Y95083D03*
X627038Y70017D03*
X617538Y70017D03*
X608038Y70017D03*
X608038Y95083D03*
X627038Y95083D03*
D17*
X530125Y186050D03*
X530125Y169550D03*
X517625Y169550D03*
X517625Y186050D03*
D10*
X172800Y312738D03*
X182800Y312738D03*
X84375Y412750D03*
X74375Y412750D03*
X74375Y450850D03*
X84375Y450850D03*
X172800Y360363D03*
X182800Y360363D03*
X71200Y360363D03*
X81200Y360363D03*
X71200Y312738D03*
X81200Y312738D03*
X158988Y449263D03*
X148988Y449263D03*
D11*
X125413Y361713D03*
X125413Y371713D03*
D10*
X142638Y322263D03*
X152638Y322263D03*
D18*
X112488Y348603D02*
X112488Y353509D01*
X118988Y353509D02*
X118988Y348603D01*
X125488Y348603D02*
X125488Y353509D01*
X131988Y353509D02*
X131988Y348603D01*
X131988Y324497D02*
X131988Y319591D01*
X125488Y319591D02*
X125488Y324497D01*
X118988Y324497D02*
X118988Y319591D01*
X112488Y319591D02*
X112488Y324497D01*
D19*
X122238Y336550D03*
D20*
X39688Y720350D03*
X202088Y720350D03*
D12*
X122238Y458488D03*
X117238Y458488D03*
X112238Y458488D03*
X127238Y458488D03*
X132238Y458488D03*
D13*
X107238Y459488D03*
X137238Y459488D03*
D14*
X102488Y454738D03*
D15*
X103488Y449738D03*
X103488Y444738D03*
X103488Y439738D03*
X103488Y434738D03*
X103488Y429738D03*
D14*
X102488Y424738D03*
D13*
X107238Y419988D03*
D12*
X112238Y420988D03*
X117238Y420988D03*
X122238Y420988D03*
X127238Y420988D03*
X132238Y420988D03*
D13*
X137238Y419988D03*
D14*
X141988Y424738D03*
D15*
X140988Y429738D03*
X140988Y434738D03*
X140988Y439738D03*
X140988Y444738D03*
X140988Y449738D03*
D14*
X141988Y454738D03*
D11*
X96838Y463313D03*
X96838Y473313D03*
X63500Y428388D03*
X63500Y438388D03*
D16*
X80938Y324017D03*
X71438Y324017D03*
X61938Y324017D03*
X61938Y349083D03*
X80938Y349083D03*
X182538Y324017D03*
X173038Y324017D03*
X163538Y324017D03*
X163538Y349083D03*
X182538Y349083D03*
D17*
X85625Y440050D03*
X85625Y423550D03*
X73125Y423550D03*
X73125Y440050D03*
D11*
X804863Y795100D03*
X804863Y805100D03*
X704850Y706675D03*
X704850Y696675D03*
X666750Y696675D03*
X666750Y706675D03*
X757238Y795100D03*
X757238Y805100D03*
X757238Y693500D03*
X757238Y703500D03*
X804863Y693500D03*
X804863Y703500D03*
X668338Y781288D03*
X668338Y771288D03*
D10*
X755888Y747713D03*
X745888Y747713D03*
D11*
X795338Y764938D03*
X795338Y774938D03*
D18*
X768997Y734788D02*
X764091Y734788D01*
X764091Y741288D02*
X768997Y741288D01*
X768997Y747788D02*
X764091Y747788D01*
X764091Y754288D02*
X768997Y754288D01*
X793103Y754288D02*
X798009Y754288D01*
X798009Y747788D02*
X793103Y747788D01*
X793103Y741288D02*
X798009Y741288D01*
X798009Y734788D02*
X793103Y734788D01*
D21*
X781050Y744538D03*
D22*
X397250Y661988D03*
X397250Y824388D03*
D15*
X659113Y744538D03*
X659113Y739538D03*
X659113Y734538D03*
X659113Y749538D03*
X659113Y754538D03*
D14*
X658113Y729538D03*
X658113Y759538D03*
D13*
X662863Y724788D03*
D12*
X667863Y725788D03*
X672863Y725788D03*
X677863Y725788D03*
X682863Y725788D03*
X687863Y725788D03*
D13*
X692863Y724788D03*
D14*
X697613Y729538D03*
D15*
X696613Y734538D03*
X696613Y739538D03*
X696613Y744538D03*
X696613Y749538D03*
X696613Y754538D03*
D14*
X697613Y759538D03*
D13*
X692863Y764288D03*
D12*
X687863Y763288D03*
X682863Y763288D03*
X677863Y763288D03*
X672863Y763288D03*
X667863Y763288D03*
D13*
X662863Y764288D03*
D10*
X654288Y719138D03*
X644288Y719138D03*
X689213Y685800D03*
X679213Y685800D03*
D23*
X793583Y703238D03*
X793583Y693738D03*
X793583Y684238D03*
X768517Y684238D03*
X768517Y703238D03*
X793583Y804838D03*
X793583Y795338D03*
X793583Y785838D03*
X768517Y785838D03*
X768517Y804838D03*
D17*
X677550Y707925D03*
X694050Y707925D03*
X694050Y695425D03*
X677550Y695425D03*
D10*
X871300Y58738D03*
X881300Y58738D03*
X782875Y158750D03*
X772875Y158750D03*
X772875Y196850D03*
X782875Y196850D03*
X871300Y106363D03*
X881300Y106363D03*
X769700Y106363D03*
X779700Y106363D03*
X769700Y58738D03*
X779700Y58738D03*
X857488Y195263D03*
X847488Y195263D03*
D11*
X823913Y107713D03*
X823913Y117713D03*
D10*
X841138Y68263D03*
X851138Y68263D03*
D18*
X810988Y94603D02*
X810988Y99509D01*
X817488Y99509D02*
X817488Y94603D01*
X823988Y94603D02*
X823988Y99509D01*
X830488Y99509D02*
X830488Y94603D01*
X830488Y70497D02*
X830488Y65591D01*
X823988Y65591D02*
X823988Y70497D01*
X817488Y70497D02*
X817488Y65591D01*
X810988Y65591D02*
X810988Y70497D01*
D19*
X820738Y82550D03*
D20*
X738188Y466350D03*
X900588Y466350D03*
D12*
X820738Y204488D03*
X815738Y204488D03*
X810738Y204488D03*
X825738Y204488D03*
X830738Y204488D03*
D13*
X805738Y205488D03*
X835738Y205488D03*
D14*
X800988Y200738D03*
D15*
X801988Y195738D03*
X801988Y190738D03*
X801988Y185738D03*
X801988Y180738D03*
X801988Y175738D03*
D14*
X800988Y170738D03*
D13*
X805738Y165988D03*
D12*
X810738Y166988D03*
X815738Y166988D03*
X820738Y166988D03*
X825738Y166988D03*
X830738Y166988D03*
D13*
X835738Y165988D03*
D14*
X840488Y170738D03*
D15*
X839488Y175738D03*
X839488Y180738D03*
X839488Y185738D03*
X839488Y190738D03*
X839488Y195738D03*
D14*
X840488Y200738D03*
D11*
X795338Y209313D03*
X795338Y219313D03*
X762000Y174388D03*
X762000Y184388D03*
D16*
X779438Y70017D03*
X769938Y70017D03*
X760438Y70017D03*
X760438Y95083D03*
X779438Y95083D03*
X881038Y70017D03*
X871538Y70017D03*
X862038Y70017D03*
X862038Y95083D03*
X881038Y95083D03*
D17*
X784125Y186050D03*
X784125Y169550D03*
X771625Y169550D03*
X771625Y186050D03*
D11*
X393659Y100723D03*
X393659Y90723D03*
D10*
X311386Y69003D03*
X321386Y69003D03*
X384308Y77712D03*
X394308Y77712D03*
D15*
X327360Y95351D03*
X327360Y100351D03*
X327360Y105351D03*
X327360Y90351D03*
X327360Y85351D03*
D14*
X328360Y110351D03*
X328360Y80351D03*
D13*
X323610Y115101D03*
D12*
X318610Y114101D03*
X313610Y114101D03*
X308610Y114101D03*
X303610Y114101D03*
X298610Y114101D03*
D13*
X293610Y115101D03*
D14*
X288860Y110351D03*
D15*
X289860Y105351D03*
X289860Y100351D03*
X289860Y95351D03*
X289860Y90351D03*
X289860Y85351D03*
D14*
X288860Y80351D03*
D13*
X293610Y75601D03*
D12*
X298610Y76601D03*
X303610Y76601D03*
X308610Y76601D03*
X313610Y76601D03*
X318610Y76601D03*
D13*
X323610Y75601D03*
D11*
X271170Y151811D03*
X271170Y161811D03*
D17*
X313535Y134501D03*
X297035Y134501D03*
X297035Y147001D03*
X313535Y147001D03*
D11*
X287029Y146545D03*
X287029Y136545D03*
X323252Y134834D03*
X323252Y144834D03*
D10*
X293167Y124083D03*
X303167Y124083D03*
D24*
X357086Y134352D02*
X357086Y141438D01*
X357086Y141438D01*
X357086Y134352D01*
X357086Y134352D01*
X357086Y137554D02*
X357086Y137554D01*
X357086Y140756D02*
X357086Y140756D01*
X363586Y141438D02*
X363586Y134352D01*
X363586Y141438D02*
X363586Y141438D01*
X363586Y134352D01*
X363586Y134352D01*
X363586Y137554D02*
X363586Y137554D01*
X363586Y140756D02*
X363586Y140756D01*
X370086Y141438D02*
X370086Y134352D01*
X370086Y141438D02*
X370086Y141438D01*
X370086Y134352D01*
X370086Y134352D01*
X370086Y137554D02*
X370086Y137554D01*
X370086Y140756D02*
X370086Y140756D01*
X376586Y141438D02*
X376586Y134352D01*
X376586Y141438D02*
X376586Y141438D01*
X376586Y134352D01*
X376586Y134352D01*
X376586Y137554D02*
X376586Y137554D01*
X376586Y140756D02*
X376586Y140756D01*
X381916Y129022D02*
X389002Y129022D01*
X389002Y129022D01*
X381916Y129022D01*
X381916Y129022D01*
X381916Y122522D02*
X389002Y122522D01*
X389002Y122522D01*
X381916Y122522D01*
X381916Y122522D01*
X381916Y116022D02*
X389002Y116022D01*
X389002Y116022D01*
X381916Y116022D01*
X381916Y116022D01*
X381916Y109522D02*
X389002Y109522D01*
X389002Y109522D01*
X381916Y109522D01*
X381916Y109522D01*
X376586Y104192D02*
X376586Y97106D01*
X376586Y104192D02*
X376586Y104192D01*
X376586Y97106D01*
X376586Y97106D01*
X376586Y100308D02*
X376586Y100308D01*
X376586Y103510D02*
X376586Y103510D01*
X370086Y104192D02*
X370086Y97106D01*
X370086Y104192D02*
X370086Y104192D01*
X370086Y97106D01*
X370086Y97106D01*
X370086Y100308D02*
X370086Y100308D01*
X370086Y103510D02*
X370086Y103510D01*
X363586Y104192D02*
X363586Y97106D01*
X363586Y104192D02*
X363586Y104192D01*
X363586Y97106D01*
X363586Y97106D01*
X363586Y100308D02*
X363586Y100308D01*
X363586Y103510D02*
X363586Y103510D01*
X357086Y104192D02*
X357086Y97106D01*
X357086Y104192D02*
X357086Y104192D01*
X357086Y97106D01*
X357086Y97106D01*
X357086Y100308D02*
X357086Y100308D01*
X357086Y103510D02*
X357086Y103510D01*
X351756Y109522D02*
X344670Y109522D01*
X351756Y109522D02*
X351756Y109522D01*
X344670Y109522D01*
X344670Y109522D01*
X344670Y116022D02*
X351756Y116022D01*
X351756Y116022D01*
X344670Y116022D01*
X344670Y116022D01*
X344670Y122522D02*
X351756Y122522D01*
X351756Y122522D01*
X344670Y122522D01*
X344670Y122522D01*
X344670Y129022D02*
X351756Y129022D01*
X351756Y129022D01*
X344670Y129022D01*
X344670Y129022D01*
D25*
X366836Y119272D03*
D11*
X355666Y91054D03*
X355666Y81054D03*
X406741Y303540D03*
X406741Y293540D03*
D10*
X324086Y272203D03*
X334086Y272203D03*
X397008Y280912D03*
X407008Y280912D03*
D15*
X340060Y298551D03*
X340060Y303551D03*
X340060Y308551D03*
X340060Y293551D03*
X340060Y288551D03*
D14*
X341060Y313551D03*
X341060Y283551D03*
D13*
X336310Y318301D03*
D12*
X331310Y317301D03*
X326310Y317301D03*
X321310Y317301D03*
X316310Y317301D03*
X311310Y317301D03*
D13*
X306310Y318301D03*
D14*
X301560Y313551D03*
D15*
X302560Y308551D03*
X302560Y303551D03*
X302560Y298551D03*
X302560Y293551D03*
X302560Y288551D03*
D14*
X301560Y283551D03*
D13*
X306310Y278801D03*
D12*
X311310Y279801D03*
X316310Y279801D03*
X321310Y279801D03*
X326310Y279801D03*
X331310Y279801D03*
D13*
X336310Y278801D03*
D11*
X283870Y355011D03*
X283870Y365011D03*
D17*
X326235Y337701D03*
X309735Y337701D03*
X309735Y350201D03*
X326235Y350201D03*
D11*
X299729Y349745D03*
X299729Y339745D03*
X335952Y338034D03*
X335952Y348034D03*
D10*
X305867Y327283D03*
X315867Y327283D03*
D24*
X369786Y337552D02*
X369786Y344638D01*
X369786Y344638D01*
X369786Y337552D01*
X369786Y337552D01*
X369786Y340754D02*
X369786Y340754D01*
X369786Y343956D02*
X369786Y343956D01*
X376286Y344638D02*
X376286Y337552D01*
X376286Y344638D02*
X376286Y344638D01*
X376286Y337552D01*
X376286Y337552D01*
X376286Y340754D02*
X376286Y340754D01*
X376286Y343956D02*
X376286Y343956D01*
X382786Y344638D02*
X382786Y337552D01*
X382786Y344638D02*
X382786Y344638D01*
X382786Y337552D01*
X382786Y337552D01*
X382786Y340754D02*
X382786Y340754D01*
X382786Y343956D02*
X382786Y343956D01*
X389286Y344638D02*
X389286Y337552D01*
X389286Y344638D02*
X389286Y344638D01*
X389286Y337552D01*
X389286Y337552D01*
X389286Y340754D02*
X389286Y340754D01*
X389286Y343956D02*
X389286Y343956D01*
X394616Y332222D02*
X401702Y332222D01*
X401702Y332222D01*
X394616Y332222D01*
X394616Y332222D01*
X394616Y325722D02*
X401702Y325722D01*
X401702Y325722D01*
X394616Y325722D01*
X394616Y325722D01*
X394616Y319222D02*
X401702Y319222D01*
X401702Y319222D01*
X394616Y319222D01*
X394616Y319222D01*
X394616Y312722D02*
X401702Y312722D01*
X401702Y312722D01*
X394616Y312722D01*
X394616Y312722D01*
X389286Y307392D02*
X389286Y300306D01*
X389286Y307392D02*
X389286Y307392D01*
X389286Y300306D01*
X389286Y300306D01*
X389286Y303508D02*
X389286Y303508D01*
X389286Y306710D02*
X389286Y306710D01*
X382786Y307392D02*
X382786Y300306D01*
X382786Y307392D02*
X382786Y307392D01*
X382786Y300306D01*
X382786Y300306D01*
X382786Y303508D02*
X382786Y303508D01*
X382786Y306710D02*
X382786Y306710D01*
X376286Y307392D02*
X376286Y300306D01*
X376286Y307392D02*
X376286Y307392D01*
X376286Y300306D01*
X376286Y300306D01*
X376286Y303508D02*
X376286Y303508D01*
X376286Y306710D02*
X376286Y306710D01*
X369786Y307392D02*
X369786Y300306D01*
X369786Y307392D02*
X369786Y307392D01*
X369786Y300306D01*
X369786Y300306D01*
X369786Y303508D02*
X369786Y303508D01*
X369786Y306710D02*
X369786Y306710D01*
X364456Y312722D02*
X357370Y312722D01*
X364456Y312722D02*
X364456Y312722D01*
X357370Y312722D01*
X357370Y312722D01*
X357370Y319222D02*
X364456Y319222D01*
X364456Y319222D01*
X357370Y319222D01*
X357370Y319222D01*
X357370Y325722D02*
X364456Y325722D01*
X364456Y325722D01*
X357370Y325722D01*
X357370Y325722D01*
X357370Y332222D02*
X364456Y332222D01*
X364456Y332222D01*
X357370Y332222D01*
X357370Y332222D01*
D25*
X379536Y322472D03*
D11*
X368366Y294254D03*
X368366Y284254D03*
X406359Y505592D03*
X406359Y495592D03*
D10*
X324086Y475403D03*
X334086Y475403D03*
X397008Y484112D03*
X407008Y484112D03*
D15*
X340060Y501751D03*
X340060Y506751D03*
X340060Y511751D03*
X340060Y496751D03*
X340060Y491751D03*
D14*
X341060Y516751D03*
X341060Y486751D03*
D13*
X336310Y521501D03*
D12*
X331310Y520501D03*
X326310Y520501D03*
X321310Y520501D03*
X316310Y520501D03*
X311310Y520501D03*
D13*
X306310Y521501D03*
D14*
X301560Y516751D03*
D15*
X302560Y511751D03*
X302560Y506751D03*
X302560Y501751D03*
X302560Y496751D03*
X302560Y491751D03*
D14*
X301560Y486751D03*
D13*
X306310Y482001D03*
D12*
X311310Y483001D03*
X316310Y483001D03*
X321310Y483001D03*
X326310Y483001D03*
X331310Y483001D03*
D13*
X336310Y482001D03*
D11*
X283870Y558211D03*
X283870Y568211D03*
D17*
X326235Y540901D03*
X309735Y540901D03*
X309735Y553401D03*
X326235Y553401D03*
D11*
X299729Y552945D03*
X299729Y542945D03*
X335952Y541234D03*
X335952Y551234D03*
D10*
X305867Y530483D03*
X315867Y530483D03*
D24*
X369786Y540752D02*
X369786Y547838D01*
X369786Y547838D01*
X369786Y540752D01*
X369786Y540752D01*
X369786Y543954D02*
X369786Y543954D01*
X369786Y547156D02*
X369786Y547156D01*
X376286Y547838D02*
X376286Y540752D01*
X376286Y547838D02*
X376286Y547838D01*
X376286Y540752D01*
X376286Y540752D01*
X376286Y543954D02*
X376286Y543954D01*
X376286Y547156D02*
X376286Y547156D01*
X382786Y547838D02*
X382786Y540752D01*
X382786Y547838D02*
X382786Y547838D01*
X382786Y540752D01*
X382786Y540752D01*
X382786Y543954D02*
X382786Y543954D01*
X382786Y547156D02*
X382786Y547156D01*
X389286Y547838D02*
X389286Y540752D01*
X389286Y547838D02*
X389286Y547838D01*
X389286Y540752D01*
X389286Y540752D01*
X389286Y543954D02*
X389286Y543954D01*
X389286Y547156D02*
X389286Y547156D01*
X394616Y535422D02*
X401702Y535422D01*
X401702Y535422D01*
X394616Y535422D01*
X394616Y535422D01*
X394616Y528922D02*
X401702Y528922D01*
X401702Y528922D01*
X394616Y528922D01*
X394616Y528922D01*
X394616Y522422D02*
X401702Y522422D01*
X401702Y522422D01*
X394616Y522422D01*
X394616Y522422D01*
X394616Y515922D02*
X401702Y515922D01*
X401702Y515922D01*
X394616Y515922D01*
X394616Y515922D01*
X389286Y510592D02*
X389286Y503506D01*
X389286Y510592D02*
X389286Y510592D01*
X389286Y503506D01*
X389286Y503506D01*
X389286Y506708D02*
X389286Y506708D01*
X389286Y509910D02*
X389286Y509910D01*
X382786Y510592D02*
X382786Y503506D01*
X382786Y510592D02*
X382786Y510592D01*
X382786Y503506D01*
X382786Y503506D01*
X382786Y506708D02*
X382786Y506708D01*
X382786Y509910D02*
X382786Y509910D01*
X376286Y510592D02*
X376286Y503506D01*
X376286Y510592D02*
X376286Y510592D01*
X376286Y503506D01*
X376286Y503506D01*
X376286Y506708D02*
X376286Y506708D01*
X376286Y509910D02*
X376286Y509910D01*
X369786Y510592D02*
X369786Y503506D01*
X369786Y510592D02*
X369786Y510592D01*
X369786Y503506D01*
X369786Y503506D01*
X369786Y506708D02*
X369786Y506708D01*
X369786Y509910D02*
X369786Y509910D01*
X364456Y515922D02*
X357370Y515922D01*
X364456Y515922D02*
X364456Y515922D01*
X357370Y515922D01*
X357370Y515922D01*
X357370Y522422D02*
X364456Y522422D01*
X364456Y522422D01*
X357370Y522422D01*
X357370Y522422D01*
X357370Y528922D02*
X364456Y528922D01*
X364456Y528922D01*
X357370Y528922D01*
X357370Y528922D01*
X357370Y535422D02*
X364456Y535422D01*
X364456Y535422D01*
X357370Y535422D01*
X357370Y535422D01*
D25*
X379536Y525672D03*
D11*
X368366Y497454D03*
X368366Y487454D03*
M02*
