{
  "wallets": [
    {
      "id": 1,
      "name": "gift cards",
      "type": "GIFT"
    },
    {
      "id": 2,
      "name": "food cards",
      "type": "FOOD"
    }
  ],
  "companies": [
    {
      "id": 1,
      "name": "Wedoogift",
      "balance": 1000,
      "username": "company_wedoogift",
      "password": "$2y$12$tYGGZlXG/rYSk4jV23ScEOB8ILjXpEB8eQxyOmdXBobFjrYkcBgj2"
    },
    {
      "id": 2,
      "name": "Wedoofood",
      "balance": 3000,
      "username": "company_wedoofood",
      "password": "$2y$12$5bD9R98fGpwoUjstJjC3p.b/7AB2SnQlfkwE38harBMLyaSDfbCfW"
    }
  ],
  "users": [
    {
      "id": 1,
      "balance": [
        {
          "wallet_id": 1,
          "amount": 100
        }
      ],
      "username": "user_user1",
      "password": "$2y$12$zHRDFV84bf/JWEbMdjgXkOuNs5XiD5OBI58hlJoFEkgv.XuqK4dsO"
    },
    {
      "id": 2,
      "balance": [
      ],
      "username": "user_user2",
      "password": "$2y$12$LivVjPwGoCeiziUUJw98WOfIUTLGPvGEoGtbOMTZxXypuRyCwGCHS"
    },
    {
      "id": 3,
      "balance": [],
      "username": "user_user3",
      "password": "$2y$12$knxNlMUB6yz.feGNJT68juVT8Vn/Ox88v7BnH/incXULNAsKpiJzm"
    }
  ],
  "distributions": [
  ]
}
