Started at Mon Mar 15 22:40:46 UTC 2021
Processing BackUpGC
Offering BackUpGC to Project Build Discarder
Finished at Mon Mar 15 22:40:46 UTC 2021. 2ms
Started at Tue Mar 16 14:03:40 UTC 2021
Processing BackUpGC
Offering BackUpGC to Project Build Discarder
Finished at Tue Mar 16 14:03:40 UTC 2021. 1ms
Started at Tue Mar 16 15:03:40 UTC 2021
Processing BackUpGC
Offering BackUpGC to Project Build Discarder
Finished at Tue Mar 16 15:03:40 UTC 2021. 1ms
Started at Tue Mar 16 16:03:40 UTC 2021
Processing BackUpGC
Offering BackUpGC to Project Build Discarder
Finished at Tue Mar 16 16:03:40 UTC 2021. 0ms
