Started at Wed Mar 17 20:15:41 UTC 2021
Processing backup
Offering backup to Project Build Discarder
Processing BackUpGC
Offering BackUpGC to Project Build Discarder
Finished at Wed Mar 17 20:15:41 UTC 2021. 76ms
Started at Wed Mar 17 21:15:41 UTC 2021
Processing backup
Offering backup to Project Build Discarder
Processing backup2
Offering backup2 to Project Build Discarder
Processing BackUpGC
Offering BackUpGC to Project Build Discarder
Finished at Wed Mar 17 21:15:41 UTC 2021. 1ms
