Started at Wed Mar 17 18:00:23 UTC 2021
Processing backup
Offering backup to Project Build Discarder
Processing BackUpGC
Offering BackUpGC to Project Build Discarder
Finished at Wed Mar 17 18:00:23 UTC 2021. 1ms
Started at Wed Mar 17 19:00:23 UTC 2021
Processing backup
Offering backup to Project Build Discarder
Processing BackUpGC
Offering BackUpGC to Project Build Discarder
Finished at Wed Mar 17 19:00:23 UTC 2021. 0ms
