Started at Thu Mar 18 14:45:35 UTC 2021
Processing backup
Offering backup to Project Build Discarder
Processing backup2
Offering backup2 to Project Build Discarder
Processing BackUpGC
Offering BackUpGC to Project Build Discarder
Finished at Thu Mar 18 14:45:35 UTC 2021. 1ms
Started at Thu Mar 18 15:45:35 UTC 2021
Processing backup
Offering backup to Project Build Discarder
Processing backup2
Offering backup2 to Project Build Discarder
Processing BackUpGC
Offering BackUpGC to Project Build Discarder
Finished at Thu Mar 18 15:45:35 UTC 2021. 3ms
Started at Thu Mar 18 16:45:35 UTC 2021
Processing backup
Offering backup to Project Build Discarder
Processing backup2
Offering backup2 to Project Build Discarder
Processing BackUpGC
Offering BackUpGC to Project Build Discarder
Finished at Thu Mar 18 16:45:35 UTC 2021. 1ms
