C:\Users\erick.morales\Documents\Weeklys\Jenkins2\mvn projects\morgom-webapp\src\test\java\morgom\maven\TestMessageBuilder.java
C:\Users\erick.morales\Documents\Weeklys\Jenkins2\mvn projects\morgom-webapp\src\test\java\morgom\maven\TestMagicBuilder.java
C:\Users\erick.morales\Documents\Weeklys\Jenkins2\mvn projects\morgom-webapp\src\test\java\morgom\maven\AppTest.java
