<svg id="store_mall_directory-24px" xmlns="http://www.w3.org/2000/svg" width="24" height="24" viewBox="0 0 24 24">
  <path id="Tracé_2503" data-name="Tracé 2503" d="M0,0H24V24H0Z" fill="none"/>
  <path id="Tracé_2504" data-name="Tracé 2504" d="M20,4H4V6H20Zm1,10V12L20,7H4L3,12v2H4v6H14V14h4v6h2V14Zm-9,4H6V14h6Z" fill="#424242"/>
</svg>
