<svg xmlns="http://www.w3.org/2000/svg" width="269.405" height="200.739" viewBox="0 0 269.405 200.739">
  <g id="Fiche_d_incidents" data-name="Fiche d&apos;incidents" transform="translate(0 -55)">
    <g id="freepik--background-complete--inject-256" transform="translate(0 55)">
      <rect id="Rectangle_19396" data-name="Rectangle 19396" width="269.405" height="0.135" transform="translate(0 176.407)" fill="#ebebeb"/>
      <rect id="Rectangle_19397" data-name="Rectangle 19397" width="28.595" height="0.135" transform="translate(213.816 185.076)" fill="#ebebeb"/>
      <rect id="Rectangle_19398" data-name="Rectangle 19398" width="31.607" height="0.135" transform="translate(146.858 183.39)" fill="#ebebeb"/>
      <rect id="Rectangle_19399" data-name="Rectangle 19399" width="10.34" height="0.135" transform="translate(204.856 182.614)" fill="#ebebeb"/>
      <rect id="Rectangle_19400" data-name="Rectangle 19400" width="23.271" height="0.135" transform="translate(54.134 180.981)" fill="#ebebeb"/>
      <rect id="Rectangle_19401" data-name="Rectangle 19401" width="8.319" height="0.135" transform="translate(42.814 180.981)" fill="#ebebeb"/>
      <rect id="Rectangle_19402" data-name="Rectangle 19402" width="29.204" height="0.135" transform="translate(70.837 183.255)" fill="#ebebeb"/>
      <path id="Tracé_5260" data-name="Tracé 5260" d="M145.32,207.376H41.281A3.077,3.077,0,0,1,38.21,204.3V58.05A3.077,3.077,0,0,1,41.281,55H145.32a3.077,3.077,0,0,1,3.077,3.077V204.3A3.077,3.077,0,0,1,145.32,207.376ZM41.281,55.108a2.942,2.942,0,0,0-2.937,2.942V204.3a2.942,2.942,0,0,0,2.937,2.942H145.32a2.947,2.947,0,0,0,2.942-2.942V58.05a2.947,2.947,0,0,0-2.942-2.942Z" transform="translate(-17.622 -55)" fill="#ebebeb"/>
      <path id="Tracé_5261" data-name="Tracé 5261" d="M361.621,207.376H257.577A3.082,3.082,0,0,1,254.5,204.3V58.05A3.082,3.082,0,0,1,257.577,55H361.621a3.077,3.077,0,0,1,3.066,3.05V204.3A3.077,3.077,0,0,1,361.621,207.376ZM257.577,55.108a2.947,2.947,0,0,0-2.942,2.942V204.3a2.947,2.947,0,0,0,2.942,2.942H361.621a2.947,2.947,0,0,0,2.942-2.942V58.05a2.947,2.947,0,0,0-2.942-2.942Z" transform="translate(-117.373 -55)" fill="#ebebeb"/>
      <rect id="Rectangle_19403" data-name="Rectangle 19403" width="38.239" height="6.708" rx="3.354" transform="translate(27.808 137.278)" fill="#ebebeb"/>
      <path id="Tracé_5262" data-name="Tracé 5262" d="M61.454,322.23H56.071L49.95,354.65h5.383Z" transform="translate(-23.036 -178.244)" fill="#e0e0e0"/>
      <path id="Tracé_5263" data-name="Tracé 5263" d="M84.055,322.23H78.672L75.66,354.65h5.383Z" transform="translate(-34.894 -178.244)" fill="#e0e0e0"/>
      <path id="Tracé_5264" data-name="Tracé 5264" d="M102.89,322.23h5.383l6.126,32.42h-5.383Z" transform="translate(-47.452 -178.244)" fill="#e0e0e0"/>
      <rect id="Rectangle_19404" data-name="Rectangle 19404" width="125.893" height="109.675" transform="translate(106.232 8.432)" fill="#e6e6e6"/>
      <rect id="Rectangle_19405" data-name="Rectangle 19405" width="127.908" height="109.675" transform="translate(107.994 8.432)" fill="#f0f0f0"/>
      <rect id="Rectangle_19406" data-name="Rectangle 19406" width="125.893" height="2.123" transform="translate(106.232 118.113)" fill="#e6e6e6"/>
      <rect id="Rectangle_19407" data-name="Rectangle 19407" width="127.908" height="2.123" transform="translate(110.009 118.113)" fill="#f0f0f0"/>
      <rect id="Rectangle_19408" data-name="Rectangle 19408" width="102.859" height="117.331" transform="translate(230.611 11.843) rotate(90)" fill="#fafafa"/>
      <path id="Tracé_5265" data-name="Tracé 5265" d="M279.86,179.839,301.978,76.98h14.65L294.51,179.839Z" transform="translate(-129.068 -65.137)" fill="#fff"/>
      <path id="Tracé_5266" data-name="Tracé 5266" d="M248.12,179.839,270.238,76.98h14.65L262.77,179.839Z" transform="translate(-114.43 -65.137)" fill="#fff"/>
      <path id="Tracé_5267" data-name="Tracé 5267" d="M215.37,77.26v96.113c0,.156.194.28.431.28h.571c.237,0,.431-.124.431-.28V77.26c0-.156-.194-.28-.431-.28H215.8C215.564,76.991,215.37,77.1,215.37,77.26Z" transform="translate(-99.326 -65.137)" fill="#f0f0f0"/>
      <path id="Tracé_5268" data-name="Tracé 5268" d="M349.78,179.839,371.9,76.98h5.711L355.491,179.839Z" transform="translate(-161.315 -65.137)" fill="#fff"/>
      <rect id="Rectangle_19409" data-name="Rectangle 19409" width="102.859" height="0.674" transform="translate(230.611 11.843) rotate(90)" fill="#e6e6e6"/>
      <path id="Tracé_5269" data-name="Tracé 5269" d="M331.963,82.382H206.07l-.49-2.942h125.9Z" transform="translate(-94.811 -66.271)" fill="#e0e0e0" opacity="0.5"/>
      <path id="Tracé_5270" data-name="Tracé 5270" d="M331.963,101.117H206.07l-.49-2.947h125.9Z" transform="translate(-94.811 -74.91)" fill="#e0e0e0" opacity="0.5"/>
      <path id="Tracé_5271" data-name="Tracé 5271" d="M331.963,119.852H206.07l-.49-2.942h125.9Z" transform="translate(-94.811 -83.552)" fill="#e0e0e0" opacity="0.5"/>
      <path id="Tracé_5272" data-name="Tracé 5272" d="M331.963,138.592H206.07l-.49-2.942h125.9Z" transform="translate(-94.811 -92.195)" fill="#e0e0e0" opacity="0.5"/>
      <path id="Tracé_5273" data-name="Tracé 5273" d="M331.963,157.322H206.07l-.49-2.942h125.9Z" transform="translate(-94.811 -100.833)" fill="#e0e0e0" opacity="0.5"/>
      <path id="Tracé_5274" data-name="Tracé 5274" d="M331.963,176.062H206.07l-.49-2.942h125.9Z" transform="translate(-94.811 -109.476)" fill="#e0e0e0" opacity="0.5"/>
      <path id="Tracé_5275" data-name="Tracé 5275" d="M331.963,91.752H206.07l-.49-2.942h125.9Z" transform="translate(-94.811 -70.593)" fill="#e0e0e0" opacity="0.5"/>
      <path id="Tracé_5276" data-name="Tracé 5276" d="M331.963,110.482H206.07l-.49-2.942h125.9Z" transform="translate(-94.811 -79.231)" fill="#e0e0e0" opacity="0.5"/>
      <path id="Tracé_5277" data-name="Tracé 5277" d="M331.963,129.222H206.07l-.49-2.942h125.9Z" transform="translate(-94.811 -87.874)" fill="#e0e0e0" opacity="0.5"/>
      <path id="Tracé_5278" data-name="Tracé 5278" d="M331.963,147.952H206.07l-.49-2.942h125.9Z" transform="translate(-94.811 -96.512)" fill="#e0e0e0" opacity="0.5"/>
      <path id="Tracé_5279" data-name="Tracé 5279" d="M331.963,166.692H206.07l-.49-2.942h125.9Z" transform="translate(-94.811 -105.154)" fill="#e0e0e0" opacity="0.5"/>
      <path id="Tracé_5280" data-name="Tracé 5280" d="M331.963,185.432H206.07l-.49-2.942h125.9Z" transform="translate(-94.811 -113.797)" fill="#e0e0e0" opacity="0.5"/>
      <rect id="Rectangle_19410" data-name="Rectangle 19410" width="16.671" height="49.98" transform="translate(215.454 126.427)" fill="#e6e6e6"/>
      <path id="Tracé_5281" data-name="Tracé 5281" d="M402.847,377.488H413V371.75H392.2Z" transform="translate(-180.879 -201.082)" fill="#ebebeb"/>
      <rect id="Rectangle_19411" data-name="Rectangle 19411" width="16.671" height="49.98" transform="translate(165.485 126.427)" fill="#e6e6e6"/>
      <rect id="Rectangle_19412" data-name="Rectangle 19412" width="58.827" height="48.789" transform="translate(173.298 126.427)" fill="#ebebeb"/>
      <path id="Tracé_5282" data-name="Tracé 5282" d="M331.787,377.488H321.63V371.75h20.8Z" transform="translate(-148.332 -201.082)" fill="#ebebeb"/>
      <rect id="Rectangle_19413" data-name="Rectangle 19413" width="43.073" height="25.136" transform="translate(181.175 132.052)" fill="#fafafa"/>
      <rect id="Rectangle_19414" data-name="Rectangle 19414" width="43.073" height="11.962" transform="translate(181.175 159.747)" fill="#fafafa"/>
      <path id="Tracé_5283" data-name="Tracé 5283" d="M374.82,300.477h-8.028a2.317,2.317,0,0,1-2.311-2.317h12.673a2.317,2.317,0,0,1-2.333,2.317Z" transform="translate(-168.094 -167.143)" fill="#ebebeb"/>
      <path id="Tracé_5284" data-name="Tracé 5284" d="M374.82,351.871h-8.028a2.311,2.311,0,0,1-2.312-2.312h12.673a2.311,2.311,0,0,1-2.333,2.312Z" transform="translate(-168.094 -190.848)" fill="#ebebeb"/>
      <rect id="Rectangle_19415" data-name="Rectangle 19415" width="16.671" height="49.98" transform="translate(152.117 126.427)" fill="#e6e6e6"/>
      <path id="Tracé_5285" data-name="Tracé 5285" d="M285.307,377.488h10.151V371.75h-20.8Z" transform="translate(-126.67 -201.082)" fill="#ebebeb"/>
      <rect id="Rectangle_19416" data-name="Rectangle 19416" width="16.671" height="49.98" transform="translate(102.153 126.427)" fill="#e6e6e6"/>
      <rect id="Rectangle_19417" data-name="Rectangle 19417" width="58.827" height="48.789" transform="translate(109.966 126.427)" fill="#ebebeb"/>
      <path id="Tracé_5286" data-name="Tracé 5286" d="M214.241,377.488H204.09V371.75h20.8Z" transform="translate(-94.124 -201.082)" fill="#ebebeb"/>
      <rect id="Rectangle_19418" data-name="Rectangle 19418" width="43.073" height="25.136" transform="translate(117.843 132.052)" fill="#fafafa"/>
      <rect id="Rectangle_19419" data-name="Rectangle 19419" width="43.073" height="11.962" transform="translate(117.843 159.747)" fill="#fafafa"/>
      <path id="Tracé_5287" data-name="Tracé 5287" d="M257.27,300.477h-8.023a2.322,2.322,0,0,1-2.317-2.317h12.657A2.317,2.317,0,0,1,257.27,300.477Z" transform="translate(-113.882 -167.143)" fill="#ebebeb"/>
      <path id="Tracé_5288" data-name="Tracé 5288" d="M257.27,351.872h-8.023a2.317,2.317,0,0,1-2.317-2.312h12.657a2.312,2.312,0,0,1-2.317,2.311Z" transform="translate(-113.882 -190.848)" fill="#ebebeb"/>
      <rect id="Rectangle_19420" data-name="Rectangle 19420" width="121.987" height="2.096" transform="translate(232.125 126.427) rotate(180)" fill="#f0f0f0"/>
      <rect id="Rectangle_19421" data-name="Rectangle 19421" width="7.985" height="2.096" transform="translate(102.153 124.325)" fill="#e0e0e0"/>
      <path id="Tracé_5289" data-name="Tracé 5289" d="M83.636,251.418c-.76-19.58-1.568-39.048.092-48.87l2.694-1.907s-.593,1.827-.905,31.828-.7,14.494-.366,18.95Z" transform="translate(-38.166 -122.168)" fill="#e6e6e6"/>
      <path id="Tracé_5290" data-name="Tracé 5290" d="M89.446,144.023c4.165-10.852,13.869-21.332,24.408-25.62,4.138-1.681-1.821,35.33-16.827,37.717-7.328,1.164-9.612,19.936-10.846,28.934C85.76,167.326,85.281,154.875,89.446,144.023Z" transform="translate(-39.622 -84.215)" fill="#e6e6e6"/>
      <path id="Tracé_5291" data-name="Tracé 5291" d="M88.293,207.579c2.931-4.645,7.721-11.153,14.72-11.159,7.931,0,.991,13.061-8.335,17.242-4.553,2.037-8.352,8.5-9.338,12.554C85.426,218,85.362,212.223,88.293,207.579Z" transform="translate(-39.358 -120.221)" fill="#e6e6e6"/>
      <path id="Tracé_5292" data-name="Tracé 5292" d="M50.969,171.967c-5.1-9.03-16.455-18.115-28.557-22.247C17.666,148.1,17.2,174.85,42.79,181.251c8.271,2.069,11.584,16.7,13.3,24.063C55.953,191.02,56.045,181,50.969,171.967Z" transform="translate(-9.169 -98.651)" fill="#e6e6e6"/>
      <path id="Tracé_5293" data-name="Tracé 5293" d="M64.207,223.882c-3.233-5.755-12.08-8.567-20.022-8.028-3.114.21-3.459,12.021,13.885,16.585,5.259,1.385,7.382,10.647,8.475,15.335C66.454,238.667,67.451,229.642,64.207,223.882Z" transform="translate(-19.615 -129.154)" fill="#e6e6e6"/>
      <path id="Tracé_5294" data-name="Tracé 5294" d="M67.666,158.7c-2.527-8.05-9.968-15.264-16.795-18.244-2.694-1.169-3.508,12.177,11.153,25.243,4.445,3.966,5.846,15.512,6.573,21.364C68.927,176.618,70.193,166.753,67.666,158.7Z" transform="translate(-22.74 -94.38)" fill="#e6e6e6"/>
      <path id="Tracé_5295" data-name="Tracé 5295" d="M76.5,295.17h0c-5.334,0-9.742-.388-10.043-7.6L65.57,278.1H87.44l-.889,9.467C86.244,294.782,81.837,295.17,76.5,295.17Z" transform="translate(-30.24 -157.891)" fill="#f0f0f0"/>
      <path id="Tracé_5296" data-name="Tracé 5296" d="M86.912,281.544H64.88l-.63-4.434H87.543Z" transform="translate(-29.631 -157.435)" fill="#f0f0f0"/>
    </g>
    <g id="freepik--Shadow--inject-256" transform="translate(30.233 243.541)">
      <ellipse id="freepik--path--inject-256" cx="104.47" cy="6.099" rx="104.47" ry="6.099" fill="#f5f5f5"/>
    </g>
    <g id="freepik--Board--inject-256" transform="translate(38.551 66.935)">
      <rect id="Rectangle_19422" data-name="Rectangle 19422" width="0.539" height="10.846" transform="translate(0 11.06) rotate(-2.79)" fill="#e34168"/>
      <rect id="Rectangle_19423" data-name="Rectangle 19423" width="0.539" height="5.329" transform="translate(0.7 25.558) rotate(-2.79)" fill="#e34168"/>
      <path id="Tracé_5297" data-name="Tracé 5297" d="M242.571,198.151H80.89a.959.959,0,0,1-.954-.927l-5.8-119.077a.954.954,0,0,1,.954-1H236.785a.959.959,0,0,1,.959.905l5.8,119.12a.959.959,0,0,1-.97.975Z" transform="translate(-72.743 -77.15)" fill="#e34168"/>
      <path id="Tracé_5298" data-name="Tracé 5298" d="M83.548,196.931,77.939,81.722a.959.959,0,0,1,.954-1H236.662a.954.954,0,0,1,.954.911l5.609,115.208a.954.954,0,0,1-.954,1H84.5A.959.959,0,0,1,83.548,196.931Z" transform="translate(-74.495 -78.796)" fill="#fff" opacity="0.8"/>
      <path id="Tracé_5299" data-name="Tracé 5299" d="M157.173,196.874a.5.5,0,0,1-.49-.463L151.656,93.142a.49.49,0,1,1,.975-.043l5.032,103.263a.49.49,0,0,1-.469.512Z" transform="translate(-108.491 -84.268)" fill="#fff"/>
      <path id="Tracé_5300" data-name="Tracé 5300" d="M305.353,196.874a.5.5,0,0,1-.49-.463L299.836,93.142a.49.49,0,1,1,.975-.043l5.038,103.263a.49.49,0,0,1-.469.512Z" transform="translate(-176.83 -84.268)" fill="#fff"/>
      <path id="Tracé_5301" data-name="Tracé 5301" d="M231.269,196.874a.5.5,0,0,1-.49-.463L225.746,93.142a.49.49,0,1,1,.975-.043l5.027,103.263a.485.485,0,0,1-.463.512Z" transform="translate(-142.66 -84.268)" fill="#fff"/>
      <path id="Tracé_5302" data-name="Tracé 5302" d="M237.906,112.533H88.046a.49.49,0,1,1,0-.975H237.906a.49.49,0,1,1,0,.975Z" transform="translate(-78.907 -93.017)" fill="#fff"/>
      <path id="Tracé_5303" data-name="Tracé 5303" d="M96.3,101.061a2.408,2.408,0,0,1,2.155.183c.539.345.867,1.078,1.546,1.239.771.156,1.008-.474,1.552-.835a4.148,4.148,0,0,1,2.511-.194q3.066.226,6.126.539a20.986,20.986,0,0,0,6.062.145c.7-.135.4-1.2-.291-1.078-2.058.4-4.24-.038-6.3-.237s-4.143-.388-6.223-.539a4.65,4.65,0,0,0-2.107.226,2.538,2.538,0,0,0-.841.6c-.086.086-.172.264-.313.242s-.3-.339-.35-.4a3.524,3.524,0,0,0-3.842-.975c-.652.259-.372,1.32.291,1.078Z" transform="translate(-82.646 -87.58)" fill="#fff"/>
      <path id="Tracé_5304" data-name="Tracé 5304" d="M163.753,102.993c.819-.614,2.053-1.433,2.726-.2.339.614.668,1.352,1.514,1.223s1.406-1.18,2-1.676a2.226,2.226,0,0,1,2.813-.366,7.193,7.193,0,0,0,2.694,1.2,4.952,4.952,0,0,0,2.726-.436,4.456,4.456,0,0,1,1.579-.539,16.34,16.34,0,0,1,1.757.232,14.117,14.117,0,0,0,3.739-.356c.7-.129.4-1.191-.3-1.078a11.59,11.59,0,0,1-4.063.232,4.849,4.849,0,0,0-1.5-.108,5.156,5.156,0,0,0-1.369.447,3.99,3.99,0,0,1-3.395.2c-.916-.4-1.616-1.153-2.651-1.3a3.3,3.3,0,0,0-2.392.706,9.464,9.464,0,0,0-1.078.981,4.923,4.923,0,0,1-.48.539c-.269.2-.291.178-.453-.119-.393-.738-.77-1.342-1.654-1.519a3.509,3.509,0,0,0-2.759.964c-.539.42,0,1.374.539.948Z" transform="translate(-113.718 -87.895)" fill="#fff"/>
      <path id="Tracé_5305" data-name="Tracé 5305" d="M240.3,102.225c.641-.3,1.293-.577,1.961-.814a6.735,6.735,0,0,1,2.053-.539,8.42,8.42,0,0,1,1.757.485,2.155,2.155,0,0,0,1.358-.14c.388-.178.787-.614,1.207-.684s.884.485,1.3.674a2.435,2.435,0,0,0,1.331.156c.415-.048,1.024-.264,1.412,0s.469.733.857.964a1.148,1.148,0,0,0,1.11.043,4.567,4.567,0,0,0,.921-.819c.474-.4,1.024-.178,1.568-.048a4.052,4.052,0,0,0,1.5.14c.566-.075,1.223-.436,1.794-.323.948.189,1.439,1.191,2.495.674.636-.312.081-1.261-.539-.948-.269.129-1.051-.539-1.309-.668a2.392,2.392,0,0,0-1.455-.086,4.882,4.882,0,0,1-1.778.242,15.084,15.084,0,0,0-1.53-.312,1.913,1.913,0,0,0-1.282.356c-.21.156-.663.851-.938.792-.124,0-.323-.436-.4-.539a1.746,1.746,0,0,0-.447-.42,2,2,0,0,0-1.245-.237,4.225,4.225,0,0,1-1.466.1c-.463-.135-.77-.587-1.234-.749-1.045-.361-1.546.5-2.441.76-.577.167-1.169-.242-1.713-.388a3.378,3.378,0,0,0-1.719,0,20.243,20.243,0,0,0-3.669,1.39c-.636.3-.081,1.25.539.948Z" transform="translate(-148.995 -87.429)" fill="#fff"/>
      <path id="Tracé_5306" data-name="Tracé 5306" d="M308.561,102.006l2.937-.835c.463-.135.932-.3,1.4-.4a2.091,2.091,0,0,1,1.336.242,6.778,6.778,0,0,0,2.462.28c.981,0,1.956,0,2.937-.038l12.015-.145a.539.539,0,1,0,0-1.078l-12.269.151c-.964,0-1.929.032-2.893.038a7,7,0,0,1-1.422-.092c-.442-.1-.814-.345-1.239-.463a4.848,4.848,0,0,0-2.479.431l-3.06.873a.558.558,0,0,0,.291,1.078Z" transform="translate(-180.539 -87.507)" fill="#fff"/>
      <path id="Tracé_5307" data-name="Tracé 5307" d="M139.5,161.078l-26.019,1.4a163.965,163.965,0,0,1-2.074-26.515L136.83,135a234.524,234.524,0,0,0,2.673,26.078Z" transform="translate(-89.931 -103.83)" fill="#e34168" opacity="0.3"/>
      <path id="Tracé_5308" data-name="Tracé 5308" d="M140.073,158.855l-26.019,1.4a192.7,192.7,0,0,1-2.694-26.089l26.019-1.406a234.732,234.732,0,0,0,2.694,26.095Z" transform="translate(-89.909 -102.797)" fill="#e34168"/>
      <path id="Tracé_5309" data-name="Tracé 5309" d="M201.979,177.606l-26.159-1.579V150.1l26.159,1.579Z" transform="translate(-119.637 -110.794)" fill="#e34168" opacity="0.3"/>
      <path id="Tracé_5310" data-name="Tracé 5310" d="M201.344,176.4l-26.154-1.579.307-26.078,26.154,1.573Z" transform="translate(-119.347 -110.167)" fill="#fff"/>
      <path id="Tracé_5311" data-name="Tracé 5311" d="M268.1,168.287l26.148-.857c.647-6.019-2.2-21.143-3.772-26.52l-25.362,1.616A111.244,111.244,0,0,1,268.1,168.287Z" transform="translate(-160.817 -106.555)" fill="#e34168" opacity="0.3"/>
      <path id="Tracé_5312" data-name="Tracé 5312" d="M268.409,166.7l25.324-1.3c.647-6.013-1.029-15.868-2.92-26.073l-25.992,1.649C266.964,150.516,268.527,159.45,268.409,166.7Z" transform="translate(-160.683 -105.822)" fill="#e34168"/>
      <path id="Tracé_5313" data-name="Tracé 5313" d="M134.535,241.958l26.693-2.694c-.07-6.089-3.2-20.227-5.054-25.523L131,216.714C133.694,226.154,133.791,234.711,134.535,241.958Z" transform="translate(-98.967 -140.144)" fill="#e34168" opacity="0.3"/>
      <path id="Tracé_5314" data-name="Tracé 5314" d="M134.985,240.82l25.734-2.8c.318-6.056-1.891-15.836-4.31-25.944l-25.8,3.066C132.684,224.607,134.7,233.589,134.985,240.82Z" transform="translate(-98.787 -139.378)" fill="#e34168"/>
      <path id="Tracé_5315" data-name="Tracé 5315" d="M258,190.363l25.981,4.849c1.951-5.668,2.452-20.89,2.074-26.4l-25.362-3.971A110.727,110.727,0,0,1,258,190.363Z" transform="translate(-157.538 -117.592)" fill="#e34168" opacity="0.3"/>
      <path id="Tracé_5316" data-name="Tracé 5316" d="M259.13,188.93l25.243,4.257c1.956-5.668,2.452-15.545,2.818-25.8l-26.008-4.073C261.215,173,260.827,181.964,259.13,188.93Z" transform="translate(-158.059 -116.886)" fill="#fff"/>
    </g>
    <g id="freepik--Character--inject-256" transform="translate(154.91 89.133)">
      <path id="Tracé_5317" data-name="Tracé 5317" d="M368.955,167.28c.539.539.948,1.024,1.4,1.552s.878,1.04,1.3,1.573c.851,1.078,1.66,2.155,2.43,3.287a37.414,37.414,0,0,1,2.155,3.518,30.556,30.556,0,0,1,1.827,3.831l.2.5.048.124.065.189.119.366c.059.237.113.463.162.69s.075.431.1.641a15.571,15.571,0,0,1,.081,2.317,30.929,30.929,0,0,1-.469,4.17,50.2,50.2,0,0,1-2.074,7.8l-2.834-.657c.21-2.532.4-5.119.474-7.608a34.827,34.827,0,0,0-.059-3.621,10.463,10.463,0,0,0-.232-1.573l-.081-.318-.1-.232-.307-.62a42.486,42.486,0,0,0-3.852-6.132c-.733-1-1.5-1.972-2.279-2.942-.388-.49-.787-.97-1.185-1.444l-1.185-1.374Z" transform="translate(-323.082 -140.915)" fill="#b65b52"/>
      <path id="Tracé_5318" data-name="Tracé 5318" d="M379.961,220.81,378,222.917l3.836,2.263a4.584,4.584,0,0,0,.808-3.567Z" transform="translate(-329.239 -165.602)" fill="#b55b52"/>
      <path id="Tracé_5319" data-name="Tracé 5319" d="M373.26,227.834l3.734,1.309,2.651-2.161-3.836-2.263Z" transform="translate(-327.053 -167.406)" fill="#b55b52"/>
      <path id="Tracé_5320" data-name="Tracé 5320" d="M372.111,220.8l-24.661-5.388a184.375,184.375,0,0,1,5.388-24.661l24.667,5.388a223.85,223.85,0,0,0-5.393,24.661Z" transform="translate(-315.15 -151.739)" fill="#e34168"/>
      <rect id="Rectangle_19424" data-name="Rectangle 19424" width="25.243" height="25.243" transform="translate(36.656 38.381) rotate(16.58)" fill="#fff"/>
      <path id="Tracé_5321" data-name="Tracé 5321" d="M346.067,136.787c0,.313-.194.539-.4.539s-.356-.264-.339-.577.194-.539.4-.539S346.083,136.474,346.067,136.787Z" transform="translate(-314.171 -126.586)" fill="#263238"/>
      <path id="Tracé_5322" data-name="Tracé 5322" d="M345.006,138.32a11.315,11.315,0,0,1-1.616,2.613,1.783,1.783,0,0,0,1.476.339Z" transform="translate(-313.278 -127.559)" fill="#a02724"/>
      <path id="Tracé_5323" data-name="Tracé 5323" d="M347.6,133.517a.194.194,0,0,0,.113-.07.183.183,0,0,0,0-.259,1.816,1.816,0,0,0-1.616-.35.184.184,0,1,0,.113.35h0a1.428,1.428,0,0,1,1.288.291A.2.2,0,0,0,347.6,133.517Z" transform="translate(-314.469 -125.003)" fill="#263238"/>
      <path id="Tracé_5324" data-name="Tracé 5324" d="M356.694,145.6c-.593,2.84-.975,6.767.981,8.659,0,0-.808,2.877-6.083,2.877-5.792,0-2.753-2.522-2.753-2.522,2.419-.749,2.435-3.491,1.913-5.7Z" transform="translate(-315.423 -130.916)" fill="#b55b52"/>
      <path id="Tracé_5325" data-name="Tracé 5325" d="M340.3,408.459c-.5,0-.975-.07-1.137-.291a.35.35,0,0,1,0-.4.453.453,0,0,1,.291-.216c.647-.172,1.994.6,2.048.63a.092.092,0,0,1,.048.1.108.108,0,0,1-.075.075A6.92,6.92,0,0,1,340.3,408.459Zm-.6-.754a.84.84,0,0,0-.178,0,.3.3,0,0,0-.183.129c-.065.113-.043.172,0,.2.178.248,1.158.253,1.88.151A4.112,4.112,0,0,0,339.7,407.7Z" transform="translate(-311.299 -251.713)" fill="#e34168"/>
      <path id="Tracé_5326" data-name="Tracé 5326" d="M342.353,407.559h-.038c-.469-.21-1.385-1.051-1.309-1.487,0-.1.1-.232.345-.259a.663.663,0,0,1,.539.156,2.621,2.621,0,0,1,.582,1.492.129.129,0,0,1-.038.086A.1.1,0,0,1,342.353,407.559Zm-.927-1.573h-.059c-.162,0-.172.081-.178.1-.048.264.577.921,1.051,1.207a2.155,2.155,0,0,0-.5-1.191.49.49,0,0,0-.318-.119Z" transform="translate(-312.176 -250.92)" fill="#e34168"/>
      <path id="Tracé_5327" data-name="Tracé 5327" d="M348.169,401.207h-3.879l-.269-8.977H347.9Z" transform="translate(-313.568 -244.66)" fill="#b55b52"/>
      <path id="Tracé_5328" data-name="Tracé 5328" d="M336.681,408.06h4.235a.334.334,0,0,1,.329.264l.722,3.443a.571.571,0,0,1-.571.69c-1.525,0-3.729-.113-5.652-.113-2.241,0-3.659.124-6.293.124-1.59,0-2.01-1.616-1.342-1.757,3.039-.663,4.995-.733,7.635-2.349a1.789,1.789,0,0,1,.938-.3Z" transform="translate(-306.089 -251.96)" fill="#263238"/>
      <path id="Tracé_5329" data-name="Tracé 5329" d="M365.525,162.53c3.718.043,8.917,9.472,8.917,9.472l-5.765,5.868a13.793,13.793,0,0,1-5.873-6.051C360.606,167.336,361.727,162.492,365.525,162.53Z" transform="translate(-321.716 -138.724)" fill="#e34168"/>
      <path id="Tracé_5330" data-name="Tracé 5330" d="M365.525,162.53c3.718.043,8.917,9.472,8.917,9.472l-5.765,5.868a13.793,13.793,0,0,1-5.873-6.051C360.606,167.336,361.727,162.492,365.525,162.53Z" transform="translate(-321.716 -138.724)" opacity="0.3"/>
      <path id="Tracé_5331" data-name="Tracé 5331" d="M335.409,166.34c-.846,4.187-1.455,12.791.63,29.823h20.733c.162-2.759-1.175-14.8.6-27.733a6.04,6.04,0,0,0-5.652-6.838h-.232a77.533,77.533,0,0,0-8.815,0c-.97.092-1.929.232-2.78.383A5.566,5.566,0,0,0,335.409,166.34Z" transform="translate(-309.235 -138.234)" fill="#e34168"/>
      <path id="Tracé_5332" data-name="Tracé 5332" d="M335.409,166.34c-.846,4.187-1.455,12.791.63,29.823h20.733c.162-2.759-1.175-14.8.6-27.733a6.04,6.04,0,0,0-5.652-6.838h-.232a77.533,77.533,0,0,0-8.815,0c-.97.092-1.929.232-2.78.383A5.566,5.566,0,0,0,335.409,166.34Z" transform="translate(-309.235 -138.234)" opacity="0.2"/>
      <path id="Tracé_5333" data-name="Tracé 5333" d="M340.2,184.9l-2.791-1.9c-2.694.878-2.834,3.5-2.694,7.279C337.036,189.7,339.7,187.5,340.2,184.9Z" transform="translate(-309.262 -148.165)" opacity="0.2"/>
      <path id="Tracé_5334" data-name="Tracé 5334" d="M344.02,392.23l.14,4.628h3.879l-.14-4.628Z" transform="translate(-313.568 -244.66)" opacity="0.2"/>
      <path id="Tracé_5335" data-name="Tracé 5335" d="M356.542,131.83c-.442,3.826-.506,6.089-2.549,7.98a5.073,5.073,0,0,1-8.422-2.974c-.641-3.481.189-9.16,4.025-10.534a5.183,5.183,0,0,1,6.945,5.528Z" transform="translate(-314.194 -121.867)" fill="#b55b52"/>
      <path id="Tracé_5336" data-name="Tracé 5336" d="M347.671,129.95c-1.191.269-1.73-2.538-.539-3.615-1.078-.539-2.635-1.32-3.152-2.495-.6-1.347,1.018-2.963,2.414-2.893-.453-.9.539-3.3,3.384-2.4a10.475,10.475,0,0,1,4.181,2.306s.938-3.114,2.915-.6a4.59,4.59,0,0,1,1.078,4.143s2.608,2.473,1.934,4.31a4.488,4.488,0,0,1-2.155,2.495s.393,4.31-2.775,5.388-5.167-1.078-4.9-2.338C348.011,134.325,345.92,131.631,347.671,129.95Z" transform="translate(-313.491 -118.348)" fill="#263238"/>
      <path id="Tracé_5337" data-name="Tracé 5337" d="M350.847,137.906a4.451,4.451,0,0,1-1.272,2.5c-.911.878-1.751.248-1.821-.889-.065-1.024.334-2.694,1.4-3.168S350.993,136.763,350.847,137.906Z" transform="translate(-315.287 -126.59)" fill="#b55b52"/>
      <path id="Tracé_5338" data-name="Tracé 5338" d="M406.915,392.219l-3.448,1.239-3.427-8.874,3.448-1.234Z" transform="translate(-339.404 -240.564)" fill="#b55b52"/>
      <path id="Tracé_5339" data-name="Tracé 5339" d="M402.431,402.319a1.594,1.594,0,0,1-1.078.474.35.35,0,0,1-.237-.323.469.469,0,0,1,.1-.35c.4-.539,1.934-.765,2-.771a.1.1,0,0,1,.1.043.108.108,0,0,1,0,.108,7.152,7.152,0,0,1-.878.819Zm-.938-.216a.49.49,0,0,0-.129.129.291.291,0,0,0-.059.21c0,.129.07.162.108.172.291.086,1.078-.512,1.573-1.04a4.068,4.068,0,0,0-1.493.528Z" transform="translate(-339.899 -248.864)" fill="#e34168"/>
      <path id="Tracé_5340" data-name="Tracé 5340" d="M403.428,400.824a.049.049,0,0,1-.032,0c-.5.124-1.735.032-1.945-.361-.048-.092-.07-.237.113-.415a.668.668,0,0,1,.5-.189c.63,0,1.347.781,1.379.814a.086.086,0,0,1,0,.086A.081.081,0,0,1,403.428,400.824Zm-1.7-.663a.146.146,0,0,0-.043.038c-.119.113-.086.172-.075.194.124.232,1.018.366,1.568.3a2.086,2.086,0,0,0-1.126-.636A.474.474,0,0,0,401.731,400.161Z" transform="translate(-340.039 -248.178)" fill="#e34168"/>
      <path id="Tracé_5341" data-name="Tracé 5341" d="M402.586,398.046l3.33-2.619a.356.356,0,0,1,.431,0l2.861,2.155a.539.539,0,0,1,0,.867c-1.218.921-3.567,2.818-5,4.09-1.676,1.493-.372.5-2.338,2.247-1.191,1.078-2.646.194-2.247-.35a11.263,11.263,0,0,0,2.419-5.561A1.315,1.315,0,0,1,402.586,398.046Z" transform="translate(-339.18 -246.101)" fill="#263238"/>
      <path id="Tracé_5342" data-name="Tracé 5342" d="M295.246,185.58l-1.514-3.26-4.122,2.549s1.358,2.775,4.17,2.473Z" transform="translate(-288.475 -147.851)" fill="#b55b52"/>
      <path id="Tracé_5343" data-name="Tracé 5343" d="M288.886,180.414l-.921.792a1.325,1.325,0,0,0-.043,1.972l.717.668,4.122-2.549-2.473-1.078A1.331,1.331,0,0,0,288.886,180.414Z" transform="translate(-287.503 -146.829)" fill="#b55b52"/>
      <path id="Tracé_5344" data-name="Tracé 5344" d="M400.04,384.584l1.767,4.575,3.448-1.234-1.767-4.574Z" transform="translate(-339.404 -240.564)" opacity="0.2"/>
      <path id="Tracé_5345" data-name="Tracé 5345" d="M350.9,225.86s6.466,29.78,8.944,40.836c2.694,12.1,16.967,48.908,16.967,48.908l6.261-3.395s-6.7-28.875-11.59-44.624c-1.778-13.018-7.2-41.725-7.2-41.725Z" transform="translate(-316.741 -167.931)" fill="#263238"/>
      <path id="Tracé_5346" data-name="Tracé 5346" d="M395.72,386.565c-.032,0,1.282,2.43,1.282,2.43l7.748-2.91-.614-2.365Z" transform="translate(-337.411 -240.735)" fill="#e34168"/>
      <path id="Tracé_5347" data-name="Tracé 5347" d="M357.327,251.462c4.882.652,5.431,17.845,5.34,27.937-.065-.318-.14-.62-.2-.905-1.352-6.04-3.89-17.668-5.927-26.978a1.784,1.784,0,0,1,.787-.054Z" transform="translate(-319.342 -179.729)" opacity="0.3"/>
      <path id="Tracé_5348" data-name="Tracé 5348" d="M336.044,225.86s-1.649,28.988-1.379,40.81c.28,12.3,3.734,52.566,3.734,52.566h6.568s1.078-39.549,1.519-51.623c.49-13.169,3.19-41.752,3.19-41.752Z" transform="translate(-309.24 -167.931)" fill="#263238"/>
      <path id="Tracé_5349" data-name="Tracé 5349" d="M339.338,394.3c-.032,0,.334,2.726.334,2.726h7.991l.248-2.43Z" transform="translate(-311.408 -245.614)" fill="#e34168"/>
      <path id="Tracé_5350" data-name="Tracé 5350" d="M323.2,171.753a42.258,42.258,0,0,1-2.99,4.6,47.83,47.83,0,0,1-3.5,4.143c-1.229,1.309-2.527,2.549-3.858,3.723s-2.721,2.3-3.971,3.324l-.442.366-.366.129a6.072,6.072,0,0,1-2.786.307,9,9,0,0,1-2.252-.55,14.844,14.844,0,0,1-3.389-2,24.412,24.412,0,0,1-2.694-2.435c-.41-.426-.8-.873-1.18-1.32s-.738-.9-1.11-1.412l2.128-1.988c.824.614,1.713,1.282,2.6,1.854a28.937,28.937,0,0,0,2.662,1.616,11.779,11.779,0,0,0,2.57,1.045,3.589,3.589,0,0,0,1.018.124.97.97,0,0,0,.512-.14l-.8.5c1.315-1.228,2.505-2.328,3.691-3.486s2.3-2.333,3.373-3.545a48.434,48.434,0,0,0,3.039-3.772c.943-1.309,1.816-2.624,2.64-3.971Z" transform="translate(-290.804 -141.644)" fill="#b65b52"/>
      <path id="Tracé_5351" data-name="Tracé 5351" d="M339.845,167.92c-.372,5.577-6.767,10.237-6.767,10.237l-8.3-4.553s3.055-6.568,7.172-9.672C337.043,160.123,340.125,163.674,339.845,167.92Z" transform="translate(-304.695 -138.623)" fill="#e34168"/>
      <path id="Tracé_5352" data-name="Tracé 5352" d="M339.845,167.92c-.372,5.577-6.767,10.237-6.767,10.237l-8.3-4.553s3.055-6.568,7.172-9.672C337.043,160.123,340.125,163.674,339.845,167.92Z" transform="translate(-304.695 -138.623)" opacity="0.2"/>
    </g>
  </g>
</svg>
