0001;Génériques;BOOLEAN;;PHARMACIE;true
0002;Autres spécialités;BOOLEAN;;PHARMACIE;true
0003;Dermo-cosmétique;BOOLEAN;;PHARMACIE;true
0004;Diététique;BOOLEAN;;PHARMACIE;true
0005;Vétérinaires;BOOLEAN;;PHARMACIE;true
0006;Accessoires et orthopédie;BOOLEAN;;PHARMACIE;true
0007;Phytothérapie;BOOLEAN;;PHARMACIE;true
0008;Autres Produits;BOOLEAN;;PHARMACIE;true
0009;Digital;BOOLEAN;;PHARMACIE;true
0010;Informatique;BOOLEAN;;PHARMACIE;true
0011;Merchandising;BOOLEAN;;PHARMACIE;true
0012;Coaching & Formation;BOOLEAN;;PHARMACIE;true
0013;Démarche qualité;BOOLEAN;;PHARMACIE;true
0014;Abonnement;BOOLEAN;;PHARMACIE;true
0015;Sac & Pochette;BOOLEAN;;PHARMACIE;true
0016;Autres Services;BOOLEAN;;PHARMACIE;true
0017;Type fichier généré;TXT;;GROUPEMENT;csv
0018;Livraison;TXT;;GROUPEMENT;Livraison: environ 4 jours. En cas de première commande les délais de livraison seront augmentés pour la création de votre compte.
0019;Première Commande;TXT;;GROUPEMENT;En cas de première commande, le laboratoire vous demandera les informations suivantes : RIB + Kbis + numéro d'affiliation et/ou photocopie de votre diplôme.
0020;Commentaire plateforme;TXT;;GROUPEMENT;
0021;Commandes plateforme;BOOLEAN;ORDERED;GROUPEMENT;true
0022;Commandes directes;BOOLEAN;ORDERED;GROUPEMENT;false
0023;Commandes grossiste;BOOLEAN;ORDERED;GROUPEMENT;false
0024;franco de port;INT;ORDERED;GROUPEMENT;0
0025;Lieu de livraison;TXT;ORDERED;GROUPEMENT;
0026;Me notifier à propos de;TXT;NOTICE;USER;
0027;En cas d'inactivité;TXT;NOTICE;USER;
0028;Recevoir des notifications;BOOLEAN;NOTICE;USER;false
0029;Nom;BOOLEAN;PHARMAFILTER;GROUPEMENT;true
0030;Titulaire;BOOLEAN;PHARMAFILTER;GROUPEMENT;true
0031;CIP;BOOLEAN;PHARMAFILTER;GROUPEMENT;true
0033;Commercial;BOOLEAN;PHARMAFILTER;GROUPEMENT;true
0034;Sortie;BOOLEAN;PHARMAFILTER;GROUPEMENT;true
0035;Téléphone;BOOLEAN;PHARMAFILTER;GROUPEMENT;true
0036;Adresse;BOOLEAN;PHARMAFILTER;GROUPEMENT;true
0037;Code postal;BOOLEAN;PHARMAFILTER;GROUPEMENT;true
0038;Ville;BOOLEAN;PHARMAFILTER;GROUPEMENT;true
0039;Département;BOOLEAN;PHARMAFILTER;GROUPEMENT;true
0040;Région;BOOLEAN;PHARMAFILTER;GROUPEMENT;true
0041;Président de Région;BOOLEAN;PHARMAFILTER;GROUPEMENT;true
0042;SIRET;BOOLEAN;PHARMAFILTER;GROUPEMENT;true
0043;Contrat;BOOLEAN;PHARMAFILTER;GROUPEMENT;true
0045;Code Enseigne;BOOLEAN;PHARMAFILTER;GROUPEMENT;true
0046;HelloID;BOOLEAN;SSO;GROUPEMENT_SUPERADMIN;false
0047;Activer la confirmation de l'ip lors de la connexion;BOOLEAN;OTHER;GROUPEMENT_SUPERADMIN;true
0048;Nombre de ligne par page pour les tableaux;TXT;OTHER;USER;25
0049;Active Directory;BOOLEAN;OTHER;GROUPEMENT_SUPERADMIN;false


0104;Ma Pharmacie;BOOLEAN;MESSAGERIE;USER;false
0105;Ma Region;BOOLEAN;MESSAGERIE;USER;false
0106;Autres Pharmacies;BOOLEAN;MESSAGERIE;USER;false
0107;Mon Groupement;BOOLEAN;MESSAGERIE;USER;false
0108;Laboratoire partenaire;BOOLEAN;MESSAGERIE;USER;false
0109;Partenaire service;BOOLEAN;MESSAGERIE;USER;false


0110;Ma Pharmacie;BOOLEAN;MESSAGERIE;GROUPEMENT;false
0111;Ma Region;BOOLEAN;MESSAGERIE;GROUPEMENT;false
0112;Autres Pharmacies;BOOLEAN;MESSAGERIE;GROUPEMENT;false
0113;Mon Groupement;BOOLEAN;MESSAGERIE;GROUPEMENT;false
0114;Laboratoire partenaire;BOOLEAN;MESSAGERIE;GROUPEMENT;false
0115;Partenaire service;BOOLEAN;MESSAGERIE;GROUPEMENT;false


0116;Personnel;BOOLEAN;TODO;USER;false
0117;Groupement;BOOLEAN;TODO;USER;false

0118;Personnel;BOOLEAN;TODO;GROUPEMENT;false
0119;Groupement;BOOLEAN;TODO;GROUPEMENT;false

0120;Sous-tâche et sous-projet;BOOLEAN;TODO;GROUPEMENT_SUPERADMIN;false