<svg id="favorite_border-24px" xmlns="http://www.w3.org/2000/svg" width="24" height="24" viewBox="0 0 24 24">
  <path id="Tracé_3034" data-name="Tracé 3034" d="M0,0H24V24H0Z" fill="none"/>
  <g id="Groupe_13824" data-name="Groupe 13824" transform="translate(-333.958 -288.891)">
    <path id="Tracé_3082" data-name="Tracé 3082" d="M336.53,293.124l1.409,1.409a5.273,5.273,0,0,0-1.05,3.217c0,3.674,3.3,6.667,8.31,11.206l1.409,1.283,1.409-1.273c.807-.739,1.565-1.429,2.274-2.08l2.5,2.5,1.234-1.234L337.764,291.89Z" fill="#424242"/>
    <path id="Tracé_3083" data-name="Tracé 3083" d="M351.107,292.42a5.783,5.783,0,0,0-4.374,2.031,5.8,5.8,0,0,0-4.374-2.031h-.107a5.045,5.045,0,0,0-1.283.175L352.876,304.5c2.245-2.352,3.577-4.4,3.577-6.736v-.107A5.289,5.289,0,0,0,351.107,292.42Z" transform="translate(-0.125 -0.015)" fill="#424242"/>
  </g>
</svg>
