<svg xmlns="http://www.w3.org/2000/svg" width="216.782" height="200.879" viewBox="0 0 216.782 200.879">
  <g id="Documents" transform="translate(19348 13981)">
    <g id="freepik--background-complete--inject-24" transform="translate(-19341.57 -13981)">
      <rect id="Rectangle_18928" data-name="Rectangle 18928" width="66.024" height="118.611" transform="translate(113.139 3.236)" fill="#ebebeb"/>
      <rect id="Rectangle_18929" data-name="Rectangle 18929" width="60.068" height="111.636" transform="translate(115.779 6.674)" fill="#fafafa"/>
      <path id="Tracé_3275" data-name="Tracé 3275" d="M340.888,48.365,280.82,124.773V47.05h60.068Z" transform="translate(-165.041 -40.376)" fill="#f5f5f5"/>
      <rect id="Rectangle_18930" data-name="Rectangle 18930" width="61.374" height="1.188" transform="translate(115.779 38.789)" fill="#ebebeb"/>
      <rect id="Rectangle_18931" data-name="Rectangle 18931" width="61.374" height="1.188" transform="translate(115.779 65.371)" fill="#ebebeb"/>
      <rect id="Rectangle_18932" data-name="Rectangle 18932" width="61.374" height="1.188" transform="translate(115.779 91.958)" fill="#ebebeb"/>
      <rect id="Rectangle_18933" data-name="Rectangle 18933" width="82.09" height="3.034" transform="translate(144.296 121.475) rotate(-90)" fill="#ebebeb"/>
      <rect id="Rectangle_18934" data-name="Rectangle 18934" width="1.376" height="32.707" transform="translate(127.346 6.674)" fill="#ebebeb"/>
      <rect id="Rectangle_18935" data-name="Rectangle 18935" width="1.376" height="32.707" transform="translate(139.2 6.674)" fill="#ebebeb"/>
      <rect id="Rectangle_18936" data-name="Rectangle 18936" width="1.376" height="32.707" transform="translate(151.059 6.674)" fill="#ebebeb"/>
      <rect id="Rectangle_18937" data-name="Rectangle 18937" width="1.376" height="32.707" transform="translate(162.918 6.674)" fill="#ebebeb"/>
      <rect id="Rectangle_18938" data-name="Rectangle 18938" width="2.794" height="121.353" transform="translate(110.345 1.221)" fill="#f5f5f5"/>
      <path id="Tracé_3276" data-name="Tracé 3276" d="M418.574,157.131l-2.794-1.071V35.44h2.794Z" transform="translate(-236.617 -34.219)" fill="#e0e0e0"/>
      <rect id="Rectangle_18939" data-name="Rectangle 18939" width="71.608" height="3.236" transform="translate(110.345)" fill="#e0e0e0"/>
      <rect id="Rectangle_18940" data-name="Rectangle 18940" width="75.482" height="3.015" transform="translate(108.367 123.312)" fill="#e0e0e0"/>
      <path id="Tracé_3277" data-name="Tracé 3277" d="M335.835,292.27l4.682,1.47H265.04l4.772-1.47Z" transform="translate(-156.673 -170.428)" fill="#ebebeb"/>
      <path id="Tracé_3278" data-name="Tracé 3278" d="M243.906,397.729c7.876-4.729,10.257-14.357,10.567-23.14.052-1.465.319-3-.286-4.326a2.986,2.986,0,0,0-3.522-1.794c-1.122.432-1.681,1.663-2.348,2.668a8.58,8.58,0,0,1-3.654,3.039,3.268,3.268,0,0,1-3.025.061c-1.212-.78-1.24-2.536-1.132-3.987q.31-4.062.615-8.13a13.488,13.488,0,0,0-.141-4.349,4.528,4.528,0,0,0-2.621-3.25,2.748,2.748,0,0,0-3.518,1.6,13.543,13.543,0,0,0-.164,1.808,1.53,1.53,0,0,1-1,1.376,1.771,1.771,0,0,1-1.55-.775,19.171,19.171,0,0,1-3.109-5.486,27.076,27.076,0,0,0-2.865-5.636,7.875,7.875,0,0,0-5.124-3.363,4.719,4.719,0,0,0-5.049,2.879c-.667,2.005.38,4.18,1.569,5.927a32.5,32.5,0,0,0,6.312,6.918,2.654,2.654,0,0,1,1.047,1.3c.249.991-.737,1.879-1.714,2.142a16.627,16.627,0,0,1-3.424.146,3.262,3.262,0,0,0-2.907,1.512c-.7,1.447.437,3.09,1.587,4.2a27.908,27.908,0,0,0,7.9,5.321,9.528,9.528,0,0,1,2.959,1.7,2.7,2.7,0,0,1,.648,3.147,2.754,2.754,0,0,1-3.062.939,18.756,18.756,0,0,1-3.1-1.442c-1.949-.892-4.537-.939-5.936.7a4.621,4.621,0,0,0-.775,4.034,10.581,10.581,0,0,0,1.958,3.757,28,28,0,0,0,11.361,9.224c4.523,1.926,8.792,2.658,13.517,1.292" transform="translate(-130.546 -197.869)" fill="#f5f5f5"/>
      <path id="Tracé_3279" data-name="Tracé 3279" d="M245.238,399.35c-.08-3.494.535-1.559-.47-6.068a130.259,130.259,0,0,0-4.2-14.39q-.662-1.879-1.3-3.72c-.427-1.216-.855-2.423-1.339-3.579a65.121,65.121,0,0,0-3.189-6.486c-1.113-2.015-2.24-3.884-3.288-5.636s-2.1-3.344-3.1-4.762a51.275,51.275,0,0,0-5.218-6.345c-.672-.7-1.212-1.221-1.583-1.573l-.423-.395a1.155,1.155,0,0,0-.15-.127.941.941,0,0,0,.132.146l.4.413c.357.366.883.9,1.545,1.611a54.408,54.408,0,0,1,5.138,6.378c.991,1.409,2.01,3.029,3.072,4.772s2.179,3.616,3.288,5.636a66.254,66.254,0,0,1,3.156,6.467c.47,1.151.9,2.348,1.329,3.569l1.3,3.715a134.35,134.35,0,0,1,4.227,14.353c1,4.495.4,2.541.5,6.021" transform="translate(-133.305 -199.067)" fill="#e0e0e0"/>
      <path id="Tracé_3280" data-name="Tracé 3280" d="M256.94,382.24a2.758,2.758,0,0,0,.188-.611c.1-.395.235-.972.385-1.691.31-1.437.662-3.428,1.047-5.636s.766-4.185,1.09-5.612c.164-.709.3-1.287.4-1.686a3.192,3.192,0,0,0,.127-.625,2.73,2.73,0,0,0-.225.6c-.131.39-.3.939-.47,1.672-.376,1.409-.789,3.4-1.169,5.608s-.709,4.138-.967,5.636c-.122.676-.225,1.249-.305,1.7A2.957,2.957,0,0,0,256.94,382.24Z" transform="translate(-152.377 -209.732)" fill="#e0e0e0"/>
      <path id="Tracé_3281" data-name="Tracé 3281" d="M217.64,389.993a3.821,3.821,0,0,0,.742.141c.47.075,1.165.183,2.015.343,1.7.3,4.034.8,6.575,1.47s4.833,1.376,6.467,1.935c.822.272,1.479.512,1.935.672a3.857,3.857,0,0,0,.714.23,3.96,3.96,0,0,0-.676-.329c-.446-.193-1.094-.47-1.911-.756-1.625-.606-3.9-1.343-6.462-2.015a67.16,67.16,0,0,0-6.617-1.409c-.859-.131-1.555-.211-2.038-.254a3.922,3.922,0,0,0-.742-.028Z" transform="translate(-131.534 -222.252)" fill="#e0e0e0"/>
      <path id="Tracé_3282" data-name="Tracé 3282" d="M271.22,419.364a.94.94,0,0,0,.146-.221l.366-.653c.315-.568.751-1.409,1.277-2.447,1.047-2.081,2.409-5,3.87-8.238s2.79-6.171,3.795-8.271l1.2-2.48.324-.676a.851.851,0,0,0,.094-.249,1.61,1.61,0,0,0-.141.221l-.366.653c-.319.573-.751,1.409-1.277,2.447-1.052,2.081-2.414,5-3.87,8.242s-2.79,6.167-3.795,8.266l-1.2,2.484-.319.676A1.006,1.006,0,0,0,271.22,419.364Z" transform="translate(-159.95 -225.51)" fill="#e0e0e0"/>
      <path id="Tracé_3283" data-name="Tracé 3283" d="M219.49,424.88a.94.94,0,0,0,.24.117l.7.3,2.583,1.052c2.2.888,5.218,2.142,8.552,3.536s6.368,2.621,8.585,3.461c1.108.418,2.005.751,2.63.967l.723.244a1.019,1.019,0,0,0,.258.066,1.034,1.034,0,0,0-.24-.117l-.7-.291-2.6-1.047c-2.193-.888-5.213-2.142-8.552-3.536s-6.364-2.621-8.581-3.461c-1.108-.418-2.005-.751-2.635-.963l-.723-.268A.94.94,0,0,0,219.49,424.88Z" transform="translate(-132.515 -240.758)" fill="#e0e0e0"/>
      <rect id="Rectangle_18941" data-name="Rectangle 18941" width="17.758" height="5.716" transform="translate(58.758 18.016)" fill="#f5f5f5"/>
      <rect id="Rectangle_18942" data-name="Rectangle 18942" width="17.758" height="5.716" transform="translate(75.412 29.447)" fill="#fafafa"/>
      <path id="Tracé_3284" data-name="Tracé 3284" d="M191.841,88.944a.551.551,0,0,1,0-.108V87.409c0-1-.023-2.414-.042-4.18l.08.08-17.377.042c.052-.056-.127.122.117-.122h0v5.716l-.122-.117,12.38.052,3.649.033h1.334a2.569,2.569,0,0,1-.319,0H190.6l-3.616.033-12.5.056h-.117V83.238h0c.244-.244.07-.07.127-.122l17.377.042h.08v.08c0,1.789-.033,3.222-.042,4.227v1.113C191.911,88.851,191.846,88.949,191.841,88.944Z" transform="translate(-108.586 -59.497)" fill="#e0e0e0"/>
      <rect id="Rectangle_18943" data-name="Rectangle 18943" width="17.758" height="5.716" transform="translate(186.532 66.808)" fill="#fafafa"/>
      <path id="Tracé_3285" data-name="Tracé 3285" d="M462.245,168.169a.551.551,0,0,1,0-.108v-1.428c0-1-.023-2.409-.042-4.18l.08.08-17.377.042c.052-.056-.127.122.117-.122h0v5.706l-.122-.117,12.413.052,3.645.038H462.3a2.622,2.622,0,0,1-.324,0h-.939l-3.616.033-12.549.108h-.117v-5.824h0c.244-.244.07-.07.127-.122l17.377.042h.08v.08c0,1.789-.033,3.222-.042,4.227v1.113A1.036,1.036,0,0,1,462.245,168.169Z" transform="translate(-251.981 -101.506)" fill="#e0e0e0"/>
      <rect id="Rectangle_18944" data-name="Rectangle 18944" width="17.758" height="5.716" transform="translate(179.059 131.174)" fill="#f5f5f5"/>
      <rect id="Rectangle_18945" data-name="Rectangle 18945" width="17.758" height="5.716" transform="translate(185.24 136.692)" fill="#fafafa"/>
      <path id="Tracé_3286" data-name="Tracé 3286" d="M422.823,341.337a.472.472,0,0,1,0-.1V339.8c0-1-.023-2.409-.042-4.18l.08.08-17.377.042c.052-.052-.127.122.117-.122h0v5.716l-.122-.117,12.413.056,3.645.033h1.339a3.069,3.069,0,0,1-.324,0h-.939l-3.616.033-12.5.056h-.117V335.57h0c.244-.244.07-.066.127-.122l17.377.042h.08v.08c0,1.789-.033,3.222-.042,4.227v1.118A.681.681,0,0,1,422.823,341.337Z" transform="translate(-231.102 -193.322)" fill="#e0e0e0"/>
      <rect id="Rectangle_18946" data-name="Rectangle 18946" width="17.758" height="5.716" transform="translate(0 53.733)" fill="#fafafa"/>
      <path id="Tracé_3287" data-name="Tracé 3287" d="M69.133,140.572v-1.54c0-.991-.028-2.409-.047-4.18l.08.08-17.377.042.122-.117h0v5.716l-.117-.122,12.413.056,3.644.033h.986a1.875,1.875,0,0,1,.348,0,2.484,2.484,0,0,1-.319,0h-.939l-3.616.033-12.493.056H51.7V134.8h0c.244-.249.066-.07.122-.127l17.377.042h.019v.08c0,1.789-.038,3.222-.047,4.227v1.113A1.978,1.978,0,0,1,69.133,140.572Z" transform="translate(-43.528 -86.839)" fill="#e0e0e0"/>
    </g>
    <g id="freepik--Floor--inject-24" transform="translate(-19348 -13780.384)">
      <path id="Tracé_3288" data-name="Tracé 3288" d="M235.138,460.141c0,.066-48.027.122-107.259.122s-107.268-.056-107.268-.122S68.627,460,127.874,460,235.138,460.075,235.138,460.141Z" transform="translate(-20.61 -460)" fill="#263238"/>
    </g>
    <g id="freepik--Box--inject-24" transform="translate(-19177.746 -13801.868)">
      <path id="Tracé_3289" data-name="Tracé 3289" d="M409.922,408.712l-.51,9.417a.639.639,0,0,1-.631.6l-16.945.126a.643.643,0,0,1-.643-.632l-.053-7.333a.639.639,0,0,1,.635-.639H402.2a.651.651,0,0,0,.449-.186l1.8-1.8a.631.631,0,0,1,.445-.186l4.393-.03a.631.631,0,0,1,.639.662Z" transform="translate(-388.09 -406.277)" fill="#e34168"/>
      <path id="Tracé_3290" data-name="Tracé 3290" d="M409.922,408.712l-.51,9.417a.639.639,0,0,1-.631.6l-16.945.126a.643.643,0,0,1-.643-.632l-.053-7.333a.639.639,0,0,1,.635-.639H402.2a.651.651,0,0,0,.449-.186l1.8-1.8a.631.631,0,0,1,.445-.186l4.393-.03a.631.631,0,0,1,.639.662Z" transform="translate(-388.09 -406.277)" opacity="0.3"/>
      <rect id="Rectangle_18947" data-name="Rectangle 18947" width="18.515" height="11.064" transform="translate(21.635 13.795) rotate(179.58)" fill="#f5f5f5"/>
      <path id="Tracé_3291" data-name="Tracé 3291" d="M409.175,412.406l-1.327,11.547a.418.418,0,0,1-.4.38l-18.044.129a.4.4,0,0,1-.411-.38L388,412.543a.4.4,0,0,1,.4-.441l20.368-.152a.411.411,0,0,1,.407.456Z" transform="translate(-386.141 -408.694)" fill="#e34168"/>
      <path id="Tracé_3292" data-name="Tracé 3292" d="M423.032,404.048l-.51,9.417a.639.639,0,0,1-.631.6l-16.945.122a.635.635,0,0,1-.643-.628l-.053-7.333a.635.635,0,0,1,.635-.639h10.422a.635.635,0,0,0,.449-.183l1.8-1.8a.631.631,0,0,1,.445-.186l4.393-.03a.635.635,0,0,1,.639.658Z" transform="translate(-396.213 -403.39)" fill="#e34168"/>
      <path id="Tracé_3293" data-name="Tracé 3293" d="M423.032,404.048l-.51,9.417a.639.639,0,0,1-.631.6l-16.945.122a.635.635,0,0,1-.643-.628l-.053-7.333a.635.635,0,0,1,.635-.639h10.422a.635.635,0,0,0,.449-.183l1.8-1.8a.631.631,0,0,1,.445-.186l4.393-.03a.635.635,0,0,1,.639.658Z" transform="translate(-396.213 -403.39)" opacity="0.3"/>
      <rect id="Rectangle_18948" data-name="Rectangle 18948" width="18.515" height="11.064" transform="translate(26.623 12.017) rotate(179.58)" fill="#f5f5f5"/>
      <path id="Tracé_3294" data-name="Tracé 3294" d="M422.279,407.755,420.948,419.3a.4.4,0,0,1-.4.38l-18.044.133a.407.407,0,0,1-.411-.38L401.1,407.9a.407.407,0,0,1,.407-.441l20.364-.152a.411.411,0,0,1,.411.445Z" transform="translate(-394.259 -405.819)" fill="#e34168"/>
      <path id="Tracé_3295" data-name="Tracé 3295" d="M422.279,407.755,420.948,419.3a.4.4,0,0,1-.4.38l-18.044.133a.407.407,0,0,1-.411-.38L401.1,407.9a.407.407,0,0,1,.407-.441l20.364-.152a.411.411,0,0,1,.411.445Z" transform="translate(-394.259 -405.819)" opacity="0.3"/>
      <path id="Tracé_3296" data-name="Tracé 3296" d="M437.789,409.842l-.51,9.414a.639.639,0,0,1-.631.6l-16.945.122a.639.639,0,0,1-.643-.631L419,412.021a.639.639,0,0,1,.635-.639h10.422a.616.616,0,0,0,.449-.186l1.8-1.8a.631.631,0,0,1,.445-.186l4.393-.034a.635.635,0,0,1,.647.662Z" transform="translate(-405.353 -406.978)" fill="#e34168"/>
      <rect id="Rectangle_18949" data-name="Rectangle 18949" width="18.515" height="11.064" transform="translate(32.236 14.223) rotate(179.58)" fill="#f5f5f5"/>
      <path id="Tracé_3297" data-name="Tracé 3297" d="M437.055,413.524l-1.327,11.547a.411.411,0,0,1-.4.361l-18.048.133a.4.4,0,0,1-.407-.38l-.993-11.532a.407.407,0,0,1,.4-.445l20.364-.148a.411.411,0,0,1,.411.464Z" transform="translate(-403.417 -409.382)" fill="#e34168"/>
      <path id="Tracé_3298" data-name="Tracé 3298" d="M415.87,418.41v16.017h23.11V418.41Zm7.542,2.887a1.183,1.183,0,0,1,1.183-1.183h5.66a1.183,1.183,0,1,1,0,2.362H424.6A1.183,1.183,0,0,1,423.412,421.3Z" transform="translate(-403.414 -412.697)" fill="#455a64"/>
      <path id="Tracé_3299" data-name="Tracé 3299" d="M383.12,418.41v16.017h12.456V418.41Z" transform="translate(-383.12 -412.697)" fill="#263238"/>
    </g>
    <g id="freepik--Box--inject-24-2" data-name="freepik--Box--inject-24" transform="translate(-19314.033 -13809.517)">
      <path id="Tracé_3289-2" data-name="Tracé 3289" d="M416.533,408.945l-.689,12.732a.864.864,0,0,1-.854.813l-22.909.17a.869.869,0,0,1-.869-.854l-.072-9.914a.864.864,0,0,1,.859-.864h14.09a.879.879,0,0,0,.607-.252l2.432-2.432a.854.854,0,0,1,.6-.252l5.939-.041a.854.854,0,0,1,.864.895Z" transform="translate(-387.016 -405.654)" fill="#e34168"/>
      <path id="Tracé_3290-2" data-name="Tracé 3290" d="M416.533,408.945l-.689,12.732a.864.864,0,0,1-.854.813l-22.909.17a.869.869,0,0,1-.869-.854l-.072-9.914a.864.864,0,0,1,.859-.864h14.09a.879.879,0,0,0,.607-.252l2.432-2.432a.854.854,0,0,1,.6-.252l5.939-.041a.854.854,0,0,1,.864.895Z" transform="translate(-387.016 -405.654)" opacity="0.3"/>
      <rect id="Rectangle_18947-2" data-name="Rectangle 18947" width="25.033" height="14.959" transform="translate(29.25 18.651) rotate(179.58)" fill="#f5f5f5"/>
      <path id="Tracé_3291-2" data-name="Tracé 3291" d="M416.63,412.567l-1.795,15.612a.566.566,0,0,1-.545.514l-24.395.175a.545.545,0,0,1-.555-.514L388,412.752a.545.545,0,0,1,.545-.6l27.537-.206a.555.555,0,0,1,.55.617Z" transform="translate(-385.488 -407.548)" fill="#e34168"/>
      <path id="Tracé_3292-2" data-name="Tracé 3292" d="M429.643,404.28l-.689,12.732a.864.864,0,0,1-.854.812l-22.909.165a.859.859,0,0,1-.869-.849l-.072-9.914a.859.859,0,0,1,.859-.864H419.2a.859.859,0,0,0,.607-.247l2.432-2.432a.853.853,0,0,1,.6-.252l5.939-.041a.859.859,0,0,1,.864.89Z" transform="translate(-393.384 -403.39)" fill="#e34168"/>
      <path id="Tracé_3293-2" data-name="Tracé 3293" d="M429.643,404.28l-.689,12.732a.864.864,0,0,1-.854.812l-22.909.165a.859.859,0,0,1-.869-.849l-.072-9.914a.859.859,0,0,1,.859-.864H419.2a.859.859,0,0,0,.607-.247l2.432-2.432a.853.853,0,0,1,.6-.252l5.939-.041a.859.859,0,0,1,.864.89Z" transform="translate(-393.384 -403.39)" opacity="0.3"/>
      <rect id="Rectangle_18948-2" data-name="Rectangle 18948" width="25.033" height="14.959" transform="translate(35.994 16.248) rotate(179.58)" fill="#f5f5f5"/>
      <path id="Tracé_3294-2" data-name="Tracé 3294" d="M429.736,407.912l-1.8,15.612a.545.545,0,0,1-.545.514l-24.4.18a.55.55,0,0,1-.555-.514L401.1,408.112a.55.55,0,0,1,.55-.6l27.532-.206a.555.555,0,0,1,.555.6Z" transform="translate(-391.852 -405.294)" fill="#e34168"/>
      <path id="Tracé_3295-2" data-name="Tracé 3295" d="M429.736,407.912l-1.8,15.612a.545.545,0,0,1-.545.514l-24.4.18a.55.55,0,0,1-.555-.514L401.1,408.112a.55.55,0,0,1,.55-.6l27.532-.206a.555.555,0,0,1,.555.6Z" transform="translate(-391.852 -405.294)" opacity="0.3"/>
      <path id="Tracé_3296-2" data-name="Tracé 3296" d="M444.4,410.075l-.689,12.727a.864.864,0,0,1-.854.818l-22.909.165a.864.864,0,0,1-.869-.854L419,413.021a.864.864,0,0,1,.859-.864h14.09a.833.833,0,0,0,.607-.252l2.432-2.427a.854.854,0,0,1,.6-.252l5.939-.046a.859.859,0,0,1,.874.895Z" transform="translate(-400.549 -406.202)" fill="#e34168"/>
      <rect id="Rectangle_18949-2" data-name="Rectangle 18949" width="25.033" height="14.959" transform="translate(43.583 19.229) rotate(179.58)" fill="#f5f5f5"/>
      <path id="Tracé_3297-2" data-name="Tracé 3297" d="M444.51,413.687,442.715,429.3a.555.555,0,0,1-.545.489l-24.4.18a.545.545,0,0,1-.55-.514l-1.342-15.591a.55.55,0,0,1,.545-.6l27.532-.2a.555.555,0,0,1,.555.627Z" transform="translate(-399.032 -408.087)" fill="#e34168"/>
      <path id="Tracé_3298-2" data-name="Tracé 3298" d="M415.87,418.41v21.654h31.245V418.41Zm10.2,3.9a1.6,1.6,0,0,1,1.6-1.6h7.652a1.6,1.6,0,1,1,0,3.193h-7.652A1.6,1.6,0,0,1,426.067,422.313Z" transform="translate(-399.029 -410.686)" fill="#455a64"/>
      <path id="Tracé_3299-2" data-name="Tracé 3299" d="M383.12,418.41v21.654h16.841V418.41Z" transform="translate(-383.12 -410.686)" fill="#263238"/>
    </g>
    <g id="freepik--Plant--inject-24" transform="translate(-19289.813 -13970.06)">
      <path id="Tracé_3373" data-name="Tracé 3373" d="M113.231,91.19a7.821,7.821,0,0,1,5.446,2.833,13.792,13.792,0,0,1,2.72,5.61c1.028,3.924.334,8.546-.818,12.434-4.232-1.543-6.808-6.1-7.971-8.485-1.836-3.78-2.864-11.714.648-12.393" transform="translate(-106.38 -91.19)" fill="#e34168"/>
      <path id="Tracé_3374" data-name="Tracé 3374" d="M140.467,130.566a6.685,6.685,0,0,1-.257-6.685,8.855,8.855,0,0,1,5.369-4.242,3.724,3.724,0,0,1,3.137.18,2.869,2.869,0,0,1,1.075,2.679,5.785,5.785,0,0,1-1.244,2.731c-2.088,2.777-4.628,5.081-8.079,5.338" transform="translate(-120.231 -104.885)" fill="#e34168"/>
      <g id="Groupe_14003" data-name="Groupe 14003" transform="translate(19.207 14.498)" opacity="0.3">
        <path id="Tracé_3375" data-name="Tracé 3375" d="M140.467,130.566a6.685,6.685,0,0,1-.257-6.685,8.855,8.855,0,0,1,5.369-4.242,3.724,3.724,0,0,1,3.137.18,2.869,2.869,0,0,1,1.075,2.679,5.785,5.785,0,0,1-1.244,2.731c-2.088,2.777-4.628,5.081-8.079,5.338" transform="translate(-139.437 -119.383)" fill="#fff"/>
      </g>
      <path id="Tracé_3376" data-name="Tracé 3376" d="M117.809,142.348a15.592,15.592,0,0,0-12.249-7.266c-1.26-.062-2.761.18-3.3,1.316s.237,2.458,1.111,3.368a13.324,13.324,0,0,0,14.486,2.916" transform="translate(-102.087 -112.507)" fill="#e34168"/>
      <g id="Groupe_14004" data-name="Groupe 14004" transform="translate(0 22.566)" opacity="0.3">
        <path id="Tracé_3377" data-name="Tracé 3377" d="M117.809,142.348a15.592,15.592,0,0,0-12.249-7.266c-1.26-.062-2.761.18-3.3,1.316s.237,2.458,1.111,3.368a13.324,13.324,0,0,0,14.486,2.916" transform="translate(-102.087 -135.073)" fill="#fff"/>
      </g>
      <path id="Tracé_3378" data-name="Tracé 3378" d="M140.693,148.5a4.627,4.627,0,0,1-.175-.833c-.093-.54-.221-1.322-.35-2.288a29.482,29.482,0,0,1-.17-7.636,14.45,14.45,0,0,1,2.828-7.055,9.581,9.581,0,0,1,1.64-1.646,6.224,6.224,0,0,1,.514-.37.756.756,0,0,1,.2-.108,14.4,14.4,0,0,0-2.2,2.237,14.964,14.964,0,0,0-2.715,6.978,32.319,32.319,0,0,0,.1,7.58c.108.931.2,1.707.262,2.293A5.972,5.972,0,0,1,140.693,148.5Z" transform="translate(-120.42 -109.343)" fill="#263238"/>
      <path id="Tracé_3379" data-name="Tracé 3379" d="M118,102.81a2.574,2.574,0,0,1,.165.324c.108.242.252.555.427.951.365.823.879,2.026,1.507,3.517,1.25,2.977,2.921,7.117,4.664,11.73s3.229,8.824,4.263,11.889c.514,1.543.926,2.772,1.2,3.63.123.411.226.746.3,1a1.544,1.544,0,0,1,.093.35,1.8,1.8,0,0,1-.144-.334c-.087-.247-.206-.571-.355-.977-.309-.879-.746-2.1-1.275-3.6-1.08-3.044-2.571-7.245-4.33-11.853s-3.389-8.742-4.592-11.755l-1.43-3.548c-.154-.4-.283-.725-.381-.972A1.639,1.639,0,0,1,118,102.81Z" transform="translate(-109.817 -96.835)" fill="#263238"/>
      <path id="Tracé_3380" data-name="Tracé 3380" d="M112.74,141.409a5.322,5.322,0,0,1,.812.046,7.331,7.331,0,0,1,.941.134,11.243,11.243,0,0,1,1.239.273l.71.2c.247.072.514.175.756.262a17.321,17.321,0,0,1,1.62.689,17.69,17.69,0,0,1,6.227,5.055c.365.514.725.972,1.028,1.45.144.237.293.458.411.684l.339.658a11.55,11.55,0,0,1,.514,1.152,7.2,7.2,0,0,1,.319.9,5.2,5.2,0,0,1,.216.787c-.062,0-.36-1.106-1.224-2.751-.113-.206-.226-.422-.35-.643s-.273-.432-.422-.663a17.009,17.009,0,0,0-1.028-1.419,18.353,18.353,0,0,0-6.14-4.988c-.555-.257-1.075-.514-1.594-.7-.252-.093-.514-.2-.735-.278l-.7-.211C113.9,141.532,112.73,141.471,112.74,141.409Z" transform="translate(-107.262 -115.584)" fill="#263238"/>
      <path id="Tracé_3381" data-name="Tracé 3381" d="M125.85,159.94h15.237v8.917a6.32,6.32,0,0,1-6.32,6.32h-2.6a6.32,6.32,0,0,1-6.32-6.32Z" transform="translate(-113.63 -124.587)" fill="#e34168"/>
      <path id="Tracé_3382" data-name="Tracé 3382" d="M125.85,159.94h15.237v8.917a6.32,6.32,0,0,1-6.32,6.32h-2.6a6.32,6.32,0,0,1-6.32-6.32Z" transform="translate(-113.63 -124.587)" opacity="0.3"/>
      <path id="Tracé_3383" data-name="Tracé 3383" d="M136.31,160a1.5,1.5,0,0,1-.175.453,7.787,7.787,0,0,1-.679,1.131,9.087,9.087,0,0,1-7.487,3.821,7.712,7.712,0,0,1-1.311-.113,1.5,1.5,0,0,1-.468-.123c0-.046.679.087,1.774.051a9.632,9.632,0,0,0,7.343-3.749C135.976,160.617,136.264,160,136.31,160Z" transform="translate(-113.796 -124.616)" fill="#fafafa"/>
      <path id="Tracé_3384" data-name="Tracé 3384" d="M150.5,170.338a1.542,1.542,0,0,1-.514-.1,6.052,6.052,0,0,1-1.255-.566,6.474,6.474,0,0,1-2.751-7.955,6.263,6.263,0,0,1,.638-1.219,1.743,1.743,0,0,1,.324-.386,13.376,13.376,0,0,0-.782,1.671,6.536,6.536,0,0,0,2.674,7.713,13.511,13.511,0,0,0,1.666.843Z" transform="translate(-123.193 -124.669)" fill="#fafafa"/>
      <path id="Tracé_3385" data-name="Tracé 3385" d="M137,181.514a9.354,9.354,0,0,0-.319-2.252,6.947,6.947,0,0,0-1.136-2.165,7.873,7.873,0,0,0-2.252-1.959,8.608,8.608,0,0,0-5.286-1.028,18.649,18.649,0,0,0-2.237.514,2.768,2.768,0,0,1,.566-.257,8.078,8.078,0,0,1,1.646-.417,8.4,8.4,0,0,1,5.446.972,7.811,7.811,0,0,1,2.314,2.057,6.8,6.8,0,0,1,1.121,2.263,5.835,5.835,0,0,1,.211,1.687A2.4,2.4,0,0,1,137,181.514Z" transform="translate(-113.591 -131.341)" fill="#fafafa"/>
    </g>
    <g id="freepik--filing-cabinet--inject-24" transform="translate(-19291.375 -13919.47)">
      <rect id="Rectangle_18950" data-name="Rectangle 18950" width="47.962" height="139.217" transform="translate(0 0)" fill="#263238"/>
      <rect id="Rectangle_18951" data-name="Rectangle 18951" width="52.513" height="139.217" transform="translate(21.197 0)" fill="#455a64"/>
      <rect id="Rectangle_18952" data-name="Rectangle 18952" width="46.8" height="28.74" transform="translate(24.565 39.513)" fill="#455a64"/>
      <path id="Tracé_3386" data-name="Tracé 3386" d="M137,398.39h16.029v.725a1.106,1.106,0,0,1-1.116,1.131h-13.8a1.106,1.106,0,0,1-1.106-1.106v-.725Z" transform="translate(-96.664 -291.009)" fill="#263238"/>
      <path id="Tracé_3387" data-name="Tracé 3387" d="M152.741,398.322v7.749c0,5,.036,12.2.057,21.006v.1h-.1l-46.795.031h-.159V398.25h.123l33.764.031h9.606l-9.668.041-33.682.087.123-.123v28.7l-.134-.134h0l46.795.026-.108.108c0-8.783.046-15.941.057-20.939,0-2.494,0-4.438.026-5.77v-1.512A1.955,1.955,0,0,0,152.741,398.322Z" transform="translate(-81.479 -290.941)" fill="#263238"/>
      <rect id="Rectangle_18953" data-name="Rectangle 18953" width="13.936" height="3.764" transform="translate(41.807 114.401)" fill="#e0e0e0"/>
      <rect id="Rectangle_18954" data-name="Rectangle 18954" width="46.8" height="28.74" transform="translate(24.565 71.504)" fill="#455a64"/>
      <path id="Tracé_3388" data-name="Tracé 3388" d="M136.865,335.87h16.029v.725a1.106,1.106,0,0,1-1.106,1.106H137.956a1.106,1.106,0,0,1-1.106-1.106v-.725Z" transform="translate(-96.591 -260.638)" fill="#263238"/>
      <path id="Tracé_3389" data-name="Tracé 3389" d="M153.644,335.778v2.005c0,1.327,0,3.26.026,5.744,0,5,.036,12.2.057,21.006v.1h-.082l-46.795.005h-.159V335.68h.123l33.764.031,9.637.026h-.041l-9.668.041-33.682.093.123-.129v28.7l-.134-.134h0l46.795.026-.108.108c.026-8.783.046-15.941.057-20.939v-7.281A1.563,1.563,0,0,0,153.644,335.778Z" transform="translate(-81.94 -260.546)" fill="#263238"/>
      <rect id="Rectangle_18955" data-name="Rectangle 18955" width="13.936" height="3.764" transform="translate(41.324 82.03)" fill="#e0e0e0"/>
      <path id="Tracé_3390" data-name="Tracé 3390" d="M137.21,197h16.029v.725a1.106,1.106,0,0,1-1.106,1.106H138.316a1.106,1.106,0,0,1-1.106-1.106Z" transform="translate(-96.766 -193.179)" fill="#263238"/>
      <path id="Tracé_3391" data-name="Tracé 3391" d="M152.97,196.932v2.011c0,1.322,0,3.26.026,5.744,0,5,.031,12.192.057,21v.1h-.108l-46.795.026H106V196.86h.123l33.759.031H149.5l-9.662.041-33.682.093.123-.123v28.7l-.134-.134h0l46.795.031-.1.1c0-8.783.041-15.941.057-20.939,0-2.489,0-4.433.026-5.765v-1.512A1.193,1.193,0,0,1,152.97,196.932Z" transform="translate(-81.605 -193.111)" fill="#263238"/>
      <rect id="Rectangle_18956" data-name="Rectangle 18956" width="13.936" height="3.764" transform="translate(41.241 9.919)" fill="#e0e0e0"/>
      <path id="Tracé_3392" data-name="Tracé 3392" d="M106.62,272.735v-10.8a1.687,1.687,0,0,1,1.687-1.687h28.766a1.661,1.661,0,0,1,1.661,1.661v10.8Z" transform="translate(-81.906 -223.904)" fill="#e34168"/>
      <path id="Tracé_3393" data-name="Tracé 3393" d="M106.62,272.735v-10.8a1.687,1.687,0,0,1,1.687-1.687h28.766a1.661,1.661,0,0,1,1.661,1.661v10.8Z" transform="translate(-81.906 -223.904)" opacity="0.3"/>
      <path id="Tracé_3394" data-name="Tracé 3394" d="M112.34,275.4V265.9a.175.175,0,0,1,.165-.175h29.008V275.4Z" transform="translate(-84.685 -226.566)" fill="#fafafa"/>
      <path id="Tracé_3395" data-name="Tracé 3395" d="M151.507,260.145l-.828,11.488H119.46l.833-10.66a1.8,1.8,0,0,1,1.64-1.8l15.185.082h0a1.178,1.178,0,0,1,1.028-1.27h11.724A1.886,1.886,0,0,1,151.507,260.145Z" transform="translate(-88.143 -222.802)" fill="#e34168"/>
      <path id="Tracé_3396" data-name="Tracé 3396" d="M131.48,270.565v-10.8a1.687,1.687,0,0,1,1.692-1.687h28.766a1.661,1.661,0,0,1,1.661,1.661v10.83Z" transform="translate(-93.982 -222.85)" fill="#e34168"/>
      <path id="Tracé_3397" data-name="Tracé 3397" d="M131.48,270.565v-10.8a1.687,1.687,0,0,1,1.692-1.687h28.766a1.661,1.661,0,0,1,1.661,1.661v10.83Z" transform="translate(-93.982 -222.85)" opacity="0.3"/>
      <path id="Tracé_3398" data-name="Tracé 3398" d="M137.21,273.227v-9.5a.165.165,0,0,1,.165-.17h29.008v9.668Z" transform="translate(-96.766 -225.512)" fill="#fafafa"/>
      <path id="Tracé_3399" data-name="Tracé 3399" d="M176.372,257.96l-.848,11.5h-31.2l.864-10.665a1.8,1.8,0,0,1,1.64-1.8l15.185.077h0a1.178,1.178,0,0,1,1.028-1.27h11.709A1.878,1.878,0,0,1,176.372,257.96Z" transform="translate(-100.22 -221.743)" fill="#e34168"/>
      <path id="Tracé_3400" data-name="Tracé 3400" d="M166.08,271.771v-10.8a1.687,1.687,0,0,1,1.687-1.692h28.766a1.661,1.661,0,0,1,1.661,1.666v10.825Z" transform="translate(-110.79 -223.433)" fill="#e34168"/>
      <path id="Tracé_3401" data-name="Tracé 3401" d="M166.08,271.771v-10.8a1.687,1.687,0,0,1,1.687-1.692h28.766a1.661,1.661,0,0,1,1.661,1.666v10.825Z" transform="translate(-110.79 -223.433)" opacity="0.3"/>
      <path id="Tracé_3402" data-name="Tracé 3402" d="M171.81,274.438v-9.493a.17.17,0,0,1,.159-.175h29.008v9.668Z" transform="translate(-113.573 -226.1)" fill="#fafafa"/>
      <rect id="Rectangle_18957" data-name="Rectangle 18957" width="29.424" height="17.247" transform="translate(59.697 36.197)" fill="#e0e0e0"/>
      <rect id="Rectangle_18958" data-name="Rectangle 18958" width="29.651" height="18.389" transform="translate(61.893 28.54)" fill="#f5f5f5"/>
      <path id="Tracé_3403" data-name="Tracé 3403" d="M189.3,265.163c-.077,0-.134-3.178-.134-7.1s.057-7.1.134-7.1.134,3.178.134,7.1S189.376,265.163,189.3,265.163Z" transform="translate(-122.006 -219.396)" fill="#263238"/>
      <path id="Tracé_3404" data-name="Tracé 3404" d="M193.394,265.163c-.072,0-.134-3.178-.134-7.1s.062-7.1.134-7.1.134,3.178.134,7.1S193.471,265.163,193.394,265.163Z" transform="translate(-123.993 -219.396)" fill="#263238"/>
      <path id="Tracé_3405" data-name="Tracé 3405" d="M197.874,265.163c-.077,0-.134-3.178-.134-7.1s.057-7.1.134-7.1.134,3.178.134,7.1S197.941,265.163,197.874,265.163Z" transform="translate(-126.169 -219.396)" fill="#263238"/>
      <path id="Tracé_3406" data-name="Tracé 3406" d="M202.324,265.163c-.072,0-.134-3.178-.134-7.1s.062-7.1.134-7.1.134,3.178.134,7.1S202.4,265.163,202.324,265.163Z" transform="translate(-128.331 -219.396)" fill="#263238"/>
      <path id="Tracé_3407" data-name="Tracé 3407" d="M206.784,265.163c-.072,0-.134-3.178-.134-7.1s.062-7.1.134-7.1.134,3.178.134,7.1S206.861,265.163,206.784,265.163Z" transform="translate(-130.498 -219.396)" fill="#263238"/>
      <path id="Tracé_3408" data-name="Tracé 3408" d="M211.254,265.163c-.077,0-.134-3.178-.134-7.1s.057-7.1.134-7.1.134,3.178.134,7.1S211.326,265.163,211.254,265.163Z" transform="translate(-132.669 -219.396)" fill="#263238"/>
      <path id="Tracé_3409" data-name="Tracé 3409" d="M215.714,265.163c-.072,0-.134-3.178-.134-7.1s.062-7.1.134-7.1.134,3.178.134,7.1S215.8,265.163,215.714,265.163Z" transform="translate(-134.836 -219.396)" fill="#263238"/>
      <path id="Tracé_3410" data-name="Tracé 3410" d="M220.174,265.163c-.072,0-.134-3.178-.134-7.1s.062-7.1.134-7.1.134,3.178.134,7.1S220.251,265.163,220.174,265.163Z" transform="translate(-137.002 -219.396)" fill="#263238"/>
      <path id="Tracé_3411" data-name="Tracé 3411" d="M224.639,265.163c-.077,0-.139-3.178-.139-7.1s.062-7.1.139-7.1.134,3.178.134,7.1S224.711,265.163,224.639,265.163Z" transform="translate(-139.169 -219.396)" fill="#263238"/>
      <path id="Tracé_3412" data-name="Tracé 3412" d="M229.1,265.163c-.077,0-.134-3.178-.134-7.1s.057-7.1.134-7.1.134,3.178.134,7.1S229.176,265.163,229.1,265.163Z" transform="translate(-141.34 -219.396)" fill="#263238"/>
      <path id="Tracé_3413" data-name="Tracé 3413" d="M210.967,263.509l-.823,9.457H178.92l.838-8.778a1.64,1.64,0,0,1,1.635-1.486l15.19.067h0a1.028,1.028,0,0,1,1.028-1.028h11.709a1.635,1.635,0,0,1,1.646,1.769Z" transform="translate(-117.027 -224.628)" fill="#e34168"/>
      <rect id="Rectangle_18959" data-name="Rectangle 18959" width="46.8" height="28.74" transform="translate(24.446 43.082)" fill="#263238"/>
      <rect id="Rectangle_18960" data-name="Rectangle 18960" width="46.8" height="28.74" transform="translate(52.765 43.082)" fill="#455a64"/>
      <path id="Tracé_3414" data-name="Tracé 3414" d="M207.883,301.928v-7.734c0-4.947-.036-12.064-.057-20.785l.1.108-46.795.026h0l.134-.134v28.524l-.123-.123,33.661.062,9.662.031h.026l-9.637.036-33.744.057h-.123V273.27h.139l46.795.031h.108v.1c0,8.742-.046,15.885-.057,20.847,0,2.463,0,4.386-.026,5.7v1.481A4.729,4.729,0,0,0,207.883,301.928Z" transform="translate(-108.317 -230.229)" fill="#263238"/>
      <path id="Tracé_3415" data-name="Tracé 3415" d="M193.92,273.35h16.029v.633a1.106,1.106,0,0,1-1.106,1.106H195.026a1.106,1.106,0,0,1-1.106-1.106v-.633Z" transform="translate(-124.314 -230.268)" fill="#263238"/>
      <rect id="Rectangle_18961" data-name="Rectangle 18961" width="13.936" height="3.764" transform="translate(70.953 49.525)" fill="#e0e0e0"/>
      <path id="Tracé_3416" data-name="Tracé 3416" d="M221.776,238.345a28.549,28.549,0,0,0-.776,5.477c0,.237,0,.514.206.643s.514-.226.684-.437c.329-.375,1.543-2.479,1.543-2.479a3.492,3.492,0,0,0,3.173-3.389" transform="translate(-137.468 -213.174)" fill="#ffbe9d"/>
      <path id="Tracé_3417" data-name="Tracé 3417" d="M226.428,238.16a1.363,1.363,0,0,1,0,.381,3.347,3.347,0,0,1-.262,1.028,3.512,3.512,0,0,1-.987,1.3,3.826,3.826,0,0,1-1.918.8l.093-.062c-.386.668-.812,1.4-1.3,2.139-.077.108-.144.216-.237.329s-.159.2-.257.3a.725.725,0,0,1-.386.242.417.417,0,0,1-.427-.257,1.615,1.615,0,0,1-.062-.782c0-.237.031-.468.051-.694a23.674,23.674,0,0,1,.324-2.4c.123-.674.252-1.214.355-1.584a2.36,2.36,0,0,1,.185-.566,2.448,2.448,0,0,1-.087.586c-.067.381-.17.92-.267,1.6s-.2,1.481-.262,2.376l-.046.694a1.46,1.46,0,0,0,.046.648c.036.082.108.129.149.118a.6.6,0,0,0,.237-.17l.242-.288a3.521,3.521,0,0,0,.216-.3c.478-.73.91-1.46,1.306-2.119l.031-.057h.062a3.651,3.651,0,0,0,1.815-.72,3.363,3.363,0,0,0,.977-1.2A5.8,5.8,0,0,0,226.428,238.16Z" transform="translate(-137.307 -213.174)" fill="#eb996e"/>
    </g>
  </g>
</svg>
