<svg xmlns="http://www.w3.org/2000/svg" width="336.605" height="251.358" viewBox="0 0 336.605 251.358">
  <g id="Référentiel_Qualité" data-name="Référentiel Qualité" transform="translate(18593 21974)">
    <g id="freepik--background-complete--inject-124" transform="translate(-18576.371 -21974)">
      <rect id="Rectangle_19067" data-name="Rectangle 19067" width="63.764" height="41.925" transform="translate(6.554 48.19)" fill="#e0e0e0"/>
      <rect id="Rectangle_19068" data-name="Rectangle 19068" width="59.297" height="38.337" transform="translate(8.771 49.908)" fill="#fafafa"/>
      <rect id="Rectangle_19069" data-name="Rectangle 19069" width="19.344" height="10.551" transform="translate(28.75 63.877)" fill="#e0e0e0"/>
      <path id="Tracé_3838" data-name="Tracé 3838" d="M563.638,295.44l-1.208,93.285h53.916V296.71Z" transform="translate(-304.494 -139.531)" fill="#f5f5f5"/>
      <path id="Tracé_3839" data-name="Tracé 3839" d="M615.426,296.68l-.476,92.582h24.14V297.247Z" transform="translate(-327.238 -140.068)" fill="#e0e0e0"/>
      <path id="Tracé_3840" data-name="Tracé 3840" d="M567.55,298.4v19.083h25.541V299.3Z" transform="translate(-306.711 -140.813)" fill="#e0e0e0"/>
      <path id="Tracé_3841" data-name="Tracé 3841" d="M583.08,307.465v2.818h7.812V307.21Z" transform="translate(-313.436 -144.628)" fill="#f5f5f5"/>
      <rect id="Rectangle_19070" data-name="Rectangle 19070" width="8.068" height="1.151" transform="translate(269.644 168.025)" fill="#f5f5f5"/>
      <path id="Tracé_3842" data-name="Tracé 3842" d="M567.55,416.33v19.078h25.541V417.231Z" transform="translate(-306.711 -191.883)" fill="#e0e0e0"/>
      <path id="Tracé_3843" data-name="Tracé 3843" d="M583.08,425.4v2.818h7.812V425.14Z" transform="translate(-313.436 -195.698)" fill="#f5f5f5"/>
      <rect id="Rectangle_19071" data-name="Rectangle 19071" width="8.068" height="1.151" transform="translate(269.644 234.884)" fill="#f5f5f5"/>
      <path id="Tracé_3844" data-name="Tracé 3844" d="M567.55,336.34v19.078h25.541V337.241Z" transform="translate(-306.711 -157.243)" fill="#e0e0e0"/>
      <path id="Tracé_3845" data-name="Tracé 3845" d="M583.08,345.4v2.818h7.812V345.14Z" transform="translate(-313.436 -161.054)" fill="#f5f5f5"/>
      <rect id="Rectangle_19072" data-name="Rectangle 19072" width="8.068" height="1.151" transform="translate(269.644 189.535)" fill="#f5f5f5"/>
      <rect id="Rectangle_19073" data-name="Rectangle 19073" width="25.541" height="19.078" transform="translate(260.505 201.939)" fill="#e0e0e0"/>
      <path id="Tracé_3846" data-name="Tracé 3846" d="M582.8,391.618v2.648h7.342V391.38Z" transform="translate(-313.315 -181.078)" fill="#f5f5f5"/>
      <rect id="Rectangle_19074" data-name="Rectangle 19074" width="7.586" height="1.083" transform="translate(269.485 215.416)" fill="#f5f5f5"/>
      <path id="Tracé_3847" data-name="Tracé 3847" d="M160.179,221.82l1.208,136.117H107.47V223.674Z" transform="translate(-107.47 -107.649)" fill="#f5f5f5"/>
      <path id="Tracé_3848" data-name="Tracé 3848" d="M131.134,223.63l.476,135.091H107.47V224.458Z" transform="translate(-107.47 -108.433)" fill="#e0e0e0"/>
      <path id="Tracé_3849" data-name="Tracé 3849" d="M177.945,224.78v19.083H152.41V225.681Z" transform="translate(-126.932 -108.931)" fill="#e0e0e0"/>
      <path id="Tracé_3850" data-name="Tracé 3850" d="M175.952,233.845v2.818H168.14V233.59Z" transform="translate(-133.744 -112.746)" fill="#f5f5f5"/>
      <rect id="Rectangle_19075" data-name="Rectangle 19075" width="8.068" height="1.151" transform="translate(34.141 126.286)" fill="#f5f5f5"/>
      <path id="Tracé_3851" data-name="Tracé 3851" d="M177.945,342.71v19.078H152.41V343.611Z" transform="translate(-126.932 -160.001)" fill="#e0e0e0"/>
      <path id="Tracé_3852" data-name="Tracé 3852" d="M175.952,351.775v2.818H168.14V351.52Z" transform="translate(-133.744 -163.817)" fill="#f5f5f5"/>
      <rect id="Rectangle_19076" data-name="Rectangle 19076" width="8.068" height="1.151" transform="translate(34.141 193.146)" fill="#f5f5f5"/>
      <path id="Tracé_3853" data-name="Tracé 3853" d="M177.945,262.72V281.8H152.41V263.621Z" transform="translate(-126.932 -125.361)" fill="#e0e0e0"/>
      <path id="Tracé_3854" data-name="Tracé 3854" d="M175.952,271.785V274.6H168.14V271.53Z" transform="translate(-133.744 -129.176)" fill="#f5f5f5"/>
      <rect id="Rectangle_19077" data-name="Rectangle 19077" width="8.068" height="1.151" transform="translate(34.141 147.796)" fill="#f5f5f5"/>
      <path id="Tracé_3855" data-name="Tracé 3855" d="M177.945,380.64v19.078H152.41V381.541Z" transform="translate(-126.932 -176.427)" fill="#e0e0e0"/>
      <path id="Tracé_3856" data-name="Tracé 3856" d="M175.952,389.705v2.818H168.14V389.45Z" transform="translate(-133.744 -180.242)" fill="#f5f5f5"/>
      <rect id="Rectangle_19078" data-name="Rectangle 19078" width="8.068" height="1.151" transform="translate(34.141 214.65)" fill="#f5f5f5"/>
      <path id="Tracé_3857" data-name="Tracé 3857" d="M178.431,418.57v19.078H152.89V419.471Z" transform="translate(-127.139 -192.853)" fill="#e0e0e0"/>
      <path id="Tracé_3858" data-name="Tracé 3858" d="M176.442,427.635v2.818H168.63V427.38Z" transform="translate(-133.956 -196.668)" fill="#f5f5f5"/>
      <rect id="Rectangle_19079" data-name="Rectangle 19079" width="8.068" height="1.151" transform="translate(34.419 236.154)" fill="#f5f5f5"/>
      <rect id="Rectangle_19080" data-name="Rectangle 19080" width="25.541" height="19.078" transform="translate(25.807 160.201)" fill="#e0e0e0"/>
      <path id="Tracé_3859" data-name="Tracé 3859" d="M176.6,318v2.648H169.25V317.76Z" transform="translate(-134.224 -149.197)" fill="#f5f5f5"/>
      <rect id="Rectangle_19081" data-name="Rectangle 19081" width="7.586" height="1.083" transform="translate(34.788 173.677)" fill="#f5f5f5"/>
      <path id="Tracé_3860" data-name="Tracé 3860" d="M295.07,395.49v16.628h51.144V395.49Z" transform="translate(-188.712 -182.858)" fill="#f5f5f5"/>
      <path id="Tracé_3861" data-name="Tracé 3861" d="M291.28,387.29v4.649h55.078V387.29H291.28Z" transform="translate(-187.07 -179.307)" fill="#e0e0e0"/>
      <path id="Tracé_3862" data-name="Tracé 3862" d="M339.037,408.567h25.751V391.939h1.786V387.29H337.96v4.218Z" transform="translate(-207.285 -179.307)" fill="#e0e0e0"/>
      <rect id="Rectangle_19082" data-name="Rectangle 19082" width="10.369" height="2.506" transform="translate(113.508 215.314)" fill="#e0e0e0"/>
      <rect id="Rectangle_19083" data-name="Rectangle 19083" width="13.317" height="5.284" transform="translate(112.175 220.949)" fill="#fff"/>
      <path id="Tracé_3863" data-name="Tracé 3863" d="M285.67,433.33v16.634h51.144V433.33Z" transform="translate(-184.641 -199.245)" fill="#f5f5f5"/>
      <path id="Tracé_3864" data-name="Tracé 3864" d="M281.88,425.13v4.649h55.078V425.13H281.88Z" transform="translate(-183 -195.694)" fill="#e0e0e0"/>
      <path id="Tracé_3865" data-name="Tracé 3865" d="M329.637,446.413h25.751V429.779h1.786V425.13H328.56v4.218Z" transform="translate(-203.215 -195.694)" fill="#e0e0e0"/>
      <rect id="Rectangle_19084" data-name="Rectangle 19084" width="10.369" height="2.506" transform="translate(108.178 236.767)" fill="#e0e0e0"/>
      <rect id="Rectangle_19085" data-name="Rectangle 19085" width="13.317" height="5.284" transform="translate(106.846 242.402)" fill="#fff"/>
      <path id="Tracé_3866" data-name="Tracé 3866" d="M483.43,61.327c.142-.136,1.1.567,2.364,1.967a23.1,23.1,0,0,1,2,2.659,27.775,27.775,0,0,1,1.922,3.606,27.357,27.357,0,0,1,1.315,3.867,22.332,22.332,0,0,1,.567,3.283c.176,1.888,0,3.061-.176,3.067-.454.034-.862-4.536-3.1-9.638S483.1,61.633,483.43,61.327Z" transform="translate(-270.271 -38.139)" fill="#ebebeb"/>
      <path id="Tracé_3867" data-name="Tracé 3867" d="M498.328,65.875c-.193,0-.737-2.478-1.242-6.577s-.93-9.8-1.094-16.09-.1-11.985,0-16.107.323-6.662.527-6.662.4,2.546.567,6.662.249,9.8.42,16.067.414,11.906.646,16.033S498.55,65.846,498.328,65.875Z" transform="translate(-275.679 -20.44)" fill="#ebebeb"/>
      <path id="Tracé_3868" data-name="Tracé 3868" d="M509.213,37.487c.193.113-.567,1.865-1.633,4.785s-2.364,7-3.645,11.554-2.268,8.742-2.835,11.781-.839,4.944-1.066,4.938-.346-1.967,0-5.1a79.371,79.371,0,0,1,2.432-12.025,79.513,79.513,0,0,1,4.116-11.554C507.9,38.995,509.049,37.39,509.213,37.487Z" transform="translate(-277.379 -27.82)" fill="#ebebeb"/>
      <path id="Tracé_3869" data-name="Tracé 3869" d="M479.35,91.35v5.012a10.687,10.687,0,0,0,10.693,10.664h0a10.687,10.687,0,0,0,10.687-10.687V91.35Z" transform="translate(-268.515 -51.148)" fill="#e0e0e0"/>
      <path id="Tracé_3870" data-name="Tracé 3870" d="M500.944,98.713c0,.079-4.825.147-10.772.147s-10.772-.068-10.772-.147,4.83-.153,10.772-.153S500.944,98.628,500.944,98.713Z" transform="translate(-268.537 -54.27)" fill="#fafafa"/>
      <path id="Tracé_3871" data-name="Tracé 3871" d="M500.944,101.163c0,.085-4.825.153-10.772.153s-10.772-.068-10.772-.153,4.83-.153,10.772-.153S500.944,101.078,500.944,101.163Z" transform="translate(-268.537 -55.331)" fill="#fafafa"/>
      <rect id="Rectangle_19086" data-name="Rectangle 19086" width="98.648" height="5.703" transform="translate(196.553 55.901)" fill="#ebebeb"/>
      <rect id="Rectangle_19087" data-name="Rectangle 19087" width="3.254" height="9.882" transform="translate(215.262 61.61)" fill="#e0e0e0"/>
      <rect id="Rectangle_19088" data-name="Rectangle 19088" width="3.254" height="9.882" transform="translate(269.371 61.61)" fill="#e0e0e0"/>
      <path id="Tracé_3872" data-name="Tracé 3872" d="M551.884,82.22l-2.234,20.739h28.631l2.375-20.739Z" transform="translate(-298.959 -47.194)" fill="#ebebeb"/>
      <path id="Tracé_3873" data-name="Tracé 3873" d="M554.007,84.84l-2.177,18.148h25.841l2.092-18.148Z" transform="translate(-299.903 -48.329)" fill="#fff"/>
      <path id="Tracé_3874" data-name="Tracé 3874" d="M562.318,90.23l-1.338,12.042h16.305l.839-12.042Z" transform="translate(-303.866 -50.663)" fill="#e0e0e0"/>
      <path id="Tracé_3875" data-name="Tracé 3875" d="M601.505,97.377l5.913,11.889-7.268-.079L601.59,96.6" transform="translate(-320.829 -53.422)" fill="#e0e0e0"/>
      <rect id="Rectangle_19089" data-name="Rectangle 19089" width="36.075" height="23.715" transform="translate(93.687 69.649) rotate(-90)" fill="#e0e0e0"/>
      <rect id="Rectangle_19090" data-name="Rectangle 19090" width="33.546" height="21.686" transform="translate(94.657 68.39) rotate(-90)" fill="#fafafa"/>
      <rect id="Rectangle_19091" data-name="Rectangle 19091" width="10.942" height="5.97" transform="translate(102.56 57.091) rotate(-90)" fill="#e0e0e0"/>
      <rect id="Rectangle_19092" data-name="Rectangle 19092" width="20.744" height="13.641" transform="translate(62.409 36.568) rotate(-90)" fill="#e0e0e0"/>
      <rect id="Rectangle_19093" data-name="Rectangle 19093" width="19.293" height="12.473" transform="translate(62.959 35.848) rotate(-90)" fill="#fafafa"/>
      <rect id="Rectangle_19094" data-name="Rectangle 19094" width="6.293" height="3.43" transform="translate(67.512 29.351) rotate(-90)" fill="#e0e0e0"/>
    </g>
    <g id="freepik--Floor--inject-124" transform="translate(-18593 -21723.445)">
      <path id="Tracé_3876" data-name="Tracé 3876" d="M414.745,462.527c0,.079-75.358.147-168.3.147s-168.308-.068-168.308-.147,75.324-.147,168.3-.147S414.745,462.442,414.745,462.527Z" transform="translate(-78.14 -462.38)" fill="#263238"/>
    </g>
    <g id="freepik--Plant--inject-124" transform="translate(-18493.236 -21749.377)">
      <path id="Tracé_3877" data-name="Tracé 3877" d="M417.9,416.64a5.1,5.1,0,0,1,3.351,2.143,8.975,8.975,0,0,1,1.446,3.781,15.788,15.788,0,0,1-1.23,8c-2.653-1.242-4.065-4.331-4.683-5.942-.975-2.546-1.2-7.739,1.134-7.983" transform="translate(-412.132 -416.64)" fill="#e34168"/>
      <path id="Tracé_3878" data-name="Tracé 3878" d="M431.975,442.145a4.337,4.337,0,0,1-.1-4.343,5.755,5.755,0,0,1,3.526-2.7,2.4,2.4,0,0,1,2.035.147,1.848,1.848,0,0,1,.675,1.752,3.719,3.719,0,0,1-.833,1.758c-1.383,1.786-3.044,3.254-5.3,3.4" transform="translate(-418.736 -424.564)" fill="#e34168"/>
      <path id="Tracé_3879" data-name="Tracé 3879" d="M431.087,452.491a2.1,2.1,0,0,1-.085-.567c-.04-.357-.085-.867-.119-1.5a18.6,18.6,0,0,1,.306-4.966,9.275,9.275,0,0,1,2.268-4.422,5.9,5.9,0,0,1,1.174-.964,1.61,1.61,0,0,1,.493-.249,12.87,12.87,0,0,0-1.514,1.355,9.814,9.814,0,0,0-2.126,4.343,21.543,21.543,0,0,0-.38,4.9,15.463,15.463,0,0,1-.017,2.075Z" transform="translate(-418.517 -426.678)" fill="#263238"/>
      <path id="Tracé_3880" data-name="Tracé 3880" d="M420.38,423.59a6.238,6.238,0,0,1,.335.85c.2.567.471,1.361.794,2.358.652,2,1.508,4.768,2.375,7.852s1.587,5.9,2.075,7.937c.238,1.02.431,1.848.567,2.427a6.072,6.072,0,0,1,.159.9,4.685,4.685,0,0,1-.272-.873l-.641-2.4c-.539-2.03-1.287-4.83-2.154-7.909s-1.7-5.862-2.268-7.869l-.709-2.381a5.157,5.157,0,0,1-.261-.89Z" transform="translate(-413.99 -419.65)" fill="#263238"/>
      <path id="Tracé_3881" data-name="Tracé 3881" d="M418.821,447.537a10.137,10.137,0,0,0-7.234-5.766,2.18,2.18,0,0,0-2.268.567c-.476.7-.062,1.6.42,2.268a8.64,8.64,0,0,0,9.071,3.169" transform="translate(-409.108 -427.49)" fill="#e34168"/>
      <path id="Tracé_3882" data-name="Tracé 3882" d="M415,445.909a1.915,1.915,0,0,1,.527.057,4.082,4.082,0,0,1,.607.13,6.284,6.284,0,0,1,.794.232,10.838,10.838,0,0,1,1.95.913,11.311,11.311,0,0,1,3.759,3.64,10.5,10.5,0,0,1,.969,1.916,6.012,6.012,0,0,1,.261.782,3.791,3.791,0,0,1,.153.607,1.7,1.7,0,0,1,.068.522c-.057,0-.2-.726-.675-1.831a11.955,11.955,0,0,0-1-1.848,12.206,12.206,0,0,0-3.674-3.555,11.907,11.907,0,0,0-1.865-.947C415.754,446.091,415,445.96,415,445.909Z" transform="translate(-411.66 -429.315)" fill="#263238"/>
    </g>
    <g id="Groupe_14020" data-name="Groupe 14020" transform="translate(-18508.01 -21939.564)">
      <g id="Groupe_14018" data-name="Groupe 14018" transform="translate(45.295 36.359)">
        <path id="Tracé_3888" data-name="Tracé 3888" d="M437,171.858s11.19,26.687,29.832,31.243c0,0,11.555-6.594,17.13-8.173,0,0-21.1-15.773-25.182-30.237A23.407,23.407,0,0,1,437,171.858Z" transform="translate(-436.987 -164.407)" fill="#fafafa"/>
        <path id="Tracé_3889" data-name="Tracé 3889" d="M436.994,171.721l.412.047,1.242.155c.277,0,.587.081.925.115l1.107.034c.4,0,.83.047,1.289.04l1.465-.094a22.852,22.852,0,0,0,7.242-1.856,23.1,23.1,0,0,0,4.05-2.281,21.665,21.665,0,0,0,3.915-3.422l.169-.189.068.243c1.5,5.15,5.008,10.36,9.375,15.4a113.582,113.582,0,0,0,15.665,14.639l.121.088.277.216-.337.094a36.92,36.92,0,0,0-4.6,1.762c-1.492.675-2.943,1.35-4.367,2.065-2.835,1.417-5.555,2.875-8.1,4.326l-.061.034h-.068a28.563,28.563,0,0,1-8.545-3.813,42.447,42.447,0,0,1-6.608-5.4,66.3,66.3,0,0,1-8.74-11.069,81.879,81.879,0,0,1-4.549-8.106c-.479-.965-.823-1.728-1.046-2.241l-.243-.587a1.086,1.086,0,0,1-.074-.2,1.242,1.242,0,0,1,.1.189l.27.58c.243.506.6,1.255,1.093,2.214a89.576,89.576,0,0,0,4.623,8,67.207,67.207,0,0,0,8.774,10.981,42.252,42.252,0,0,0,6.581,5.4,28.132,28.132,0,0,0,8.45,3.753h-.121c2.578-1.458,5.3-2.916,8.14-4.34q2.14-1.073,4.38-2.079a37.489,37.489,0,0,1,4.644-1.775l-.054.311-.128-.095a112.634,112.634,0,0,1-15.692-14.72c-4.374-5.069-7.89-10.32-9.388-15.524l.243.047a22.082,22.082,0,0,1-3.989,3.449,23.3,23.3,0,0,1-4.124,2.281,22.793,22.793,0,0,1-7.343,1.8l-1.471.074c-.466,0-.9-.041-1.3-.054l-1.114-.054c-.337-.041-.628-.1-.9-.135l-1.235-.209Z" transform="translate(-436.98 -164.27)" fill="#263238"/>
        <path id="Tracé_3890" data-name="Tracé 3890" d="M463.977,178.23s.054,0,0,.034a.331.331,0,0,1-.1.081,4.723,4.723,0,0,1-.425.236c-.371.189-.925.445-1.606.742-1.35.594-3.273,1.35-5.4,2.2s-4.05,1.559-5.447,2.065a15.525,15.525,0,0,1-2.288.756,15.763,15.763,0,0,1,2.2-.985c1.35-.567,3.287-1.35,5.4-2.16l5.4-2.106C463.147,178.561,464.058,178.223,463.977,178.23Z" transform="translate(-440.793 -168.808)" fill="#263238"/>
        <path id="Tracé_3891" data-name="Tracé 3891" d="M466.725,183.079c.04.088-3.01,1.681-6.817,3.557s-6.932,3.321-6.979,3.24,3.01-1.681,6.824-3.557S466.685,183.025,466.725,183.079Z" transform="translate(-442.165 -170.384)" fill="#263238"/>
        <path id="Tracé_3892" data-name="Tracé 3892" d="M470.828,187.459c.047.088-2.922,1.87-6.635,3.989s-6.749,3.766-6.8,3.685,2.916-1.87,6.628-3.989S470.774,187.378,470.828,187.459Z" transform="translate(-443.614 -171.807)" fill="#263238"/>
        <path id="Tracé_3893" data-name="Tracé 3893" d="M474.932,192.659a71.518,71.518,0,0,1-5.98,4.306c-3.361,2.281-6.128,4.1-6.182,4.05s2.625-2.025,5.98-4.306S474.878,192.585,474.932,192.659Z" transform="translate(-445.363 -173.498)" fill="#263238"/>
        <path id="Tracé_3894" data-name="Tracé 3894" d="M479.557,197.57a67.509,67.509,0,0,1-5.332,4.293,66.974,66.974,0,0,1-5.555,4.05,64.338,64.338,0,0,1,5.339-4.3,66.434,66.434,0,0,1,5.548-4.043Z" transform="translate(-447.281 -175.095)" fill="#263238"/>
        <path id="Tracé_3895" data-name="Tracé 3895" d="M486.229,202.338c.054.081-2.767,1.856-6.29,3.962s-6.432,3.746-6.479,3.665,2.767-1.856,6.3-3.969S486.182,202.251,486.229,202.338Z" transform="translate(-448.838 -176.644)" fill="#263238"/>
      </g>
      <g id="Groupe_14019" data-name="Groupe 14019" transform="translate(0 16.812)">
        <path id="Tracé_3896" data-name="Tracé 3896" d="M350.87,151.088s16.2-9.348,20.032-14.5c0,0,21.166,10.124,39.652,4.266l-14.174,16.468S373.278,162.285,350.87,151.088Z" transform="translate(-350.869 -136.401)" fill="#fafafa"/>
        <path id="Tracé_3897" data-name="Tracé 3897" d="M350.87,151l3.2,1.4c.992.486,2.322.918,3.834,1.492s3.307,1.06,5.278,1.674a80.148,80.148,0,0,0,14.525,2.4c.675.068,1.417.1,2.14.122l2.2.081c1.492,0,3.017,0,4.576-.067a66.661,66.661,0,0,0,9.7-1.026l-.095.054,13.256-15.382.938-1.093.189.283a43.83,43.83,0,0,1-11.224,1.8H396.63l-2.7-.155c-.891-.034-1.768-.175-2.639-.27l-1.3-.148c-.432-.061-.857-.142-1.282-.209a69.086,69.086,0,0,1-9.591-2.248,67.961,67.961,0,0,1-8.275-3.1l.169-.04a24.3,24.3,0,0,1-3.942,3.78c-1.35,1.087-2.666,2.025-3.9,2.916-2.491,1.748-4.725,3.159-6.533,4.3s-3.267,2.025-4.245,2.572l-1.127.641c-.256.148-.378.2-.391.209s.121-.088.371-.243l1.1-.675c.972-.594,2.4-1.471,4.212-2.632s4.009-2.592,6.486-4.353c1.228-.884,2.545-1.836,3.874-2.929a24.075,24.075,0,0,0,3.881-3.746l.067-.088.1.047A67.063,67.063,0,0,0,379.2,139.4a68.843,68.843,0,0,0,9.55,2.241c.425.067.844.142,1.276.2l1.289.148c.871.088,1.741.236,2.632.263l2.7.148h2.733a43.938,43.938,0,0,0,11.13-1.782l.58-.182-.391.459-.945,1.093L396.5,157.361l-.04.047H396.4a66.694,66.694,0,0,1-9.753,1.019c-1.566.081-3.1.047-4.6.047l-2.207-.088c-.729,0-1.444-.061-2.146-.128a79.1,79.1,0,0,1-14.592-2.5c-1.971-.634-3.78-1.093-5.278-1.728s-2.828-1.026-3.847-1.552Z" transform="translate(-350.869 -136.31)" fill="#263238"/>
        <path id="Tracé_3898" data-name="Tracé 3898" d="M380.852,144.129c.061.074-2.8,2.484-6.385,5.4s-6.547,5.183-6.608,5.109,2.794-2.491,6.385-5.4S380.778,144.041,380.852,144.129Z" transform="translate(-356.392 -138.851)" fill="#263238"/>
        <path id="Tracé_3899" data-name="Tracé 3899" d="M387.542,145.429c.067.068-2.545,2.646-5.838,5.757s-6.007,5.575-6.074,5.507,2.544-2.652,5.838-5.764S387.474,145.355,387.542,145.429Z" transform="translate(-358.917 -139.274)" fill="#263238"/>
        <path id="Tracé_3900" data-name="Tracé 3900" d="M394.191,147.529c.074.067-1.978,2.572-4.576,5.6s-4.779,5.4-4.846,5.359,1.971-2.565,4.576-5.588S394.124,147.469,394.191,147.529Z" transform="translate(-361.888 -139.957)" fill="#263238"/>
        <path id="Tracé_3901" data-name="Tracé 3901" d="M402.519,148a66.1,66.1,0,0,1-4.05,5.609,65.173,65.173,0,0,1-4.3,5.4,68.623,68.623,0,0,1,4.05-5.609,68.075,68.075,0,0,1,4.3-5.4Z" transform="translate(-364.944 -140.11)" fill="#263238"/>
        <path id="Tracé_3902" data-name="Tracé 3902" d="M409.238,148.89a68,68,0,0,1-4.137,5.494c-2.369,2.97-4.347,5.332-4.421,5.271a67.213,67.213,0,0,1,4.144-5.494A68.293,68.293,0,0,1,409.238,148.89Z" transform="translate(-367.061 -140.399)" fill="#263238"/>
        <path id="Tracé_3903" data-name="Tracé 3903" d="M418.135,149.28a56.89,56.89,0,0,1-3.192,5.319,52.447,52.447,0,0,1-3.483,5.129,54.942,54.942,0,0,1,3.192-5.318,51.449,51.449,0,0,1,3.483-5.13Z" transform="translate(-370.565 -140.526)" fill="#263238"/>
      </g>
      <g id="freepik--character-2--inject-124" transform="translate(41.248)">
        <path id="Tracé_3904" data-name="Tracé 3904" d="M563.958,188.281l-12.23-.675c-.074-1.431,0-9.766,0-9.766s-5.089-.79-5.15-5.879.817-16.772.817-16.772h0a17.7,17.7,0,0,1,17.771,2.234l.749.58Z" transform="translate(-484.082 -146.091)" fill="#aa755e"/>
        <path id="Tracé_3905" data-name="Tracé 3905" d="M548.965,168.655a.742.742,0,1,0-1.039-.054A.743.743,0,0,0,548.965,168.655Z" transform="translate(-484.458 -150.513)" fill="#263238"/>
        <path id="Tracé_3906" data-name="Tracé 3906" d="M547.735,167.209c.074.088.574-.3,1.276-.3s1.215.358,1.289.27-.04-.2-.263-.371a1.782,1.782,0,0,0-1.026-.324,1.714,1.714,0,0,0-1.026.351C547.769,167.006,547.694,167.168,547.735,167.209Z" transform="translate(-484.456 -150.228)" fill="#263238"/>
        <path id="Tracé_3907" data-name="Tracé 3907" d="M559.529,167.947a.742.742,0,1,0,.825.03A.736.736,0,0,0,559.529,167.947Z" transform="translate(-488.178 -150.669)" fill="#263238"/>
        <path id="Tracé_3908" data-name="Tracé 3908" d="M559,167.65c.081.088.58-.3,1.282-.3s1.208.358,1.289.27-.041-.2-.263-.371a1.728,1.728,0,0,0-2.025,0C559.047,167.455,559,167.61,559,167.65Z" transform="translate(-488.121 -150.372)" fill="#263238"/>
        <path id="Tracé_3909" data-name="Tracé 3909" d="M553.977,173.635a3.442,3.442,0,0,0-1.134-.243c-.182,0-.324-.061-.337-.155a.959.959,0,0,1,.128-.526l.553-1.424a19.424,19.424,0,0,0,1.2-3.746,19.294,19.294,0,0,0-1.573,3.6c-.182.493-.351.965-.526,1.438a1.154,1.154,0,0,0-.1.756.493.493,0,0,0,.317.3,1.507,1.507,0,0,0,.317.04A3.374,3.374,0,0,0,553.977,173.635Z" transform="translate(-485.899 -150.572)" fill="#263238"/>
        <path id="Tracé_3910" data-name="Tracé 3910" d="M554.233,188.4a11.852,11.852,0,0,0,6.628-1.89s-1.566,3.665-6.641,3.206Z" transform="translate(-486.567 -156.739)" fill="#7f5242"/>
        <path id="Tracé_3911" data-name="Tracé 3911" d="M548.138,150.229a1.91,1.91,0,1,1,1.269-3.462,5.609,5.609,0,0,1-1.35-1.917,1.923,1.923,0,0,1,.493-2.146,2.146,2.146,0,0,1,2.2,0c1.053.526,1.843,1.492,2.929,1.944a12.586,12.586,0,0,0,3.51.466,6.243,6.243,0,0,1,3.57,1.485,4.2,4.2,0,0,1,1.417,3.51c1.667-.1,3.5,0,4.724,1.1a4.758,4.758,0,0,1,1.35,3.847,14.456,14.456,0,0,1-1.242,4.05h0a2.922,2.922,0,0,1-.574,1.026l-.79,3.6-2.254-.182.614-7.559s.425-3.179-2.335-3.064-6.682,2.97-11.98,1.863a5.8,5.8,0,0,1-2.443-.871,2.457,2.457,0,0,1-1.006-2.288A1.674,1.674,0,0,1,548.138,150.229Z" transform="translate(-483.968 -142.4)" fill="#263238"/>
        <path id="Tracé_3912" data-name="Tracé 3912" d="M574.549,167.318c.115,0,3.793-.283,3.186,4s-4.725,2.254-4.725,2.133S574.549,167.318,574.549,167.318Z" transform="translate(-492.675 -150.499)" fill="#aa755e"/>
        <path id="Tracé_3913" data-name="Tracé 3913" d="M575.258,172.86a1.208,1.208,0,0,0,.182.142.79.79,0,0,0,.56.094,1.883,1.883,0,0,0,1.093-1.539,2.47,2.47,0,0,0-.061-1.1.864.864,0,0,0-.479-.675.371.371,0,0,0-.466.142c-.081.115-.061.2-.088.2s-.081-.081,0-.256a.466.466,0,0,1,.209-.243.567.567,0,0,1,.425-.047,1.053,1.053,0,0,1,.675.776,2.559,2.559,0,0,1,.088,1.228,1.964,1.964,0,0,1-1.35,1.7.823.823,0,0,1-.675-.216C575.251,172.968,575.244,172.867,575.258,172.86Z" transform="translate(-493.404 -151.228)" fill="#7f5242"/>
        <path id="Tracé_3914" data-name="Tracé 3914" d="M559,162.885c.148.243.918.047,1.822.068s1.674.223,1.829,0c.067-.121-.054-.351-.378-.574a2.788,2.788,0,0,0-2.882-.034C559.084,162.534,558.956,162.763,559,162.885Z" transform="translate(-488.118 -148.759)" fill="#263238"/>
        <path id="Tracé_3915" data-name="Tracé 3915" d="M548.847,163.671c.155.236.594.243,1.053.317s.884.162,1.1,0c.095-.1.088-.3-.081-.513a1.35,1.35,0,0,0-.884-.472,1.4,1.4,0,0,0-.979.223C548.841,163.374,548.78,163.563,548.847,163.671Z" transform="translate(-484.812 -149.093)" fill="#263238"/>
        <path id="Tracé_3916" data-name="Tracé 3916" d="M553.78,178.577c0,.04.189.142.547.182a2.814,2.814,0,0,0,1.35-.223,2.767,2.767,0,0,0,1.107-.837c.223-.283.283-.5.25-.52a7.426,7.426,0,0,1-1.485,1.046,7.283,7.283,0,0,1-1.768.351Z" transform="translate(-486.424 -153.706)" fill="#263238"/>
        <path id="Tracé_3917" data-name="Tracé 3917" d="M556.091,454.92l.142-6.23,11.67.189-.115,9.112-.722.04c-3.219.122-16.394.412-18.534-.277C546.142,457,556.091,454.92,556.091,454.92Z" transform="translate(-484.598 -241.964)" fill="#e34168"/>
        <g id="Groupe_14012" data-name="Groupe 14012" transform="translate(63.528 214.136)" opacity="0.4">
          <path id="Tracé_3918" data-name="Tracé 3918" d="M551.214,459.67s-3.489.945-3.071,1.525,13.748.79,19.627.365V461.3l-15.523-.115S551.889,459.711,551.214,459.67Z" transform="translate(-548.108 -459.67)" fill="#fff"/>
        </g>
        <path id="Tracé_3919" data-name="Tracé 3919" d="M567.956,461.921h-.776l-2.119.054c-1.8.04-4.266.054-7.006,0s-5.21-.135-7-.223l-2.119-.121-.574-.04h.58l2.119.074c1.789.068,4.266.142,7,.182s5.2.04,7,0h2.9Z" transform="translate(-484.597 -246.158)" fill="#263238"/>
        <path id="Tracé_3920" data-name="Tracé 3920" d="M553.693,461.3a4.724,4.724,0,0,0-.378-1.019,4.986,4.986,0,0,0-.675-.823,1.62,1.62,0,0,1,.83.749A1.593,1.593,0,0,1,553.693,461.3Z" transform="translate(-486.054 -245.465)" fill="#263238"/>
        <path id="Tracé_3921" data-name="Tracé 3921" d="M559.048,459.208a1.437,1.437,0,0,1-.358-.452c-.162-.27-.277-.506-.243-.526s.2.182.365.452S559.082,459.188,559.048,459.208Z" transform="translate(-487.939 -245.065)" fill="#263238"/>
        <path id="Tracé_3922" data-name="Tracé 3922" d="M560.4,458.68c0,.034-.209-.095-.4-.277s-.338-.358-.31-.385.209.095.4.277S560.431,458.626,560.4,458.68Z" transform="translate(-488.344 -244.995)" fill="#263238"/>
        <path id="Tracé_3923" data-name="Tracé 3923" d="M561.075,457.31a1.485,1.485,0,0,1-.607.068,1.309,1.309,0,0,1-.607-.074,1.349,1.349,0,0,1,.607-.067,1.309,1.309,0,0,1,.607.074Z" transform="translate(-488.401 -244.739)" fill="#263238"/>
        <path id="Tracé_3924" data-name="Tracé 3924" d="M561.35,456.2a1.276,1.276,0,0,1-.675.189,1.148,1.148,0,0,1-.675-.108,3.47,3.47,0,0,1,.675-.034,3.809,3.809,0,0,1,.675-.047Z" transform="translate(-488.446 -244.405)" fill="#263238"/>
        <path id="Tracé_3925" data-name="Tracé 3925" d="M557.727,457.662a2.4,2.4,0,0,1-.749,0,4.313,4.313,0,0,1-.8-.189,2.027,2.027,0,0,1-.452-.2.391.391,0,0,1-.182-.236.3.3,0,0,1,.115-.3,1.35,1.35,0,0,1,1.694.432,1.2,1.2,0,0,1,.236.5.514.514,0,0,1,0,.2,2.269,2.269,0,0,0-.331-.641,1.383,1.383,0,0,0-.634-.425,1.127,1.127,0,0,0-.9.047c-.122.081-.074.223.054.3a2.338,2.338,0,0,0,.418.189,4.95,4.95,0,0,0,.769.209A6.716,6.716,0,0,1,557.727,457.662Z" transform="translate(-486.997 -244.538)" fill="#263238"/>
        <path id="Tracé_3926" data-name="Tracé 3926" d="M558.442,457.524a.729.729,0,0,1-.081-.526,1.35,1.35,0,0,1,.216-.54.763.763,0,0,1,.628-.378.3.3,0,0,1,.229.351.844.844,0,0,1-.135.337,2.576,2.576,0,0,1-.358.445,1.128,1.128,0,0,1-.439.3,4.9,4.9,0,0,0,.365-.364,3.178,3.178,0,0,0,.324-.445c.1-.162.176-.439,0-.479s-.385.162-.5.31a1.3,1.3,0,0,0-.223.486,3.161,3.161,0,0,0-.027.506Z" transform="translate(-487.908 -244.367)" fill="#263238"/>
        <path id="Tracé_3927" data-name="Tracé 3927" d="M575.2,457.293a7.77,7.77,0,0,0-.864,0,3.672,3.672,0,0,0-3.091,2.389c-.189.5-.209.83-.236.83s0-.088,0-.236a2.791,2.791,0,0,1,.142-.628,3.551,3.551,0,0,1,1.208-1.721,3.631,3.631,0,0,1,1.971-.736,3.473,3.473,0,0,1,.675,0C575.115,457.26,575.2,457.28,575.2,457.293Z" transform="translate(-492.019 -244.723)" fill="#263238"/>
        <path id="Tracé_3928" data-name="Tracé 3928" d="M575.5,450.12a19.829,19.829,0,0,1,.061,2.4,21.268,21.268,0,0,1-.074,2.4,38.83,38.83,0,0,1,0-4.8Z" transform="translate(-493.455 -242.429)" fill="#263238"/>
        <path id="Tracé_3929" data-name="Tracé 3929" d="M567.188,460.5a6.791,6.791,0,0,1-1.708.142,6.358,6.358,0,0,1-1.7-.169c0-.04.763,0,1.708,0A14.385,14.385,0,0,1,567.188,460.5Z" transform="translate(-489.675 -245.788)" fill="#263238"/>
        <path id="Tracé_3930" data-name="Tracé 3930" d="M572.052,460.558a2.369,2.369,0,0,1-.148.337c-.081.176-.121.331-.162.324s-.061-.182,0-.385S572.025,460.531,572.052,460.558Z" transform="translate(-492.25 -245.821)" fill="#263238"/>
        <path id="Tracé_3931" data-name="Tracé 3931" d="M573.3,459a.7.7,0,0,1-.169.263c-.121.115-.25.2-.277.169s.054-.148.176-.27A.538.538,0,0,1,573.3,459Z" transform="translate(-492.624 -245.316)" fill="#263238"/>
        <path id="Tracé_3932" data-name="Tracé 3932" d="M575.039,458.267c0,.04-.162.034-.337.094s-.3.142-.324.115.067-.182.283-.25S575.053,458.234,575.039,458.267Z" transform="translate(-493.118 -245.056)" fill="#263238"/>
        <path id="Tracé_3933" data-name="Tracé 3933" d="M576.49,457.981a.318.318,0,0,1-.148.128c-.094.034-.189.034-.2,0s.054-.095.155-.135S576.477,457.927,576.49,457.981Z" transform="translate(-493.692 -244.972)" fill="#263238"/>
        <g id="Groupe_14013" data-name="Groupe 14013" transform="translate(71.513 210.471)" opacity="0.3">
          <path id="Tracé_3934" data-name="Tracé 3934" d="M571.589,456.022l-11.649-.378.04-1.4,11.717,1.046Z" transform="translate(-559.94 -454.24)"/>
        </g>
        <path id="Tracé_3935" data-name="Tracé 3935" d="M540.658,451.335l-1.978-5.906,11.042-3.78,2.983,8.612-.675.277c-2.99,1.208-15.281,5.953-17.548,6.027C531.985,456.654,540.658,451.335,540.658,451.335Z" transform="translate(-480.004 -239.676)" fill="#e34168"/>
        <g id="Groupe_14014" data-name="Groupe 14014" transform="translate(54.035 210.343)" opacity="0.4">
          <path id="Tracé_3936" data-name="Tracé 3936" d="M536.491,458.127s-2.963,2.079-2.369,2.477,13.2-3.921,18.588-6.311l-.1-.243-14.653,5.163S537.146,457.938,536.491,458.127Z" transform="translate(-534.043 -454.05)" fill="#fff"/>
        </g>
        <path id="Tracé_3937" data-name="Tracé 3937" d="M552.793,454l-.189.088-.533.216-1.971.776c-1.674.641-4,1.5-6.587,2.389s-4.947,1.64-6.662,2.167l-2.025.6-.56.155a.871.871,0,0,1-.2.047l.189-.074.547-.176,2.025-.675c1.708-.547,4.05-1.35,6.641-2.207s4.914-1.728,6.594-2.349l2.025-.729.547-.2Z" transform="translate(-480.017 -243.69)" fill="#263238"/>
        <path id="Tracé_3938" data-name="Tracé 3938" d="M539.147,461.343a4.635,4.635,0,0,0-.675-.83,4.445,4.445,0,0,0-.952-.533,1.518,1.518,0,0,1,1.039.425,1.579,1.579,0,0,1,.587.938Z" transform="translate(-481.139 -245.634)" fill="#263238"/>
        <path id="Tracé_3939" data-name="Tracé 3939" d="M543.477,457.5a2.253,2.253,0,0,1-.493-.3c-.25-.2-.425-.385-.4-.412a1.312,1.312,0,0,1,.493.3C543.315,457.288,543.538,457.477,543.477,457.5Z" transform="translate(-482.783 -244.596)" fill="#263238"/>
        <path id="Tracé_3940" data-name="Tracé 3940" d="M544.564,456.507c0,.034-.229,0-.479-.128s-.439-.216-.425-.256.229,0,.479.128A1.454,1.454,0,0,1,544.564,456.507Z" transform="translate(-483.134 -244.376)" fill="#263238"/>
        <path id="Tracé_3941" data-name="Tracé 3941" d="M544.754,454.87a1.484,1.484,0,0,1-.553.27c-.317.115-.587.175-.6.135a1.552,1.552,0,0,1,.553-.27,1.5,1.5,0,0,1,.6-.135Z" transform="translate(-483.115 -243.973)" fill="#263238"/>
        <path id="Tracé_3942" data-name="Tracé 3942" d="M544.615,453.68a1.312,1.312,0,0,1-.58.412,1.141,1.141,0,0,1-.675.135,4.183,4.183,0,0,1,.635-.27A3.985,3.985,0,0,1,544.615,453.68Z" transform="translate(-483.037 -243.586)" fill="#263238"/>
        <path id="Tracé_3943" data-name="Tracé 3943" d="M541.771,456.342a2.159,2.159,0,0,1-.675.236,4.536,4.536,0,0,1-.817.094,2.113,2.113,0,0,1-.493-.034.425.425,0,0,1-.25-.155.3.3,0,0,1,0-.324,1.4,1.4,0,0,1,2.133.223c.068.115.088.182.081.189a2.025,2.025,0,0,0-.533-.5,1.349,1.349,0,0,0-.736-.182,1.2,1.2,0,0,0-.83.344c-.081.122,0,.243.162.277a2.505,2.505,0,0,0,.452.034,5.319,5.319,0,0,0,.8-.061C541.494,456.41,541.764,456.322,541.771,456.342Z" transform="translate(-481.779 -244.264)" fill="#263238"/>
        <path id="Tracé_3944" data-name="Tracé 3944" d="M542.48,455.982a.749.749,0,0,1-.257-.459,1.254,1.254,0,0,1,0-.587.742.742,0,0,1,.466-.567.3.3,0,0,1,.331.256.789.789,0,0,1,0,.358,2.023,2.023,0,0,1-.189.54,1.073,1.073,0,0,1-.3.432s.094-.175.216-.472a2.343,2.343,0,0,0,.148-.526c.047-.182,0-.472-.169-.445s-.3.284-.365.459a1.349,1.349,0,0,0-.04.533A2.692,2.692,0,0,0,542.48,455.982Z" transform="translate(-482.656 -243.81)" fill="#263238"/>
        <path id="Tracé_3945" data-name="Tracé 3945" d="M558.49,449.59a4.647,4.647,0,0,0-.81.31,3.746,3.746,0,0,0-1.525,1.35,3.813,3.813,0,0,0-.574,1.951c0,.533.088.857.061.864a.762.762,0,0,1-.074-.223,3.1,3.1,0,0,1-.088-.641,3.61,3.61,0,0,1,.553-2.025,3.672,3.672,0,0,1,1.606-1.35,3.292,3.292,0,0,1,.614-.189.862.862,0,0,1,.236-.047Z" transform="translate(-486.976 -242.257)" fill="#263238"/>
        <path id="Tracé_3946" data-name="Tracé 3946" d="M555.91,443.37a21.26,21.26,0,0,1,.871,2.234,21.685,21.685,0,0,1,.742,2.281,18.9,18.9,0,0,1-.877-2.234,20.656,20.656,0,0,1-.736-2.281Z" transform="translate(-487.117 -240.235)" fill="#263238"/>
        <path id="Tracé_3947" data-name="Tracé 3947" d="M551.573,455.418a6.377,6.377,0,0,1-1.552.709,6.161,6.161,0,0,1-1.66.425c0-.04.729-.243,1.613-.553S551.559,455.378,551.573,455.418Z" transform="translate(-484.662 -244.15)" fill="#263238"/>
        <path id="Tracé_3948" data-name="Tracé 3948" d="M556.26,454.319v.358c0,.189,0,.351-.04.365s-.122-.155-.1-.378S556.226,454.3,556.26,454.319Z" transform="translate(-487.183 -243.794)" fill="#263238"/>
        <path id="Tracé_3949" data-name="Tracé 3949" d="M556.864,452.4c.034,0,0,.155-.074.31s-.162.263-.2.25,0-.155.074-.31S556.864,452.379,556.864,452.4Z" transform="translate(-487.335 -243.169)" fill="#263238"/>
        <path id="Tracé_3950" data-name="Tracé 3950" d="M558.241,451.108c0,.04-.142.088-.283.2s-.229.236-.263.223,0-.2.175-.337S558.241,451.067,558.241,451.108Z" transform="translate(-487.693 -242.742)" fill="#263238"/>
        <path id="Tracé_3951" data-name="Tracé 3951" d="M559.49,450.365a.2.2,0,0,1-.094.176c-.094.067-.169.1-.189.067s0-.108.094-.175S559.463,450.338,559.49,450.365Z" transform="translate(-488.186 -242.505)" fill="#263238"/>
        <g id="Groupe_14015" data-name="Groupe 14015" transform="translate(59.871 206.314)" opacity="0.3">
          <path id="Tracé_3952" data-name="Tracé 3952" d="M554.211,448.809l-11.082,3.6-.439-1.336,11.373-2.99Z" transform="translate(-542.69 -448.08)"/>
        </g>
        <path id="Tracé_3953" data-name="Tracé 3953" d="M510.517,349.35c3.631,14.774,20.518,49.453,20.518,49.453L540,396.487v3.537l16.968.56,2.4-115.414-21.058.594h0l-13.721-.594S507.486,337.025,510.517,349.35Zm17.758-4.947c.1-3.145,10.489-43.027,10.489-43.027.391,5.541,1.573,50.843,1.289,77.483C535.516,364.7,528.227,346.319,528.274,344.4Z" transform="translate(-472.244 -188.81)" fill="#263238"/>
        <path id="Tracé_3954" data-name="Tracé 3954" d="M554.491,412.77a6.437,6.437,0,0,0-.067,1.12c0,.769-.041,1.8-.061,3.051-.041,2.578-.067,6.135-.074,10.07s0,7.492,0,10.07l.047,3.051a6.075,6.075,0,0,0,.061,1.114,8.781,8.781,0,0,0,.068-1.12c0-.769,0-1.8.061-3.051.034-2.578.061-6.135.074-10.07s0-7.485,0-10.063c0-1.249,0-2.281-.04-3.051a8.264,8.264,0,0,0-.068-1.12Z" transform="translate(-486.589 -230.288)" fill="#455a64"/>
        <path id="Tracé_3955" data-name="Tracé 3955" d="M566.678,287.49a1.755,1.755,0,0,0,0,.594,6.747,6.747,0,0,0,.337,1.593,7.755,7.755,0,0,0,8.45,5.271,7.342,7.342,0,0,0,1.546-.365,1.762,1.762,0,0,0,.533-.27,15.92,15.92,0,0,1-2.14.439,7.85,7.85,0,0,1-8.207-5.123,15.378,15.378,0,0,1-.52-2.14Z" transform="translate(-490.609 -189.564)" fill="#455a64"/>
        <path id="Tracé_3956" data-name="Tracé 3956" d="M550.175,287.75a2.373,2.373,0,0,0-.061.6c0,.391-.047.952-.068,1.654-.034,1.39-.067,3.314-.081,5.44v3a4.333,4.333,0,0,0,.56,2.423,2.072,2.072,0,0,0,1.4.925.878.878,0,0,0,.614-.081,4.169,4.169,0,0,1-.594-.041,2.025,2.025,0,0,1-1.222-.931,4.286,4.286,0,0,1-.452-2.295c0-.931,0-1.937,0-3V290a16.232,16.232,0,0,0-.047-1.654A1.821,1.821,0,0,0,550.175,287.75Z" transform="translate(-485.181 -189.648)" fill="#455a64"/>
        <path id="Tracé_3957" data-name="Tracé 3957" d="M529.66,295.143h.466a7.363,7.363,0,0,0,1.262-.2,10.475,10.475,0,0,0,6.56-4.941,7.3,7.3,0,0,0,.54-1.154c.1-.283.142-.439.122-.452s-.3.594-.864,1.485a11.474,11.474,0,0,1-6.419,4.839C530.315,295.021,529.653,295.089,529.66,295.143Z" transform="translate(-478.584 -189.86)" fill="#455a64"/>
        <path id="Tracé_3958" data-name="Tracé 3958" d="M569.6,206.779c-1.721-3.233-2.889-5.116-6.014-7.04a19.121,19.121,0,0,0-8.808-2.949h0a21.6,21.6,0,0,1-13.04,0c-1.849.236-4.684-.452-11.022,2.8a15.132,15.132,0,0,0-6.3,6.074L516.85,219.2l10.576,6.641,2.814-8.18-2.025,18.372-3.226,21h38.2l-.493-24.19v-7.168Z" transform="translate(-474.42 -160.081)" fill="#e34168"/>
        <path id="Tracé_3959" data-name="Tracé 3959" d="M560.95,240.605a1.406,1.406,0,0,1-.324.243,8.455,8.455,0,0,1-1.026.594,10.32,10.32,0,0,1-10.286-.979,7.29,7.29,0,0,1-2.457-2.929,4.468,4.468,0,0,1,.169-4.05,3.057,3.057,0,0,1,3.685-1.444,2.565,2.565,0,0,1,1.546,1.282,2.821,2.821,0,0,1,.155,1.917,4.461,4.461,0,0,1-2.207,2.652,8.348,8.348,0,0,1-2.828,1.019,8.666,8.666,0,0,1-4.3-.364,7.423,7.423,0,0,1-1.073-.493,1.424,1.424,0,0,1-.344-.223c0-.034.5.27,1.458.58a8.828,8.828,0,0,0,4.211.256,8.16,8.16,0,0,0,2.7-1.026,4.218,4.218,0,0,0,2.025-2.477,2.531,2.531,0,0,0-.148-1.694,2.247,2.247,0,0,0-1.35-1.107,2.9,2.9,0,0,0-1.849.04,2.855,2.855,0,0,0-1.424,1.255,4.15,4.15,0,0,0-.155,3.746,7.1,7.1,0,0,0,2.329,2.808,9.982,9.982,0,0,0,5.892,1.924,10.354,10.354,0,0,0,4.158-.817C560.47,240.9,560.929,240.571,560.95,240.605Z" transform="translate(-482.484 -171.485)" fill="#fafafa"/>
        <path id="Tracé_3960" data-name="Tracé 3960" d="M567.951,271.194l-.2.068-.574.169a11.115,11.115,0,0,1-2.295.3,12.427,12.427,0,0,1-3.645-.4,12.6,12.6,0,0,1-4.374-2.092,11.384,11.384,0,0,1-2.025-1.957,5.17,5.17,0,0,1-1.262-2.815,2.781,2.781,0,0,1,1.674-2.774,1.924,1.924,0,0,1,1.768.216,2.99,2.99,0,0,1,1.066,1.485c1.35,4.839-3.26,10.489-8.923,10.509a11.2,11.2,0,0,1-7.424-2.7,9.227,9.227,0,0,1-2.4-3,4.725,4.725,0,0,1-.466-1.836,3.436,3.436,0,0,1,.439-1.816,2.876,2.876,0,0,1,1.35-1.249,2.43,2.43,0,0,1,1.782-.041,3.294,3.294,0,0,1,2.086,2.518,5.48,5.48,0,0,1-.3,3.071,7.128,7.128,0,0,1-1.573,2.369,9.118,9.118,0,0,1-4.218,2.376,14.849,14.849,0,0,1-3.631.466c-1.006,0-1.782-.04-2.308-.081l-.6-.054a.674.674,0,0,1-.2,0,.762.762,0,0,1,.2,0h.6c.526,0,1.309.047,2.3,0a15.524,15.524,0,0,0,3.591-.52,8.909,8.909,0,0,0,4.05-2.356,6.863,6.863,0,0,0,1.5-2.3,5.171,5.171,0,0,0,.27-2.909,2.983,2.983,0,0,0-1.9-2.288,2.126,2.126,0,0,0-1.552.04,2.544,2.544,0,0,0-1.174,1.12,3.584,3.584,0,0,0,.047,3.375,9.057,9.057,0,0,0,2.315,2.875,10.9,10.9,0,0,0,7.222,2.639,9.139,9.139,0,0,0,6.83-3.314,8.774,8.774,0,0,0,1.741-3.253,5.791,5.791,0,0,0,.047-3.483,2.6,2.6,0,0,0-.931-1.35,1.633,1.633,0,0,0-1.492-.189,2.47,2.47,0,0,0-1.478,2.464,4.9,4.9,0,0,0,1.174,2.666,11.433,11.433,0,0,0,2.025,1.93,12.472,12.472,0,0,0,4.272,2.1,12.979,12.979,0,0,0,3.584.459A14.8,14.8,0,0,0,567.951,271.194Z" transform="translate(-479.247 -181.137)" fill="#fafafa"/>
        <path id="Tracé_3961" data-name="Tracé 3961" d="M557.543,219.488a5.356,5.356,0,0,1-.77-.162,10.124,10.124,0,0,1-2.079-.837,10.361,10.361,0,0,1-2.794-2.173,9.289,9.289,0,0,1-1.3-1.8,4.933,4.933,0,0,1-.675-2.423,3.253,3.253,0,0,1,1.168-2.484,2.511,2.511,0,0,1,1.4-.553,3.024,3.024,0,0,1,1.532.29A3.375,3.375,0,0,1,555.9,211.9a5.062,5.062,0,0,1-.614,3.334,7.721,7.721,0,0,1-6.034,3.692,14.032,14.032,0,0,1-7.559-1.579,7.877,7.877,0,0,1-3.01-2.585,4.968,4.968,0,0,1-.715-3.773,3.828,3.828,0,0,1,.864-1.714,3.1,3.1,0,0,1,1.633-.952,3.624,3.624,0,0,1,1.843.054,2.9,2.9,0,0,1,1.532.958,2.362,2.362,0,0,1,.52,1.694,3.158,3.158,0,0,1-.614,1.6,6.688,6.688,0,0,1-2.5,2.025,13.836,13.836,0,0,1-5.541,1.282,14.619,14.619,0,0,1-7.9-2.065,12.018,12.018,0,0,1-1.8-1.35l-.425-.4a1.787,1.787,0,0,1-.135-.148l.162.121.445.371a13.579,13.579,0,0,0,1.822,1.276,14.849,14.849,0,0,0,7.816,1.93,13.722,13.722,0,0,0,5.4-1.3,6.358,6.358,0,0,0,2.376-1.91,2.842,2.842,0,0,0,.553-1.444,2.025,2.025,0,0,0-.452-1.471,3.132,3.132,0,0,0-3.051-.884,3.044,3.044,0,0,0-2.241,2.416,4.63,4.63,0,0,0,.675,3.5,7.594,7.594,0,0,0,2.882,2.464,13.721,13.721,0,0,0,7.357,1.546,7.424,7.424,0,0,0,5.791-3.51,4.725,4.725,0,0,0,.594-3.118,3.112,3.112,0,0,0-1.708-2.349,2.463,2.463,0,0,0-2.632.209,2.99,2.99,0,0,0-1.053,2.295,4.726,4.726,0,0,0,.607,2.308,9.374,9.374,0,0,0,1.249,1.782,10.841,10.841,0,0,0,2.7,2.187,12.035,12.035,0,0,0,2.025.884A6.538,6.538,0,0,1,557.543,219.488Z" transform="translate(-477.215 -163.8)" fill="#fafafa"/>
        <path id="Tracé_3962" data-name="Tracé 3962" d="M454.029,239.173c.83-1.35,6.547,1.849,7.053,2.086s.857-.486.391-.675c-.675-.27-7.64-3.26-6.837-4.576.445-.729,1.681.189,1.681.189s6.311,3.28,6.668,2.646-3.28-2.7-4.556-3.294-1.492-1.444-.763-1.782c.5-.229,4.455,1.525,5.7,2.153s4.644,2.41,3.685.169-.857-4.32-.432-4.866a.763.763,0,0,1,1.309.6,8.672,8.672,0,0,0,.52,2.4,5.921,5.921,0,0,0,.911,1.748c.472.607.9,1.107,1.262,1.525,3.645,1.269,14.039,4.488,23.758,3.6,1.755-.162,8.295-16.873,8.295-16.873l11.238,5.1a121.716,121.716,0,0,1-7.674,16.954c-7.89,14.4-40.267,0-40.267,0v-.034a71.73,71.73,0,0,1-7.586-1.924c-3.408-1.228-3.307-1.539-3.091-1.91.567-1,6.074,1.937,5.258.621S453.394,240.192,454.029,239.173Z" transform="translate(-453.984 -169)" fill="#aa755e"/>
        <path id="Tracé_3963" data-name="Tracé 3963" d="M554.15,289.418c0,.054.391.115.614.628a1.046,1.046,0,0,1,0,.877.945.945,0,0,1-1.674-.27,1.012,1.012,0,0,1,.27-.83,1.444,1.444,0,0,1,.776-.4.428.428,0,0,0-.263-.068,1.086,1.086,0,0,0-.675.3,1.192,1.192,0,1,0,1.8.3,1.08,1.08,0,0,0-.56-.5A.39.39,0,0,0,554.15,289.418Z" transform="translate(-486.099 -190.169)" fill="#455a64"/>
        <path id="Tracé_3964" data-name="Tracé 3964" d="M527.747,223.065l-13.5,28.57H477.66l13.809-28.611h17.022A7.877,7.877,0,0,1,513.8,221h12.635a1.458,1.458,0,0,1,1.316,2.065Z" transform="translate(-461.68 -167.95)" fill="#263238"/>
        <path id="Tracé_3965" data-name="Tracé 3965" d="M519.586,223.345l-35.907-.135-4.3,26.181,35.9.182Z" transform="translate(-462.239 -168.669)" fill="#fafafa"/>
        <path id="Tracé_3966" data-name="Tracé 3966" d="M519.545,223.261a2.714,2.714,0,0,1-.061.459c-.061.31-.121.783-.209,1.35-.2,1.228-.472,3.01-.83,5.278-.736,4.6-1.789,11.177-3.064,19.134v.121h-.121l-35.88-.155h-.229l.034-.2c1.552-9.4,3.017-18.311,4.313-26.181v-.135h.135l25.985.182,7.336.074H483.591l.162-.135L479.474,249.3l-.169-.2h0l35.879.216-.142.121c1.35-7.91,2.43-14.444,3.2-19.013.391-2.275.675-4.05.911-5.3q.148-.9.243-1.4A3.267,3.267,0,0,1,519.545,223.261Z" transform="translate(-462.165 -168.578)" fill="#263238"/>
        <path id="Tracé_3967" data-name="Tracé 3967" d="M490.325,247.289c-.094,0,.526-4.286,1.39-9.53s1.633-9.483,1.728-9.449-.52,4.279-1.384,9.53S490.42,247.3,490.325,247.289Z" transform="translate(-465.794 -170.327)" fill="#263238"/>
        <path id="Tracé_3968" data-name="Tracé 3968" d="M496.2,247.407c-.095,0,.486-4.05,1.3-9s1.552-8.963,1.647-8.95-.486,4.05-1.3,9S496.3,247.427,496.2,247.407Z" transform="translate(-467.702 -170.7)" fill="#263238"/>
        <path id="Tracé_3969" data-name="Tracé 3969" d="M502.385,246.916c-.1,0,.486-4.05,1.3-9s1.552-8.963,1.647-8.943-.486,4.05-1.3,9S502.479,246.93,502.385,246.916Z" transform="translate(-469.714 -170.541)" fill="#263238"/>
        <path id="Tracé_3970" data-name="Tracé 3970" d="M508.275,247.3c-.095,0,.486-4.05,1.3-9s1.552-8.963,1.647-8.95-.486,4.05-1.3,9S508.37,247.337,508.275,247.3Z" transform="translate(-471.629 -170.665)" fill="#263238"/>
        <path id="Tracé_3971" data-name="Tracé 3971" d="M514.835,248.027c-.094,0,.486-4.05,1.3-9s1.552-8.956,1.647-8.943-.486,4.05-1.3,9S514.943,248.04,514.835,248.027Z" transform="translate(-473.761 -170.902)" fill="#263238"/>
        <path id="Tracé_3972" data-name="Tracé 3972" d="M520.045,247.617c-.1,0,.486-4.05,1.3-9s1.552-8.956,1.647-8.943-.486,4.05-1.3,9S520.139,247.63,520.045,247.617Z" transform="translate(-475.454 -170.769)" fill="#263238"/>
        <path id="Tracé_3973" data-name="Tracé 3973" d="M507.183,254.034,492.395,228.8a.925.925,0,0,0-.8-.418H456.731c-.675,0-1.093.607-.79,1.114l14.626,24.561Z" transform="translate(-454.588 -170.349)" fill="#455a64"/>
        <path id="Tracé_3974" data-name="Tracé 3974" d="M505.619,241.58c.823-1.35,6.54,1.849,7.046,2.079s.857-.486.391-.675c-.675-.27-7.633-3.26-6.837-4.576.445-.729,1.681.189,1.681.189s6.317,3.28,6.675,2.646-3.28-2.7-4.556-3.3-1.492-1.438-.763-1.775c.493-.236,4.448,1.525,5.7,2.153s4.644,2.41,3.685.169-.85-4.32-.432-4.866a.763.763,0,0,1,1.309.6,8.929,8.929,0,0,0,.52,2.4,5.818,5.818,0,0,0,.918,1.741c.466.614.891,1.114,1.262,1.525,3.645,1.276,14.039,4.5,23.751,3.611,1.755-.162,8.295-16.873,8.295-16.873l11.244,5.089a121.876,121.876,0,0,1-7.674,16.968c-7.883,14.4-40.26,0-40.26,0v-.04a73.835,73.835,0,0,1-7.607-1.937c-3.408-1.228-3.3-1.539-3.091-1.91.567-1.006,6.074,1.937,5.265.614S504.984,242.6,505.619,241.58Z" transform="translate(-470.754 -169.781)" fill="#aa755e"/>
        <path id="Tracé_3975" data-name="Tracé 3975" d="M588.411,226.578s4.954-20.64-6.014-25.418l-7.667,19.519Z" transform="translate(-493.234 -161.501)" fill="#e34168"/>
        <path id="Tracé_3976" data-name="Tracé 3976" d="M587.452,226.8a1.627,1.627,0,0,1-.317-.1l-.9-.351L582.95,225l-11.022-4.691-.148-.061.054-.155c.284-.81.587-1.66.891-2.524.9-2.545,1.768-4.961,2.551-7.168.4-1.093.729-2.16,1.12-3.132a12.757,12.757,0,0,1,1.35-2.592,6.52,6.52,0,0,1,3.273-2.6,4.368,4.368,0,0,1,1.127-.216,1.209,1.209,0,0,1,.4,0,6.906,6.906,0,0,0-1.478.324,6.574,6.574,0,0,0-3.111,2.605,12.821,12.821,0,0,0-1.3,2.558c-.371.958-.675,2.025-1.087,3.125l-2.517,7.175c-.31.864-.607,1.721-.9,2.531l-.094-.216,11,4.785,3.253,1.451.864.412A1.651,1.651,0,0,1,587.452,226.8Z" transform="translate(-492.275 -161.724)" fill="#263238"/>
      </g>
    </g>
  </g>
</svg>
