<svg xmlns="http://www.w3.org/2000/svg" width="282.031" height="210.146" viewBox="0 0 282.031 210.146">
  <g id="Procédures" transform="translate(19454 14080)">
    <g id="freepik--background-complete--inject-824" transform="translate(-19454 -14080)">
      <rect id="Rectangle_19348" data-name="Rectangle 19348" width="282.031" height="0.141" transform="translate(0 184.674)" fill="#ebebeb"/>
      <path id="Tracé_4874" data-name="Tracé 4874" d="M150.34,214.517H41.431A3.221,3.221,0,0,1,38.21,211.3V58.193A3.221,3.221,0,0,1,41.431,55H150.34a3.221,3.221,0,0,1,3.221,3.221V211.3A3.221,3.221,0,0,1,150.34,214.517ZM41.431,55.113a3.085,3.085,0,0,0-3.08,3.08V211.3a3.085,3.085,0,0,0,3.08,3.08H150.34a3.085,3.085,0,0,0,3.08-3.08V58.193a3.085,3.085,0,0,0-3.08-3.08Z" transform="translate(-16.657 -55)" fill="#ebebeb"/>
      <path id="Tracé_4875" data-name="Tracé 4875" d="M366.641,214.517H257.721A3.226,3.226,0,0,1,254.5,211.3V58.193A3.226,3.226,0,0,1,257.721,55h108.92a3.221,3.221,0,0,1,3.21,3.193V211.3A3.221,3.221,0,0,1,366.641,214.517Zm-108.92-159.4a3.085,3.085,0,0,0-3.08,3.08V211.3a3.085,3.085,0,0,0,3.08,3.08h108.92a3.085,3.085,0,0,0,3.08-3.08V58.193a3.085,3.085,0,0,0-3.08-3.08Z" transform="translate(-110.946 -55)" fill="#ebebeb"/>
      <rect id="Rectangle_19349" data-name="Rectangle 19349" width="14.666" height="0.141" transform="translate(28.925 190.044)" fill="#ebebeb"/>
      <rect id="Rectangle_19350" data-name="Rectangle 19350" width="25.4" height="0.141" transform="translate(81.874 188.515)" fill="#ebebeb"/>
      <rect id="Rectangle_19351" data-name="Rectangle 19351" width="34.289" height="0.141" transform="translate(44.155 195.284)" fill="#ebebeb"/>
      <rect id="Rectangle_19352" data-name="Rectangle 19352" width="10.847" height="0.141" transform="translate(242.259 194.336)" fill="#ebebeb"/>
      <rect id="Rectangle_19353" data-name="Rectangle 19353" width="31.187" height="0.141" transform="translate(206.046 194.336)" fill="#ebebeb"/>
      <rect id="Rectangle_19354" data-name="Rectangle 19354" width="42.006" height="0.141" transform="translate(144.992 191.956)" fill="#ebebeb"/>
      <path id="Tracé_4876" data-name="Tracé 4876" d="M144.4,279H113.617L111.75,257.44h30.786Z" transform="translate(-48.716 -143.251)" fill="#e6e6e6"/>
      <path id="Tracé_4877" data-name="Tracé 4877" d="M147.229,279H116.443L114.57,257.44h30.786Z" transform="translate(-49.945 -143.251)" fill="#f0f0f0"/>
      <path id="Tracé_4878" data-name="Tracé 4878" d="M124.557,277.952l-1.027-12.3h21.525l1.027,12.3Z" transform="translate(-53.851 -146.83)" fill="#fff"/>
      <rect id="Rectangle_19355" data-name="Rectangle 19355" width="4.394" height="48.921" transform="translate(111.019 135.753)" fill="#e6e6e6"/>
      <rect id="Rectangle_19356" data-name="Rectangle 19356" width="3.052" height="48.921" transform="translate(113.743 135.753)" fill="#f0f0f0"/>
      <rect id="Rectangle_19357" data-name="Rectangle 19357" width="42.536" height="5.398" transform="translate(116.795 141.151) rotate(180)" fill="#f0f0f0"/>
      <rect id="Rectangle_19358" data-name="Rectangle 19358" width="4.394" height="43.523" transform="translate(71.371 141.151)" fill="#e6e6e6"/>
      <rect id="Rectangle_19359" data-name="Rectangle 19359" width="3.052" height="43.523" transform="translate(74.101 141.151)" fill="#f0f0f0"/>
      <rect id="Rectangle_19360" data-name="Rectangle 19360" width="4.394" height="43.523" transform="translate(40.088 141.151)" fill="#e6e6e6"/>
      <rect id="Rectangle_19361" data-name="Rectangle 19361" width="3.052" height="43.523" transform="translate(42.818 141.151)" fill="#f0f0f0"/>
      <rect id="Rectangle_19362" data-name="Rectangle 19362" width="4.394" height="43.523" transform="translate(83.205 141.151)" fill="#e6e6e6"/>
      <rect id="Rectangle_19363" data-name="Rectangle 19363" width="3.052" height="43.523" transform="translate(85.935 141.151)" fill="#f0f0f0"/>
      <rect id="Rectangle_19364" data-name="Rectangle 19364" width="34.171" height="5.398" transform="translate(40.088 135.753)" fill="#e6e6e6"/>
      <rect id="Rectangle_19365" data-name="Rectangle 19365" width="127.608" height="73.204" transform="translate(38.926 15.467)" fill="#e6e6e6"/>
      <rect id="Rectangle_19366" data-name="Rectangle 19366" width="129.424" height="73.204" transform="translate(40.517 15.467)" fill="#f0f0f0"/>
      <rect id="Rectangle_19367" data-name="Rectangle 19367" width="127.608" height="6.34" transform="translate(38.926 88.67)" fill="#e6e6e6"/>
      <rect id="Rectangle_19368" data-name="Rectangle 19368" width="129.424" height="6.34" transform="translate(46.197 88.67)" fill="#f0f0f0"/>
      <rect id="Rectangle_19369" data-name="Rectangle 19369" width="63.654" height="119.874" transform="translate(165.163 20.239) rotate(90)" fill="#fafafa"/>
      <path id="Tracé_4879" data-name="Tracé 4879" d="M95.91,154.534,123.933,90.88h13.233l-28.028,63.654Z" transform="translate(-41.811 -70.641)" fill="#fff"/>
      <path id="Tracé_4880" data-name="Tracé 4880" d="M83.954,151.955a.344.344,0,0,1-.344-.344V96.158a.344.344,0,0,1,.683,0v55.453a.344.344,0,0,1-.338.344Z" transform="translate(-36.449 -72.812)" fill="#f0f0f0"/>
      <path id="Tracé_4881" data-name="Tracé 4881" d="M124.4,154.534,152.428,90.88h5.156l-28.023,63.654Z" transform="translate(-54.231 -70.641)" fill="#fff"/>
      <rect id="Rectangle_19370" data-name="Rectangle 19370" width="63.654" height="0.609" transform="translate(165.163 20.239) rotate(90)" fill="#e6e6e6"/>
      <path id="Tracé_4882" data-name="Tracé 4882" d="M204.322,99.517H76.714L76.28,94.17h127.6Z" transform="translate(-33.253 -72.076)" fill="#ebebeb" opacity="0.6"/>
      <path id="Tracé_4883" data-name="Tracé 4883" d="M204.322,115.052H76.714l-.434-5.342h127.6Z" transform="translate(-33.253 -78.85)" fill="#ebebeb" opacity="0.6"/>
      <path id="Tracé_4884" data-name="Tracé 4884" d="M204.322,130.592H76.714l-.434-5.342h127.6Z" transform="translate(-33.253 -85.625)" fill="#ebebeb" opacity="0.6"/>
      <path id="Tracé_4885" data-name="Tracé 4885" d="M204.322,146.127H76.714l-.434-5.347h127.6Z" transform="translate(-33.253 -92.395)" fill="#ebebeb" opacity="0.6"/>
      <path id="Tracé_4886" data-name="Tracé 4886" d="M204.322,161.667H76.714l-.434-5.347h127.6Z" transform="translate(-33.253 -99.169)" fill="#ebebeb" opacity="0.6"/>
      <path id="Tracé_4887" data-name="Tracé 4887" d="M204.322,177.2H76.714l-.434-5.342h127.6Z" transform="translate(-33.253 -105.944)" fill="#ebebeb" opacity="0.6"/>
      <rect id="Rectangle_19371" data-name="Rectangle 19371" width="34.363" height="34.363" transform="translate(240.482 49.824) rotate(180)" fill="#ebebeb"/>
      <rect id="Rectangle_19372" data-name="Rectangle 19372" width="1.523" height="34.363" transform="translate(204.596 15.467)" fill="#e0e0e0"/>
      <rect id="Rectangle_19373" data-name="Rectangle 19373" width="25.05" height="25.05" transform="translate(235.828 45.17) rotate(180)" fill="#fff"/>
      <rect id="Rectangle_19374" data-name="Rectangle 19374" width="11.857" height="11.857" transform="translate(231.685 32.643) rotate(135)" fill="#f5f5f5"/>
      <rect id="Rectangle_19375" data-name="Rectangle 19375" width="34.363" height="34.363" transform="translate(228.642 95.005) rotate(180)" fill="#ebebeb"/>
      <rect id="Rectangle_19376" data-name="Rectangle 19376" width="1.523" height="34.363" transform="translate(192.757 60.648)" fill="#e0e0e0"/>
      <rect id="Rectangle_19377" data-name="Rectangle 19377" width="25.05" height="25.05" transform="translate(223.989 90.351) rotate(180)" fill="#fff"/>
      <rect id="Rectangle_19378" data-name="Rectangle 19378" width="10.683" height="10.683" rx="5.342" transform="translate(216.803 83.165) rotate(180)" fill="#f5f5f5"/>
      <rect id="Rectangle_19379" data-name="Rectangle 19379" width="8.568" height="70.666" transform="translate(165.005 111.701)" fill="#f0f0f0"/>
      <rect id="Rectangle_19380" data-name="Rectangle 19380" width="82.274" height="2.307" transform="translate(166.195 182.367)" fill="#f0f0f0"/>
      <rect id="Rectangle_19381" data-name="Rectangle 19381" width="76.081" height="70.666" transform="translate(249.654 182.367) rotate(180)" fill="#fafafa"/>
      <path id="Tracé_4888" data-name="Tracé 4888" d="M374.053,313.5H327.761a8.241,8.241,0,0,1,0-16.482h46.293a8.241,8.241,0,1,1,0,16.482Zm-46.293-15.929a7.688,7.688,0,0,0,0,15.376h46.293a7.688,7.688,0,0,0,0-15.376Z" transform="translate(-139.291 -160.506)" fill="#f0f0f0"/>
      <path id="Tracé_4889" data-name="Tracé 4889" d="M374.053,349.852H327.761a8.241,8.241,0,0,1,0-16.482h46.293a8.241,8.241,0,1,1,0,16.482Zm-46.293-15.929a7.688,7.688,0,1,0,0,15.371h46.293a7.688,7.688,0,1,0,0-15.371Z" transform="translate(-139.291 -176.352)" fill="#f0f0f0"/>
      <path id="Tracé_4890" data-name="Tracé 4890" d="M375.444,305.821H361.472a1.726,1.726,0,0,1-1.692-1.72h0a1.726,1.726,0,0,1,1.692-1.72h13.972a1.726,1.726,0,0,1,1.72,1.72h0a1.726,1.726,0,0,1-1.72,1.72Z" transform="translate(-156.842 -162.842)" fill="#ebebeb"/>
      <path id="Tracé_4891" data-name="Tracé 4891" d="M374.053,277.152H327.761a8.241,8.241,0,0,1,0-16.482h46.293a8.241,8.241,0,1,1,0,16.482Zm-46.293-15.929a7.688,7.688,0,0,0,0,15.376h46.293a7.688,7.688,0,0,0,0-15.376Z" transform="translate(-139.291 -144.659)" fill="#f0f0f0"/>
      <path id="Tracé_4892" data-name="Tracé 4892" d="M375.444,269.493H361.472a1.726,1.726,0,0,1-1.692-1.72h0a1.72,1.72,0,0,1,1.692-1.692h13.972a1.726,1.726,0,0,1,1.72,1.692h0A1.726,1.726,0,0,1,375.444,269.493Z" transform="translate(-156.842 -147.018)" fill="#ebebeb"/>
      <path id="Tracé_4893" data-name="Tracé 4893" d="M375.444,342.2H361.472a1.72,1.72,0,0,1-1.692-1.692h0a1.726,1.726,0,0,1,1.692-1.692h13.972a1.726,1.726,0,0,1,1.72,1.692h0a1.726,1.726,0,0,1-1.72,1.692Z" transform="translate(-156.842 -178.728)" fill="#ebebeb"/>
      <rect id="Rectangle_19382" data-name="Rectangle 19382" width="77.643" height="3.593" transform="translate(173.579 108.114)" fill="#f0f0f0"/>
      <rect id="Rectangle_19383" data-name="Rectangle 19383" width="10.249" height="3.593" transform="translate(173.573 111.701) rotate(180)" fill="#e6e6e6"/>
    </g>
    <g id="freepik--Shadow--inject-824" transform="translate(-19422.35 -13882.624)">
      <ellipse id="freepik--path--inject-824" cx="109.366" cy="6.385" rx="109.366" ry="6.385" transform="translate(0 0)" fill="#f5f5f5"/>
    </g>
    <g id="freepik--terms-and-conditions--inject-824" transform="translate(-19378.99 -14027.412)">
      <path id="Tracé_4894" data-name="Tracé 4894" d="M320.933,148.23H235.918s-15.314,14.1-15.314,48.385c0,29.483,11.614,69.459,7.254,85.822-3.288,12.347-19.234,14.468-26.878,14.762H281.9s26.612,1.608,30.973-14.762-7.254-56.338-7.254-85.828C305.619,162.309,320.933,148.23,320.933,148.23Z" transform="translate(-200.98 -148.23)" fill="#e34168"/>
      <g id="Groupe_14232" data-name="Groupe 14232" transform="translate(28.085 8.461)">
        <path id="Tracé_4896" data-name="Tracé 4896" d="M320.092,190.925H252.1c1.923-15.083,7.107-23.86,9.967-27.7h65.561A85.076,85.076,0,0,0,320.092,190.925Z" transform="translate(-251.35 -163.23)" fill="#fff" opacity="0.8"/>
        <path id="Tracé_4897" data-name="Tracé 4897" d="M319.008,223.428H250.92c.056-1.371.135-2.7.248-3.988h68.048Q319.076,221.386,319.008,223.428Z" transform="translate(-250.835 -187.734)" fill="#fff" opacity="0.3"/>
        <path id="Tracé_4898" data-name="Tracé 4898" d="M272.2,237.6H250.832q-.056-1.912-.062-3.762v-.22h21.378v.214Q272.148,235.7,272.2,237.6Z" transform="translate(-250.77 -193.916)" fill="#fff" opacity="0.3"/>
        <path id="Tracé_4899" data-name="Tracé 4899" d="M319.545,251.772H251.508c-.118-1.342-.214-2.674-.288-3.982h68.065Q319.387,249.77,319.545,251.772Z" transform="translate(-250.966 -200.093)" fill="#fff" opacity="0.3"/>
        <path id="Tracé_4900" data-name="Tracé 4900" d="M320.8,265.918H252.82q-.237-2-.44-3.988h68.037C320.513,263.272,320.654,264.6,320.8,265.918Z" transform="translate(-251.472 -206.257)" fill="#fff" opacity="0.3"/>
        <path id="Tracé_4901" data-name="Tracé 4901" d="M322.514,280.122H254.59c-.186-1.331-.361-2.662-.53-3.982h67.947Q322.244,278.131,322.514,280.122Z" transform="translate(-252.204 -212.452)" fill="#fff" opacity="0.3"/>
        <path id="Tracé_4902" data-name="Tracé 4902" d="M324.483,294.292H256.564q-.293-2-.564-3.982h67.913C324.1,291.636,324.291,292.955,324.483,294.292Z" transform="translate(-253.05 -218.629)" fill="#fff" opacity="0.3"/>
        <path id="Tracé_4903" data-name="Tracé 4903" d="M326.6,308.468H258.7c-.107-.728-.22-1.467-.333-2.205l-.271-1.782H326C326.2,305.811,326.4,307.142,326.6,308.468Z" transform="translate(-253.965 -224.806)" fill="#fff" opacity="0.3"/>
        <path id="Tracé_4904" data-name="Tracé 4904" d="M260.834,322.642q-.282-1.974-.564-3.982h67.885c.2,1.331.4,2.657.592,3.982Z" transform="translate(-254.911 -230.988)" fill="#fff" opacity="0.3"/>
        <path id="Tracé_4905" data-name="Tracé 4905" d="M262.783,336.812c-.158-1.3-.333-2.634-.513-3.982H318.9c.192,1.342.372,2.674.564,3.982Z" transform="translate(-255.783 -237.165)" fill="#fff" opacity="0.3"/>
        <path id="Tracé_4906" data-name="Tracé 4906" d="M264.372,350.988q-.164-1.952-.372-3.988h67.981c.152,1.365.293,2.7.412,3.988Z" transform="translate(-256.537 -243.342)" fill="#fff" opacity="0.3"/>
        <path id="Tracé_4907" data-name="Tracé 4907" d="M265.254,365.162c0-1.286-.051-2.617-.124-3.982H301c.09,1.393.141,2.724.158,3.982Z" transform="translate(-257.03 -249.524)" fill="#fff" opacity="0.3"/>
      </g>
    </g>
    <g id="freepik--contraception-methods--inject-728" transform="translate(-19396.559 -14070.411)">
      <circle id="Ellipse_3476" data-name="Ellipse 3476" cx="11.608" cy="11.608" r="11.608" transform="translate(65.535 1.154) rotate(-2.85)" fill="#fff" stroke="#dedede" stroke-width="1"/>
      <path id="Tracé_4970" data-name="Tracé 4970" d="M331.583,75.044a11.608,11.608,0,1,1-2.589-16.211A11.608,11.608,0,0,1,331.583,75.044Z" transform="translate(-199.037 -42.107)" fill="#fff" stroke="#dedede" stroke-width="1"/>
      <circle id="Ellipse_3477" data-name="Ellipse 3477" cx="11.608" cy="11.608" r="11.608" transform="matrix(0.97, -0.244, 0.244, 0.97, 134.894, 57.589)" fill="#fff" stroke="#dedede" stroke-width="1"/>
      <circle id="Ellipse_3478" data-name="Ellipse 3478" cx="11.608" cy="11.608" r="11.608" transform="translate(18.762 24.413) rotate(-22.5)" fill="#fff" stroke="#dedede" stroke-width="1"/>
      <circle id="Ellipse_3479" data-name="Ellipse 3479" cx="11.608" cy="11.608" r="11.608" transform="translate(129.784 122.748) rotate(-80.59)" fill="#fff" stroke="#dedede" stroke-width="1"/>
      <path id="Tracé_5007" data-name="Tracé 5007" d="M151.932,242.443a11.608,11.608,0,1,1,4.162-7.86A11.608,11.608,0,0,1,151.932,242.443Z" transform="translate(-121.595 -114.151)" fill="#fff" stroke="#dedede" stroke-width="1"/>
      <circle id="Ellipse_3480" data-name="Ellipse 3480" cx="11.608" cy="11.608" r="11.608" transform="translate(0 83.894) rotate(-86.46)" fill="#fff" stroke="#dedede" stroke-width="1"/>
      <text id="_1" data-name="1" transform="translate(22.559 123.411)" fill="#e34168" font-size="12" font-family="Roboto-Bold, Roboto" font-weight="700"><tspan x="-3.442" y="0">1</tspan></text>
      <text id="_2" data-name="2" transform="translate(12.559 77.411)" fill="#e34168" font-size="12" font-family="Roboto-Bold, Roboto" font-weight="700"><tspan x="-3.442" y="0">2</tspan></text>
      <text id="_3" data-name="3" transform="translate(33.559 34.411)" fill="#e34168" font-size="12" font-family="Roboto-Bold, Roboto" font-weight="700"><tspan x="-3.442" y="0">3</tspan></text>
      <text id="_4" data-name="4" transform="translate(77.559 16.411)" fill="#e34168" font-size="12" font-family="Roboto-Bold, Roboto" font-weight="700"><tspan x="-3.442" y="0">4</tspan></text>
      <text id="_5" data-name="5" transform="translate(122.559 30.411)" fill="#e34168" font-size="12" font-family="Roboto-Bold, Roboto" font-weight="700"><tspan x="-3.442" y="0">5</tspan></text>
      <text id="_6" data-name="6" transform="translate(148.559 70.411)" fill="#e34168" font-size="12" font-family="Roboto-Bold, Roboto" font-weight="700"><tspan x="-3.442" y="0">6</tspan></text>
      <text id="_7" data-name="7" transform="translate(142.559 117.411)" fill="#e34168" font-size="12" font-family="Roboto-Bold, Roboto" font-weight="700"><tspan x="-3.442" y="0">7</tspan></text>
    </g>
  </g>
</svg>
