<svg xmlns="http://www.w3.org/2000/svg" width="12.788" height="17.051" viewBox="0 0 12.788 17.051">
  <path id="Icon_awesome-clipboard-list" data-name="Icon awesome-clipboard-list" d="M11.19,2.131H8.525a2.131,2.131,0,1,0-4.263,0H1.6A1.6,1.6,0,0,0,0,3.73V15.452a1.6,1.6,0,0,0,1.6,1.6H11.19a1.6,1.6,0,0,0,1.6-1.6V3.73A1.6,1.6,0,0,0,11.19,2.131ZM3.2,14.12a.8.8,0,1,1,.8-.8A.8.8,0,0,1,3.2,14.12Zm0-3.2a.8.8,0,1,1,.8-.8A.8.8,0,0,1,3.2,10.923Zm0-3.2a.8.8,0,1,1,.8-.8A.8.8,0,0,1,3.2,7.726Zm3.2-6.394a.8.8,0,1,1-.8.8A.8.8,0,0,1,6.394,1.332Zm4.263,12.255a.267.267,0,0,1-.266.266h-4.8a.267.267,0,0,1-.266-.266v-.533a.267.267,0,0,1,.266-.266h4.8a.267.267,0,0,1,.266.266Zm0-3.2a.267.267,0,0,1-.266.266h-4.8a.267.267,0,0,1-.266-.266V9.858a.267.267,0,0,1,.266-.266h4.8a.267.267,0,0,1,.266.266Zm0-3.2a.267.267,0,0,1-.266.266h-4.8a.267.267,0,0,1-.266-.266V6.661a.267.267,0,0,1,.266-.266h4.8a.267.267,0,0,1,.266.266Z" fill="#5d5d5d"/>
</svg>
