<svg id="bar_chart-24px" xmlns="http://www.w3.org/2000/svg" width="28.654" height="28.654" viewBox="0 0 28.654 28.654">
  <path id="Tracé_2545" data-name="Tracé 2545" d="M0,0H28.654V28.654H0Z" fill="none"/>
  <g id="Groupe_12536" data-name="Groupe 12536" transform="translate(0.259 6.178)">
    <path id="Tracé_2801" data-name="Tracé 2801" d="M24.291,172.792a7.742,7.742,0,0,0-5.249-5.78,7.891,7.891,0,0,0-2.278-.339,7.672,7.672,0,1,0,7.681,7.674A8.128,8.128,0,0,0,24.291,172.792Zm-4.133,6.658a5.464,5.464,0,0,1-5.834-1.247,5.174,5.174,0,0,1-1.185-1.793H11.961a.77.77,0,1,1,0-1.539h.785a5.185,5.185,0,0,1-.015-.847h-.77a.77.77,0,1,1,0-1.539h1.093a5.29,5.29,0,0,1,1.27-1.993,5.483,5.483,0,0,1,5.834-1.239.768.768,0,1,1-.554,1.432,3.928,3.928,0,0,0-4.187.885,4.536,4.536,0,0,0-.67.908h4.487a.77.77,0,0,1,0,1.539H14.293a3.114,3.114,0,0,0,.023.847h4.518a.77.77,0,0,1,0,1.539H14.878a2.534,2.534,0,0,0,.546.7,3.927,3.927,0,0,0,4.187.9v.008a.77.77,0,0,1,.546,1.439Z" transform="translate(-9.095 -165.511)" fill="#fff"/>
    <path id="Tracé_2802" data-name="Tracé 2802" d="M227.2,201.747a23.038,23.038,0,0,1-6.288.785,25.636,25.636,0,0,1-4.437-.371,9.263,9.263,0,0,1,.705,2.077c.048.249.089.5.118.757a24.578,24.578,0,0,0,3.622.255,21.255,21.255,0,0,0,5.9-.739c1.662-.508,2.017-1.031,2.017-1.139s.069-.231.069-.331H228.9v-1.97A8.809,8.809,0,0,1,227.2,201.747Z" transform="translate(-200.509 -197.26)" fill="#fff"/>
    <path id="Tracé_2803" data-name="Tracé 2803" d="M225.161,257.555a26.865,26.865,0,0,1-3.567-.232,9.183,9.183,0,0,1-.523,2.628,24.227,24.227,0,0,0,4.245.352,20.588,20.588,0,0,0,5.857-.754c1.632-.508,1.978-1.039,1.978-1.147V256.07a8.972,8.972,0,0,1-1.639.677A22.422,22.422,0,0,1,225.161,257.555Z" transform="translate(-204.755 -248.027)" fill="#fff"/>
    <path id="Tracé_2804" data-name="Tracé 2804" d="M196.971,312.555a25.652,25.652,0,0,1-4.737-.423,9.068,9.068,0,0,1-1.7,2.173c.213.088.463.177.754.266a20.946,20.946,0,0,0,5.842.731,20.587,20.587,0,0,0,5.857-.754c1.632-.508,1.978-1.039,1.978-1.147V311.07a8.971,8.971,0,0,1-1.639.677A22.424,22.424,0,0,1,196.971,312.555Z" transform="translate(-176.566 -298.794)" fill="#fff"/>
    <path id="Tracé_2805" data-name="Tracé 2805" d="M180.065,154.623l.038.011a21.73,21.73,0,0,0,5.588.662,21.4,21.4,0,0,0,5.857-.723c1.709-.508,2.094-1.039,2.1-1.154-.023-.131-.408-.623-2.032-1.116a21.278,21.278,0,0,0-5.926-.731h-.1a21.131,21.131,0,0,0-5.511.654,6.588,6.588,0,0,0-1.779.735A9.183,9.183,0,0,1,180.065,154.623Z" transform="translate(-165.277 -151.57)" fill="#fff"/>
  </g>
</svg>
