{
  "routingKey": "informationliaisonuserconcernees",
  "index": "informationliaisonuserconcernee",
  "mappingProperties": {
    "id": {
      "type": "keyword"
    },
    "statut": {
      "type": "keyword"
    },
    "coupleStatutUserConcernee": {
      "type": "keyword"
    },
    "isRemoved": {
      "type": "keyword"
    },
    "informationLiaison": {
      "properties": {
        "id": {
          "type": "keyword"
        }
      }
    },
    "userConcernee": {
      "properties": {
        "id": {
          "type": "keyword"
        },
        "email": {
          "type": "keyword"
        },
        "login": {
          "type": "keyword"
        },
        "userName": {
          "type": "keyword"
        }
      }
    },
    "prisEnCharge": {
      "properties": {
        "id": {
          "type": "keyword"
        },
        "date": {
          "type": "keyword"
        },
        "description": {
          "type": "keyword"
        },
        "fichiersJoints": {
          "properties": {
            "id": {
              "type": "keyword"
            },
            "fichier": {
              "properties": {
                "id": {
                  "type": "keyword"
                },
                "chemin": {
                  "type": "keyword"
                },
                "nomOriginal": {
                  "type": "keyword"
                },
                "type": {
                  "type": "keyword"
                },
                "publicUrl": {
                  "type": "keyword"
                }
              }
            }
          }
        }
      }
    },
    "userCreation": {
      "properties": {
        "id": {
          "type": "keyword"
        },
        "email": {
          "type": "keyword"
        },

        "login": {
          "type": "keyword"
        },
        "userName": {
          "type": "keyword"
        }
      }
    },
    "dateStatutModification": {
      "type": "date",
      "format": "date_optional_time||strict_date_optional_time"
    },
    "dateCreation": {
      "type": "date",
      "format": "date_optional_time||strict_date_optional_time"
    },
    "dateModification": {
      "type": "date",
      "format": "date_optional_time||strict_date_optional_time"
    }
  },
  "instances": 1,
  "query": "query informationLiaisonUserConcernee($id: ID!) { informationLiaisonUserConcernee(id: $id) { id statut isRemoved informationLiaison { id } coupleStatutUserConcernee userConcernee { id email login userName } userCreation { id email login userName } prisEnCharge { id date description fichiersJoints { id fichier { id chemin nomOriginal type publicUrl } } } dateCreation dateStatutModification dateModification } }",
  "dataKey": "informationLiaisonUserConcernee"
}
