{
  "routingKey": "actualites",
  "index": "actualite",
  "mappingProperties": {
    "id": {
      "type": "keyword"
    },
    "libelle": {
      "type": "keyword"
    },
    "descrition": {
      "type": "keyword"
    },
    "isRemoved": {
      "type": "keyword"
    },
    "dateDebut": {
      "type": "date",
      "format": "date_optional_time||strict_date_optional_time"
    },
    "dateFin": {
      "type": "date",
      "format": "date_optional_time||strict_date_optional_time"
    },
    "dateCreation": {
      "type": "keyword"
    },
    "dateModification": {
      "type": "keyword"
    },
    "nbPartage": {
      "type": "keyword"
    },
    "nbRecommandation": {
      "type": "keyword"
    },
    "isShared": {
      "type": "keyword"
    },
    "pharmaciesCible": {
      "properties": {
        "id": {
          "type": "keyword"
        },
        "nom": {
          "type": "keyword"
        }
      }
    },
    "pharmaciesPresidentCible": {
      "properties": {
        "id": {
          "type": "keyword"
        },
        "nom": {
          "type": "keyword"
        }
      }
    },
    "servicesCible": {
      "properties": {
        "id": {
          "type": "keyword"
        },
        "nom": {
          "type": "keyword"
        }
      }
    },
    "pharmaciesRolesCible": {
      "properties": {
        "id": {
          "type": "keyword"
        },
        "code": {
          "type": "keyword"
        },
        "nom": {
          "type": "keyword"
        }
      }
    },
    "typePresidentCible": {
      "type": "keyword"
    },
    "presidentsCibles": {
      "properties": {
        "id": {
          "type": "keyword"
        },
        "nom": {
          "type": "keyword"
        },
        "prenom": {
          "type": "keyword"
        },
        "pharmacies": {
          "properties": {
            "id": {
              "type": "keyword"
            }
          }
        }
      }
    },
    "laboratoiresCible": {
      "properties": {
        "id": {
          "type": "keyword"
        },
        "nomLabo": {
          "type": "keyword"
        }
      }
    },
    "partenairesCible": {
      "properties": {
        "id": {
          "type": "keyword"
        },
        "nom": {
          "type": "keyword"
        }
      }
    },
    "actions": {
      "properties": {
        "total": {
          "type": "long"
        },
        "data": {
          "properties": {
            "id": {
              "type": "keyword"
            },
            "description": {
              "type": "keyword"
            },
            "dateDebut": {
              "type": "keyword"
            },
            "priority": {
              "type": "keyword"
            },
            "status": {
              "type": "keyword"
            },
            "item": {
              "properties": {
                "id": {
                  "type": "keyword"
                },
                "code": {
                  "type": "keyword"
                },
                "name": {
                  "type": "keyword"
                }
              }
            },
            "userCreation": {
              "properties": {
                "id": {
                  "type": "keyword"
                },
                "email": {
                  "type": "keyword"
                },

                "login": {
                  "type": "keyword"
                },
                "userName": {
                  "type": "keyword"
                }
              }
            },
            "assignedUsers": {
              "properties": {
                "id": {
                  "type": "keyword"
                },
                "email": {
                  "type": "keyword"
                },

                "login": {
                  "type": "keyword"
                },
                "userName": {
                  "type": "keyword"
                }
              }
            }
          }
        }
      }
    },
    "actualiteCible": {
      "properties": {
        "globalite": {
          "type": "keyword"
        }
      }
    },
    "laboratoire": {
      "properties": {
        "id": {
          "type": "keyword"
        },
        "nomLabo": {
          "type": "keyword"
        }
      }
    },
    "fichierPresentations": {
      "properties": {
        "id": {
          "type": "keyword"
        },
        "nomOriginal": {
          "type": "keyword"
        },
        "publicUrl": {
          "type": "keyword"
        }
      }
    },
    "comments": {
      "properties": {
        "total": {
          "type": "integer"
        }
      }
    },
    "userSmyleys": {
      "properties": {
        "total": {
          "type": "integer"
        }
      }
    },
    "idGroupement": {
      "type": "keyword"
    },
    "niveauPriorite": {
      "type": "keyword"
    },
    "nbSeenByPharmacie": {
      "type": "integer"
    },
    "operation": {
      "properties": {
        "id": {
          "type": "keyword"
        },
        "commandePassee": {
          "type": "keyword"
        }
      }
    },
    "idFonction": {
      "type": "keyword"
    },
    "idTache": {
      "type": "keyword"
    },
    "urgence": {
      "properties": {
        "id": {
          "type": "keyword"
        },
        "code": {
          "type": "keyword"
        },
        "libelle": {
          "type": "keyword"
        },
        "couleur": {
          "type": "keyword"
        }
      }
    },
    "importance": {
      "properties": {
        "id": {
          "type": "keyword"
        },
        "ordre": {
          "type": "keyword"
        },
        "libelle": {
          "type": "keyword"
        },
        "couleur": {
          "type": "keyword"
        }
      }
    },
    "dateEcheance": {
      "type": "date",
      "format": "date_optional_time||strict_date_optional_time"
    }
  },
  "instances": 1,
  "query": "query actualite($id: ID!) { actualite(id: $id){ operation { id commandePassee } idGroupement id libelle dateEcheance idFonction idTache urgence {id code libelle couleur } importance {id ordre libelle couleur } nbPartage nbRecommandation isShared laboratoire { id nomLabo } fichierPresentations { id nomOriginal publicUrl } comments { total } userSmyleys { total } fichierPresentations { id chemin publicUrl urlPresigned } item { id code name } origine { id code libelle } description actionAuto niveauPriorite nbSeenByPharmacie isRemoved dateDebut dateFin dateCreation dateModification actualiteCible { globalite fichierCible { id chemin publicUrl urlPresigned } } pharmaciesPresidentCible { id cip nom } pharmaciesCible { id cip nom } pharmaciesRolesCible { id code nom } partenairesCible { id nom } laboratoiresCible { id nomLabo } typePresidentCible presidentsCibles { id nom prenom pharmacies { id } } servicesCible { id code nom } actions {total data { id description dateDebut priority status item { id code name } userCreation { id email login userName } assignedUsers { id email login userName } } } } }",
  "dataKey": "actualite"
}
