43646;1;2.00;"*";"201D01.2"
43647;1;2.00;"*";"201D01.2"
43648;1;2.00;"*";"201D01.2"
43649;1;2.00;"*";"201D01.2"
43650;1;2.00;"*";"201D01.2"
43651;1;2.00;"*";"201D01.2"
43652;1;2.00;"*";"201D01.2"
43653;1;2.00;"*";"201D01.2"
43654;1;2.00;"*";"201D01.2"
43655;1;2.00;"*";"201D01.2"
43656;1;2.00;"*";"201D01.2"
43657;1;2.00;"*";"201D01.2"
43658;1;2.00;"*";"201D01.2"
43659;1;2.00;"*";"201D01.2"
43660;1;2.00;"*";"201D01.2"
43661;1;2.00;"*";"201D01.2"
59288;1;1.00;"*";"201E00.021"
59290;1;1.00;"*";"201E00.021"
59291;1;1.00;"*";"201E00.021"
60376;1;2.00;"*";"201D01.8"
60230;1;2.00;"*";"201D01.8"
60231;1;2.00;"*";"201D01.8"
60388;1;2.00;"*";"201D01.8"
60389;1;2.00;"*";"201D01.8"
60377;1;2.00;"*";"201D01.8"
60382;1;2.00;"*";"201D01.8"
60383;1;2.00;"*";"201D01.8"
62360;1;2.00;"*";"201D01.2"
62373;1;2.00;"*";"201D01.2"
62375;1;2.00;"*";"201D01.2"
62376;1;2.00;"*";"201D01.2"
62378;1;2.00;"*";"201D01.2"
62379;1;2.00;"*";"201D01.2"
62381;1;2.00;"*";"201D01.2"
62382;1;2.00;"*";"201D01.2"
62384;1;2.00;"*";"201D01.2"
62385;1;2.00;"*";"201D01.2"
62460;1;2.00;"*";"201D01.2"
62461;1;2.00;"*";"201D01.2"
62361;1;2.00;"*";"201D01.2"
62363;1;2.00;"*";"201D01.2"
62364;1;2.00;"*";"201D01.2"
62366;1;2.00;"*";"201D01.2"
62367;1;2.00;"*";"201D01.2"
62369;1;2.00;"*";"201D01.2"
62370;1;2.00;"*";"201D01.2"
62372;1;2.00;"*";"201D01.2"
78266;1;2.00;"*";"201D01.8"
64498;1;2.00;"*";"201D01.8"
64498;2;1.00;"*";"201D04.1"
64499;1;2.00;"*";"201D01.8"
64499;2;1.00;"*";"201D04.1"
64500;1;2.00;"*";"201D01.8"
64500;2;1.00;"*";"201D04.1"
64501;1;2.00;"*";"201D01.8"
64501;2;1.00;"*";"201D04.1"
64502;1;2.00;"*";"201D01.8"
64502;2;1.00;"*";"201D04.1"
64503;1;2.00;"*";"201D01.8"
64503;2;1.00;"*";"201D04.1"
64504;1;2.00;"*";"201D01.8"
64504;2;1.00;"*";"201D04.1"
64505;1;2.00;"*";"201D01.8"
64505;2;1.00;"*";"201D04.1"
78268;1;2.00;"*";"201D01.8"
78269;1;2.00;"*";"201D01.8"
78270;1;2.00;"*";"201D01.8"
78271;1;2.00;"*";"201D01.8"
78272;1;2.00;"*";"201D01.8"
78273;1;2.00;"*";"201D01.8"
78274;1;2.00;"*";"201D01.8"
78275;1;2.00;"*";"201D01.8"
78276;1;2.00;"*";"201D01.8"
78277;1;2.00;"*";"201D01.8"
78278;1;2.00;"*";"201D01.8"
78279;1;2.00;"*";"201D01.8"
78280;1;2.00;"*";"201D01.8"
78281;1;2.00;"*";"201D01.8"
78282;1;2.00;"*";"201D01.8"
78283;1;2.00;"*";"201D01.8"
78284;1;2.00;"*";"201D01.8"
78285;1;2.00;"*";"201D01.8"
78267;1;2.00;"*";"201D01.8"
142738;1;2.00;"*";"201D01.8"
142425;1;1.00;"*";"201D02.5"
142425;2;1.00;"*";"201D04.2"
142426;1;1.00;"*";"201D02.5"
142426;2;1.00;"*";"201D04.2"
142427;1;1.00;"*";"201D02.5"
142427;2;1.00;"*";"201D04.2"
142428;1;1.00;"*";"201D02.5"
142428;2;1.00;"*";"201D04.2"
142429;1;1.00;"*";"201D02.5"
142429;2;1.00;"*";"201D04.2"
142430;1;1.00;"*";"201D02.5"
142430;2;1.00;"*";"201D04.2"
142738;2;1.00;"*";"201D04.1"
142739;1;2.00;"*";"201D01.8"
142739;2;1.00;"*";"201D04.1"
198798;1;2.00;"*";"201D01.8"
144467;1;2.00;"*";"201D01.2"
144468;1;2.00;"*";"201D01.2"
144469;1;2.00;"*";"201D01.2"
144470;1;2.00;"*";"201D01.2"
144471;1;2.00;"*";"201D01.2"
144472;1;2.00;"*";"201D01.2"
144473;1;2.00;"*";"201D01.2"
144474;1;2.00;"*";"201D01.2"
197663;1;2.00;"*";"201D01.8"
197664;1;2.00;"*";"201D01.8"
197665;1;2.00;"*";"201D01.8"
197666;1;2.00;"*";"201D01.8"
197667;1;2.00;"*";"201D01.8"
197668;1;2.00;"*";"201D01.8"
197669;1;2.00;"*";"201D01.8"
197670;1;2.00;"*";"201D01.8"
197671;1;2.00;"*";"201D01.8"
197672;1;2.00;"*";"201D01.8"
197673;1;2.00;"*";"201D01.8"
197674;1;2.00;"*";"201D01.8"
197675;1;2.00;"*";"201D01.8"
197676;1;2.00;"*";"201D01.8"
197677;1;2.00;"*";"201D01.8"
197678;1;2.00;"*";"201D01.8"
197781;1;2.00;"*";"201D01.2"
197782;1;2.00;"*";"201D01.2"
197783;1;2.00;"*";"201D01.2"
197784;1;2.00;"*";"201D01.2"
197785;1;2.00;"*";"201D01.2"
197786;1;2.00;"*";"201D01.2"
197787;1;2.00;"*";"201D01.2"
197788;1;2.00;"*";"201D01.2"
197789;1;2.00;"*";"201D01.2"
197790;1;2.00;"*";"201D01.2"
197791;1;2.00;"*";"201D01.2"
197792;1;2.00;"*";"201D01.2"
197793;1;2.00;"*";"201D01.2"
197794;1;2.00;"*";"201D01.2"
197795;1;2.00;"*";"201D01.2"
197796;1;2.00;"*";"201D01.2"
197832;1;2.00;"*";"201D01.8"
197832;2;1.00;"*";"201D04.1"
197833;1;2.00;"*";"201D01.8"
197833;2;1.00;"*";"201D04.1"
197834;1;2.00;"*";"201D01.8"
197834;2;1.00;"*";"201D04.1"
197835;1;2.00;"*";"201D01.8"
197835;2;1.00;"*";"201D04.1"
197836;1;2.00;"*";"201D01.8"
197836;2;1.00;"*";"201D04.1"
197837;1;2.00;"*";"201D01.8"
197837;2;1.00;"*";"201D04.1"
197839;1;2.00;"*";"201D01.8"
197839;2;1.00;"*";"201D04.1"
197841;1;2.00;"*";"201D01.8"
197841;2;1.00;"*";"201D04.1"
198761;1;2.00;"*";"201D01.8"
198761;2;1.00;"*";"201D04.1"
198770;1;2.00;"*";"201D01.8"
198770;2;1.00;"*";"201D04.1"
198778;1;2.00;"*";"201D01.8"
198778;2;1.00;"*";"201D04.1"
198781;1;2.00;"*";"201D01.8"
198781;2;1.00;"*";"201D04.1"
198798;2;1.00;"*";"201D04.1"
199237;1;2.00;"*";"201D01.8"
199237;2;1.00;"*";"201D04.1"
199238;1;2.00;"*";"201D01.8"
199238;2;1.00;"*";"201D04.1"
199239;1;2.00;"*";"201D01.8"
199239;2;1.00;"*";"201D04.1"
199241;1;2.00;"*";"201D01.8"
199241;2;1.00;"*";"201D04.1"
199242;1;2.00;"*";"201D01.8"
199242;2;1.00;"*";"201D04.1"
199243;1;2.00;"*";"201D01.8"
199243;2;1.00;"*";"201D04.1"
199244;1;2.00;"*";"201D01.8"
199244;2;1.00;"*";"201D04.1"
199245;1;2.00;"*";"201D01.8"
199245;2;1.00;"*";"201D04.1"
199246;1;2.00;"*";"201D01.8"
199246;2;1.00;"*";"201D04.1"
199247;1;2.00;"*";"201D01.8"
199247;2;1.00;"*";"201D04.1"
199248;1;2.00;"*";"201D01.8"
199248;2;1.00;"*";"201D04.1"
224853;1;2.00;"*";"201D01.2"
224986;1;2.00;"*";"201D01.2"
224890;1;2.00;"*";"201D01.2"
225047;1;2.00;"*";"201D01.2"
224927;1;2.00;"*";"201D01.2"
224940;1;2.00;"*";"201D01.2"
225325;1;2.00;"*";"201D01.2"
225366;1;2.00;"*";"201D01.2"
225159;1;2.00;"*";"201D01.2"
225490;1;2.00;"*";"201D01.2"
225550;1;2.00;"*";"201D01.2"
225886;1;2.00;"*";"201D01.2"
226039;1;2.00;"*";"201D01.2"
225763;1;2.00;"*";"201D01.2"
225773;1;2.00;"*";"201D01.2"
226096;1;2.00;"*";"201D01.2"
358385;1;2.00;"*";"201D01.8"
358297;1;2.00;"*";"201D01.2"
358298;1;2.00;"*";"201D01.2"
358299;1;2.00;"*";"201D01.2"
358300;1;2.00;"*";"201D01.2"
358301;1;2.00;"*";"201D01.2"
358302;1;2.00;"*";"201D01.2"
358303;1;2.00;"*";"201D01.2"
358304;1;2.00;"*";"201D01.2"
358313;1;2.00;"*";"201D01.2"
358314;1;2.00;"*";"201D01.2"
358315;1;2.00;"*";"201D01.2"
358316;1;2.00;"*";"201D01.2"
358317;1;2.00;"*";"201D01.2"
358318;1;2.00;"*";"201D01.2"
358319;1;2.00;"*";"201D01.2"
358320;1;2.00;"*";"201D01.2"
358389;1;2.00;"*";"201D01.8"
358390;1;2.00;"*";"201D01.8"
358391;1;2.00;"*";"201D01.8"
358392;1;2.00;"*";"201D01.8"
358401;1;2.00;"*";"201D01.8"
358402;1;2.00;"*";"201D01.8"
358403;1;2.00;"*";"201D01.8"
358404;1;2.00;"*";"201D01.8"
358405;1;2.00;"*";"201D01.8"
358406;1;2.00;"*";"201D01.8"
358407;1;2.00;"*";"201D01.8"
358408;1;2.00;"*";"201D01.8"
358386;1;2.00;"*";"201D01.8"
358387;1;2.00;"*";"201D01.8"
358388;1;2.00;"*";"201D01.8"
358473;1;2.00;"*";"201D01.8"
358473;2;1.00;"*";"201D04.1"
358474;1;2.00;"*";"201D01.8"
358474;2;1.00;"*";"201D04.1"
358475;1;2.00;"*";"201D01.8"
358475;2;1.00;"*";"201D04.1"
358476;1;2.00;"*";"201D01.8"
358476;2;1.00;"*";"201D04.1"
358477;1;2.00;"*";"201D01.8"
358477;2;1.00;"*";"201D04.1"
358478;1;2.00;"*";"201D01.8"
358478;2;1.00;"*";"201D04.1"
358479;1;2.00;"*";"201D01.8"
358479;2;1.00;"*";"201D04.1"
358480;1;2.00;"*";"201D01.8"
358480;2;1.00;"*";"201D04.1"
359255;1;2.00;"*";"201D01.2"
359256;1;2.00;"*";"201D01.2"
359257;1;2.00;"*";"201D01.2"
359258;1;2.00;"*";"201D01.2"
359259;1;2.00;"*";"201D01.2"
359260;1;2.00;"*";"201D01.2"
438830;1;2.00;"*";"201D01.2"
359253;1;2.00;"*";"201D01.2"
359254;1;2.00;"*";"201D01.2"
372250;1;2.00;"*";"201D01.2"
372251;1;2.00;"*";"201D01.2"
372252;1;2.00;"*";"201D01.2"
372253;1;2.00;"*";"201D01.2"
372254;1;2.00;"*";"201D01.2"
372255;1;2.00;"*";"201D01.2"
372256;1;2.00;"*";"201D01.2"
372257;1;2.00;"*";"201D01.2"
438831;1;2.00;"*";"201D01.2"
438832;1;2.00;"*";"201D01.2"
438833;1;2.00;"*";"201D01.2"
438834;1;2.00;"*";"201D01.2"
438835;1;2.00;"*";"201D01.2"
438836;1;2.00;"*";"201D01.2"
438837;1;2.00;"*";"201D01.2"
438838;1;2.00;"*";"201D01.2"
438839;1;2.00;"*";"201D01.2"
438840;1;2.00;"*";"201D01.2"
438841;1;2.00;"*";"201D01.2"
438842;1;2.00;"*";"201D01.2"
438843;1;2.00;"*";"201D01.2"
438844;1;2.00;"*";"201D01.2"
438845;1;2.00;"*";"201D01.2"
450659;1;2.00;"*";"201D01.8"
450663;1;2.00;"*";"201D01.8"
450664;1;2.00;"*";"201D01.8"
450665;1;2.00;"*";"201D01.8"
450666;1;2.00;"*";"201D01.8"
450660;1;2.00;"*";"201D01.8"
