<svg xmlns="http://www.w3.org/2000/svg" xmlns:xlink="http://www.w3.org/1999/xlink" width="68" height="68" viewBox="0 0 68 68">
  <defs>
    <filter id="Rectangle_3" x="0" y="0" width="68" height="68" filterUnits="userSpaceOnUse">
      <feOffset dy="3" input="SourceAlpha"/>
      <feGaussianBlur stdDeviation="3" result="blur"/>
      <feFlood flood-opacity="0.161"/>
      <feComposite operator="in" in2="blur"/>
      <feComposite in="SourceGraphic"/>
    </filter>
  </defs>
  <g id="Groupe_757" data-name="Groupe 757" transform="translate(-810 -739)">
    <g transform="matrix(1, 0, 0, 1, 810, 739)" filter="url(#Rectangle_3)">
      <rect id="Rectangle_3-2" data-name="Rectangle 3" width="50" height="50" rx="3" transform="translate(9 6)" fill="#fff"/>
    </g>
    <path id="facebook-f" d="M34.881,13.477l.665-4.336h-4.16V6.327A2.168,2.168,0,0,1,33.83,3.985h1.891V.293A23.065,23.065,0,0,0,32.364,0C28.938,0,26.7,2.077,26.7,5.836v3.3H22.89v4.336H26.7V23.959h4.687V13.477Z" transform="translate(815.11 758)" fill="#e3454e"/>
  </g>
</svg>
