<svg id="playlist_add_check-24px" xmlns="http://www.w3.org/2000/svg" width="24" height="24" viewBox="0 0 24 24">
  <g id="Groupe_49" data-name="Groupe 49">
    <rect id="Rectangle_201" data-name="Rectangle 201" width="24" height="24" fill="none"/>
  </g>
  <g id="Groupe_52" data-name="Groupe 52">
    <g id="Groupe_51" data-name="Groupe 51">
      <g id="Groupe_50" data-name="Groupe 50">
        <path id="Tracé_20" data-name="Tracé 20" d="M14,10H2v2H14Zm0-4H2V8H14ZM2,16h8V14H2Zm19.5-4.5L23,13l-6.99,7L11.5,15.5,13,14l3.01,3Z" fill="#fff"/>
      </g>
    </g>
  </g>
</svg>
