<svg id="delete-24px" xmlns="http://www.w3.org/2000/svg" width="24" height="24" viewBox="0 0 24 24">
  <path id="Tracé_2851" data-name="Tracé 2851" d="M0,0H24V24H0Z" fill="none"/>
  <g id="Groupe_13166" data-name="Groupe 13166" transform="translate(3 4.824)">
    <path id="Tracé_2876" data-name="Tracé 2876" d="M206.063,71.652h0a.968.968,0,0,1,.978.944.289.289,0,0,0,.292.282h7.4a.288.288,0,0,0,.293-.28V62.641a.289.289,0,0,0-.292-.281h-7.4a.289.289,0,0,0-.293.281.981.981,0,0,1-1.961,0,2.216,2.216,0,0,1,2.253-2.175h7.4a2.217,2.217,0,0,1,2.245,2.17V72.6a2.214,2.214,0,0,1-2.247,2.17h-7.4a2.216,2.216,0,0,1-2.253-2.17A.968.968,0,0,1,206.063,71.652Z" transform="translate(-200.243 -60.467)" fill="#424242"/>
    <path id="Tracé_2877" data-name="Tracé 2877" d="M220.179,66.837l-3.032-3.479h0a.816.816,0,0,0-.6-.291h-.013a.8.8,0,0,0-.606.288,1.106,1.106,0,0,0,0,1.419l1.64,1.854h-8.092a1.005,1.005,0,0,0,0,1.991h8.119l-1.606,1.852A1.125,1.125,0,0,0,216,71.895a.832.832,0,0,0,.594.271h.013a.8.8,0,0,0,.606-.291L220.1,68.56A1.354,1.354,0,0,0,220.179,66.837Z" transform="translate(-208.604 -60.467)" fill="#424242"/>
  </g>
</svg>
