{
  "routingKey": "traitements",
  "index": "traitement",
  "mappingProperties": {
    "id": {
      "type": "keyword"
    },
    "code": {
      "type": "keyword"
    },
    "nom": {
      "type": "keyword"
    },
    "idGroupements": {
      "type": "keyword"
    },
    "module": {
      "properties": {
        "id": {
          "type": "keyword"
        },
        "code": {
          "type": "keyword"
        },
        "nom": {
          "type": "keyword"
        }
      }
    },
    "roles": {
      "properties": {
        "id": {
          "type": "keyword"
        },
        "code": {
          "type": "keyword"
        },
        "nom": {
          "type": "keyword"
        }
      }
    },
    "dateCreation": {
      "type": "keyword"
    },
    "dateModification": {
      "type": "keyword"
    }
  },
  "instances": 1,
  "query": "query traitement($id: ID!) { traitement(id: $id) { id code nom idGroupements module { id code nom } roles { id code nom } dateCreation dateModification } }",
  "dataKey": "traitement"
}
