102;600010
102;600020
102;600065
102;600085
102;600101
102;600105
102;600106
102;600112
102;600128
102;600129
102;600138
102;600160
102;600191
102;600195
102;600199
102;600269
102;600288
102;600316
102;600328
102;600332
102;600333
102;600340
102;600440
102;600454
102;600477
102;600509
102;600551
102;600553
102;600559
102;600563
102;600572
102;600633
102;600658
102;600665
102;600678
102;600708
102;600733
102;600741
102;600746
102;600752
102;600772
102;600780
102;600788
102;600800
102;600802
102;600843
102;600845
102;600885
102;600894
102;600897
102;600900
102;600907
102;600939
102;600945
102;600948
102;600949
102;600966
102;600993
102;610023
102;610024
102;610030
102;610047
102;610052
102;610070
102;610076
102;610081
102;610177
102;610181
102;610212
102;610220
102;610221
102;610223
102;610227
102;610239
102;610241
102;610242
102;610291
102;610300
102;610310
102;610371
102;610400
102;610422
102;610456
102;610476
102;610478
102;610573
102;610584
102;610585
102;610625
102;610632
102;610634
102;610651
102;610652
102;610654
102;610665
102;610668
102;610672
102;610685
102;610708
102;610727
102;610747
102;610779
102;610800
102;610818
102;610831
102;610883
102;610904
102;610910
102;610914
102;610924
102;610941
102;610944
102;610964
102;610993
102;617032
102;617037
102;617059
102;617126
102;617140
102;617144
102;617230
102;617264
102;617294
102;617311
102;617335
102;617342
102;617352
102;617355
102;617711
102;617720
102;617736
102;617747
102;617754
102;617771
102;617795
102;617801
102;617802
102;617803
102;617833
103;600056
103;600133
103;600135
103;600138
103;600228
103;600420
103;600554
103;600559
103;600582
103;600612
103;600661
103;600665
103;600733
103;600736
103;600751
103;600788
103;600796
103;600800
103;600806
103;600845
103;600860
103;600899
103;600900
103;600902
103;600945
103;600975
103;600991
103;610011
103;610072
103;610086
103;610135
103;610146
103;610161
103;610177
103;610180
103;610192
103;610212
103;610222
103;610227
103;610231
103;610298
103;610352
103;610372
103;610395
103;610396
103;610399
103;610432
103;610451
103;610458
103;610459
103;610468
103;610474
103;610478
103;610482
103;610573
103;610653
103;610654
103;610668
103;610710
103;610711
103;610729
103;610752
103;610759
103;610770
103;610863
103;610883
103;610926
103;610927
103;610928
103;610941
103;610944
103;610975
103;617002
103;617108
103;617144
103;617200
103;617206
103;617217
103;617230
103;617236
103;617694
103;617707
103;617710
103;617714
103;617720
103;617721
103;617739
103;617778
103;617794
103;617802
103;617809
103;617833
104;600013
104;600015
104;600020
104;600038
104;600050
104;600065
104;600072
104;600082
104;600083
104;600091
104;600110
104;600121
104;600133
104;600137
104;600144
104;600148
104;600159
104;600166
104;600176
104;600194
104;600206
104;600225
104;600288
104;600324
104;600328
104;600332
104;600337
104;600420
104;600470
104;600478
104;600509
104;600522
104;600553
104;600558
104;600559
104;600572
104;600582
104;600597
104;600612
104;600618
104;600644
104;600646
104;600658
104;600733
104;600734
104;600741
104;600751
104;600752
104;600772
104;600780
104;600800
104;600806
104;600819
104;600821
104;600843
104;600856
104;600868
104;600884
104;600885
104;600893
104;600897
104;600899
104;600931
104;600945
104;600953
104;600954
104;600957
104;600960
104;600984
104;600993
104;610007
104;610016
104;610030
104;610052
104;610057
104;610069
104;610072
104;610073
104;610080
104;610081
104;610083
104;610086
104;610119
104;610128
104;610135
104;610136
104;610153
104;610180
104;610181
104;610192
104;610194
104;610220
104;610225
104;610226
104;610227
104;610231
104;610239
104;610249
104;610322
104;610339
104;610375
104;610400
104;610451
104;610456
104;610478
104;610482
104;610568
104;610573
104;610585
104;610627
104;610630
104;610634
104;610647
104;610652
104;610660
104;610685
104;610698
104;610708
104;610710
104;610727
104;610752
104;610770
104;610800
104;610810
104;610812
104;610829
104;610831
104;610862
104;610883
104;610892
104;610900
104;610910
104;610914
104;610918
104;610924
104;610927
104;610928
104;610944
104;610993
104;617002
104;617029
104;617032
104;617037
104;617059
104;617123
104;617138
104;617144
104;617169
104;617190
104;617217
104;617227
104;617230
104;617231
104;617244
104;617261
104;617280
104;617284
104;617294
104;617303
104;617311
104;617313
104;617327
104;617328
104;617342
104;617352
104;617355
104;617739
104;617754
104;617761
104;617763
104;617767
104;617769
104;617773
104;617778
104;617782
104;617786
104;617789
104;617800
104;617801
104;617802
104;617809
104;617812
104;617813
104;617818
104;617834
104;617843
105;600060
105;600225
105;600470
105;600478
105;600494
105;600572
105;600573
105;600741
105;600800
105;600806
105;600819
105;600899
105;610069
105;610075
105;610081
105;610153
105;610191
105;610194
105;610242
105;610456
105;610547
105;610568
105;610609
105;610647
105;610660
105;610779
105;610947
105;617002
105;617021
105;617114
105;617123
105;617190
105;617200
105;617206
105;617244
105;617264
105;617269
105;617278
105;617693
105;617739
105;617761
105;617766
105;617767
105;617769
105;617782
105;617794
105;617800
105;617813
105;617829
106;600020
106;600032
106;600072
106;600084
106;600121
106;600124
106;600133
106;600135
106;600138
106;600146
106;600288
106;600316
106;600360
106;600415
106;600420
106;600425
106;600554
106;600582
106;600589
106;600604
106;600606
106;600644
106;600661
106;600708
106;600732
106;600733
106;600734
106;600736
106;600751
106;600752
106;600796
106;600806
106;600845
106;600893
106;600899
106;600900
106;600902
106;600966
106;600975
106;600991
106;610011
106;610023
106;610058
106;610072
106;610086
106;610153
106;610161
106;610180
106;610194
106;610203
106;610212
106;610221
106;610222
106;610227
106;610231
106;610291
106;610298
106;610352
106;610372
106;610395
106;610432
106;610451
106;610452
106;610474
106;610478
106;610482
106;610573
106;610579
106;610585
106;610654
106;610668
106;610710
106;610711
106;610729
106;610730
106;610731
106;610748
106;610752
106;610759
106;610770
106;610798
106;610844
106;610883
106;610904
106;610914
106;610927
106;610928
106;610941
106;610944
106;610964
106;610975
106;610993
106;617002
106;617108
106;617123
106;617200
106;617217
106;617230
106;617707
106;617710
106;617714
106;617727
106;617754
106;617771
106;617802
106;617809
106;617818
106;617834
107;600557
107;610947
108;600032
108;600052
108;600078
108;600082
108;600099
108;600104
108;600105
108;600133
108;600135
108;600138
108;600144
108;600172
108;600194
108;600213
108;600316
108;600332
108;600360
108;600463
108;600478
108;600525
108;600563
108;600589
108;600678
108;600688
108;600708
108;600733
108;600772
108;600788
108;600800
108;600802
108;600821
108;600843
108;600868
108;600880
108;600887
108;600923
108;600949
108;600954
108;600965
108;600980
108;600991
108;610023
108;610024
108;610052
108;610057
108;610072
108;610075
108;610081
108;610086
108;610119
108;610128
108;610135
108;610136
108;610146
108;610149
108;610161
108;610181
108;610192
108;610234
108;610242
108;610254
108;610298
108;610300
108;610379
108;610399
108;610419
108;610432
108;610456
108;610459
108;610460
108;610476
108;610568
108;610573
108;610627
108;610653
108;610660
108;610665
108;610710
108;610730
108;610733
108;610741
108;610795
108;610800
108;610802
108;610816
108;610862
108;610883
108;610887
108;610900
108;610925
108;610941
108;610947
108;617144
108;617169
108;617177
108;617224
108;617342
108;617711
108;617720
108;617806
108;617810
109;600072
109;600081
109;600084
109;600135
109;600316
109;600360
109;600415
109;600559
109;600574
109;600582
109;600661
109;600665
109;600688
109;600708
109;600788
109;600800
109;600806
109;600845
109;600860
109;600899
109;600900
109;600991
109;610058
109;610153
109;610177
109;610194
109;610203
109;610212
109;610352
109;610432
109;610451
109;610452
109;610474
109;610482
109;610573
109;610579
109;610584
109;610585
109;610589
109;610710
109;610711
109;610731
109;610752
109;610792
109;610810
109;610829
109;610883
109;610926
109;610941
109;610947
109;610993
109;617002
109;617144
109;617224
109;617707
109;617714
109;617727
109;617794
109;617802
109;617834
110;600266
110;600574
110;610451
110;610573
110;610651
110;610727
110;610750
110;610862
110;610883
110;610918
111;600072
111;600574
111;600604
111;600606
111;610023
111;610058
111;610291
111;610408
111;610585
111;610698
111;610747
111;610904
111;610914
111;610924
111;617224
112;600084
112;600124
112;600604
112;600661
112;600732
112;600751
112;600796
112;600806
112;600975
112;600991
112;610023
112;610212
112;610291
112;610408
112;610452
112;610468
112;610474
112;610482
112;610573
112;610710
112;610729
112;610731
112;610863
112;610947
112;610993
112;617048
112;617714
112;617754
113;600038
113;600072
113;600081
113;600106
113;600121
113;600159
113;600228
113;600264
113;600296
113;600337
113;600420
113;600524
113;600633
113;600734
113;600746
113;600751
113;600752
113;600858
113;600899
113;600931
113;610007
113;610047
113;610153
113;610167
113;610179
113;610194
113;610241
113;610291
113;610317
113;610322
113;610345
113;610372
113;610406
113;610423
113;610461
113;610463
113;610474
113;610478
113;610482
113;610609
113;610672
113;610708
113;610724
113;610727
113;610759
113;610769
113;610918
113;610928
113;610944
113;610964
113;617002
113;617029
113;617059
113;617123
113;617126
113;617217
113;617227
113;617254
113;617313
113;617335
113;617352
113;617691
113;617693
113;617714
113;617736
113;617739
113;617759
113;617773
113;617776
113;617782
113;617786
113;617789
113;617843
113;617999
114;600020
114;600032
114;600056
114;600081
114;600124
114;600133
114;600135
114;600146
114;600228
114;600248
114;600269
114;600316
114;600420
114;600425
114;600554
114;600589
114;600604
114;600644
114;600665
114;600732
114;600733
114;600734
114;600736
114;600751
114;600806
114;600845
114;600860
114;600900
114;600902
114;600966
114;600991
114;610011
114;610075
114;610076
114;610086
114;610161
114;610177
114;610181
114;610192
114;610212
114;610221
114;610227
114;610291
114;610298
114;610300
114;610371
114;610379
114;610396
114;610451
114;610452
114;610459
114;610476
114;610478
114;610482
114;610573
114;610579
114;610584
114;610589
114;610634
114;610637
114;610653
114;610654
114;610698
114;610710
114;610729
114;610731
114;610759
114;610770
114;610792
114;610798
114;610844
114;610863
114;610883
114;610926
114;610927
114;610928
114;610944
114;610964
114;610975
114;617002
114;617037
114;617048
114;617108
114;617123
114;617227
114;617236
114;617694
114;617710
114;617714
114;617720
114;617727
114;617754
114;617771
114;617778
114;617786
114;617794
114;617809
114;617812
114;617833
114;617834
115;600557
115;600993
115;610408
115;610458
115;610730
115;610863
115;617721
116;600013
116;600084
116;600110
116;600111
116;600129
116;600205
116;600332
116;600415
116;600420
116;600457
116;600499
116;600572
116;600658
116;600819
116;600860
116;600903
116;600939
116;600975
116;600980
116;610076
116;610176
116;610179
116;610202
116;610204
116;610296
116;610352
116;610371
116;610422
116;610456
116;610547
116;610568
116;610573
116;610609
116;610634
116;610636
116;610647
116;610652
116;610654
116;610769
116;610792
116;610864
116;617048
116;617123
116;617163
116;617200
116;617217
116;617224
116;617244
116;617261
116;617275
116;617280
116;617313
116;617342
116;617708
116;617759
116;617771
116;617795
116;617803
116;617999
117;617830
118;600123
118;600228
118;600248
118;600264
118;600269
118;600316
118;600360
118;600425
118;600463
118;600509
118;600514
118;600551
118;600554
118;600574
118;600622
118;600683
118;600798
118;600861
118;600865
118;600870
118;600885
118;600893
118;600894
118;600897
118;600954
118;600977
118;600984
118;610058
118;610073
118;610220
118;610223
118;610234
118;610249
118;610300
118;610395
118;610459
118;610546
118;610550
118;610584
118;610668
118;610685
118;610710
118;610737
118;610759
118;610795
118;610798
118;610802
118;610818
118;610904
118;610928
118;610941
118;610944
118;610947
118;617144
118;617711
118;617720
118;617747
118;617773
118;617786
118;617810
119;600557
119;600612
119;610146
119;610371
119;610468
119;610476
119;610685
119;610810
120;600101
120;600135
120;600316
120;600477
120;600497
120;600563
120;600612
120;600644
120;600708
120;600722
120;600734
120;600736
120;600788
120;600831
120;600845
120;600856
120;600975
120;600991
120;600993
120;610007
120;610023
120;610028
120;610146
120;610226
120;610242
120;610298
120;610422
120;610573
120;610634
120;610637
120;610698
120;610810
120;610812
120;610844
120;610904
120;610925
120;617059
120;617126
120;617144
120;617261
120;617294
120;617720
120;617771
120;617773
120;617789
120;617818
121;600010
121;600032
121;600038
121;600050
121;600051
121;600052
121;600060
121;600065
121;600074
121;600077
121;600078
121;600079
121;600083
121;600084
121;600085
121;600088
121;600091
121;600096
121;600099
121;600100
121;600101
121;600105
121;600106
121;600110
121;600111
121;600112
121;600113
121;600117
121;600120
121;600121
121;600123
121;600124
121;600125
121;600127
121;600128
121;600129
121;600135
121;600137
121;600138
121;600144
121;600148
121;600152
121;600154
121;600159
121;600160
121;600166
121;600169
121;600172
121;600173
121;600175
121;600176
121;600177
121;600178
121;600182
121;600185
121;600189
121;600191
121;600194
121;600195
121;600198
121;600204
121;600205
121;600206
121;600210
121;600212
121;600225
121;600228
121;600248
121;600264
121;600267
121;600296
121;600324
121;600328
121;600332
121;600333
121;600337
121;600415
121;600422
121;600425
121;600454
121;600457
121;600463
121;600464
121;600470
121;600476
121;600478
121;600494
121;600497
121;600499
121;600509
121;600514
121;600522
121;600524
121;600525
121;600551
121;600553
121;600557
121;600558
121;600559
121;600570
121;600572
121;600588
121;600589
121;600597
121;600606
121;600618
121;600646
121;600658
121;600665
121;600678
121;600683
121;600685
121;600722
121;600733
121;600736
121;600741
121;600746
121;600748
121;600749
121;600751
121;600752
121;600772
121;600780
121;600789
121;600796
121;600798
121;600800
121;600802
121;600804
121;600819
121;600821
121;600831
121;600841
121;600843
121;600848
121;600858
121;600860
121;600861
121;600865
121;600868
121;600872
121;600880
121;600882
121;600884
121;600887
121;600893
121;600897
121;600900
121;600902
121;600903
121;600907
121;600923
121;600931
121;600939
121;600945
121;600949
121;600953
121;600954
121;600957
121;600960
121;600966
121;600975
121;600977
121;600980
121;600991
121;600993
121;610006
121;610007
121;610011
121;610016
121;610024
121;610028
121;610042
121;610047
121;610048
121;610052
121;610057
121;610058
121;610070
121;610073
121;610075
121;610077
121;610080
121;610081
121;610083
121;610086
121;610119
121;610127
121;610128
121;610135
121;610136
121;610147
121;610149
121;610153
121;610161
121;610167
121;610176
121;610179
121;610180
121;610181
121;610188
121;610191
121;610192
121;610194
121;610196
121;610202
121;610204
121;610212
121;610220
121;610221
121;610222
121;610225
121;610226
121;610227
121;610231
121;610232
121;610239
121;610240
121;610242
121;610249
121;610254
121;610269
121;610296
121;610306
121;610317
121;610318
121;610322
121;610339
121;610345
121;610352
121;610371
121;610372
121;610375
121;610391
121;610396
121;610399
121;610400
121;610406
121;610410
121;610419
121;610422
121;610429
121;610432
121;610452
121;610456
121;610458
121;610460
121;610461
121;610474
121;610481
121;610482
121;610546
121;610547
121;610568
121;610571
121;610573
121;610579
121;610582
121;610584
121;610585
121;610589
121;610609
121;610614
121;610619
121;610625
121;610627
121;610630
121;610632
121;610636
121;610637
121;610647
121;610648
121;610652
121;610653
121;610654
121;610660
121;610662
121;610665
121;610668
121;610698
121;610708
121;610709
121;610710
121;610712
121;610724
121;610727
121;610731
121;610733
121;610737
121;610743
121;610746
121;610748
121;610752
121;610769
121;610770
121;610779
121;610784
121;610795
121;610800
121;610812
121;610829
121;610831
121;610844
121;610853
121;610862
121;610864
121;610883
121;610887
121;610892
121;610903
121;610904
121;610916
121;610918
121;610926
121;610944
121;610951
121;610964
121;610979
121;617016
121;617021
121;617029
121;617032
121;617037
121;617048
121;617059
121;617087
121;617108
121;617114
121;617123
121;617138
121;617140
121;617144
121;617163
121;617169
121;617200
121;617205
121;617206
121;617217
121;617224
121;617227
121;617230
121;617231
121;617236
121;617240
121;617254
121;617261
121;617264
121;617269
121;617275
121;617278
121;617284
121;617294
121;617308
121;617311
121;617313
121;617327
121;617328
121;617335
121;617342
121;617352
121;617355
121;617691
121;617693
121;617694
121;617707
121;617708
121;617709
121;617710
121;617719
121;617721
121;617727
121;617736
121;617737
121;617739
121;617749
121;617752
121;617753
121;617754
121;617761
121;617766
121;617767
121;617769
121;617771
121;617773
121;617776
121;617778
121;617786
121;617789
121;617794
121;617800
121;617801
121;617802
121;617803
121;617806
121;617809
121;617810
121;617827
121;617829
121;617830
121;617833
121;617834
121;617843
121;617999
122;600013
122;600015
122;600032
122;600050
122;600065
122;600072
122;600082
122;600096
122;600099
122;600101
122;600124
122;600128
122;600133
122;600137
122;600138
122;600169
122;600175
122;600191
122;600194
122;600316
122;600324
122;600337
122;600420
122;600470
122;600477
122;600497
122;600509
122;600554
122;600557
122;600559
122;600589
122;600612
122;600644
122;600741
122;600752
122;600780
122;600856
122;600861
122;600885
122;600887
122;600893
122;600899
122;600907
122;600945
122;600948
122;600949
122;600980
122;600993
122;610007
122;610023
122;610030
122;610047
122;610072
122;610075
122;610076
122;610080
122;610086
122;610119
122;610146
122;610149
122;610177
122;610212
122;610225
122;610227
122;610239
122;610241
122;610296
122;610298
122;610300
122;610371
122;610375
122;610400
122;610422
122;610429
122;610432
122;610451
122;610452
122;610474
122;610478
122;610550
122;610568
122;610573
122;610627
122;610630
122;610632
122;610654
122;610660
122;610665
122;610698
122;610708
122;610730
122;610737
122;610741
122;610769
122;610802
122;610810
122;610853
122;610862
122;610903
122;610910
122;610918
122;610924
122;610925
122;610927
122;610928
122;610941
122;610947
122;610964
122;617029
122;617048
122;617059
122;617144
122;617200
122;617217
122;617224
122;617230
122;617244
122;617280
122;617303
122;617311
122;617327
122;617711
122;617720
122;617727
122;617747
122;617749
122;617773
122;617794
122;617834
122;617843
123;600104
123;600225
123;600741
123;600788
123;610242
123;610712
123;617002
123;617230
123;617352
123;617709
123;617736
123;617739
124;610146
125;600734
125;617818
126;600146
126;600269
126;600604
126;600612
126;610573
126;610731
126;610904
127;600015
127;600056
127;600081
127;600124
127;600133
127;600228
127;600288
127;600420
127;600497
127;600563
127;600582
127;600589
127;600685
127;600688
127;600708
127;600788
127;600804
127;600806
127;600821
127;600845
127;600899
127;600991
127;610030
127;610069
127;610080
127;610146
127;610147
127;610153
127;610167
127;610180
127;610212
127;610226
127;610242
127;610249
127;610300
127;610310
127;610371
127;610474
127;610476
127;610478
127;610482
127;610573
127;610579
127;610653
127;610665
127;610710
127;610730
127;610731
127;610752
127;610798
127;610810
127;610816
127;610864
127;610924
127;610925
127;610993
127;617244
127;617709
127;617714
127;617739
127;617771
128;600133
128;600228
128;600248
128;600288
128;600557
128;600589
128;600661
128;600732
128;600736
128;600751
128;600752
128;600788
128;600893
128;600902
128;600945
128;600966
128;600991
128;600993
128;610023
128;610072
128;610075
128;610135
128;610153
128;610180
128;610181
128;610212
128;610222
128;610231
128;610298
128;610300
128;610352
128;610372
128;610379
128;610396
128;610399
128;610451
128;610452
128;610459
128;610474
128;610482
128;610584
128;610589
128;610634
128;610637
128;610653
128;610668
128;610698
128;610710
128;610752
128;610810
128;610829
128;610941
128;610947
128;610979
128;617002
128;617037
128;617200
128;617206
128;617217
128;617227
128;617236
128;617694
128;617714
128;617778
128;617786
129;600083
129;600114
129;600146
129;600337
129;600470
129;600554
129;600800
129;600806
129;600899
129;600907
129;600954
129;610052
129;610128
129;610136
129;610149
129;610180
129;610212
129;610221
129;610408
129;610482
129;610627
129;610630
129;610651
129;610727
129;610730
129;610747
129;610818
129;610964
129;617169
129;617753
129;617767
130;600020
130;600083
130;600176
130;600185
130;600189
130;600194
130;600206
130;600266
130;600316
130;600522
130;600899
130;600931
130;600991
130;610028
130;610030
130;610047
130;610083
130;610177
130;610226
130;610310
130;610422
130;610456
130;610463
130;610685
130;610698
130;610844
130;610993
130;617037
130;617048
130;617217
130;617261
130;617693
130;617999
131;600050
131;600082
131;600133
131;600332
131;600463
131;600478
131;600522
131;600557
131;600589
131;600678
131;600688
131;600772
131;600802
131;600813
131;600860
131;600868
131;600923
131;600945
131;600949
131;600954
131;600965
131;600980
131;610023
131;610024
131;610052
131;610057
131;610072
131;610086
131;610128
131;610135
131;610136
131;610146
131;610161
131;610181
131;610192
131;610222
131;610234
131;610254
131;610306
131;610379
131;610399
131;610419
131;610432
131;610636
131;610651
131;610653
131;610660
131;610672
131;610710
131;610712
131;610748
131;610795
131;610800
131;610802
131;610862
131;610883
131;610900
131;610941
131;610947
131;617051
131;617169
131;617224
131;617280
131;617342
131;617352
131;617720
131;617727
131;617754
131;617801
132;610585
133;600146
133;600228
133;600266
133;600415
133;600425
133;600604
133;600606
133;600678
133;600688
133;610177
133;610291
133;610379
133;610747
133;610964
134;600010
134;600065
134;600082
134;600099
134;600101
134;600105
134;600144
134;600160
134;600328
134;600509
134;600553
134;600633
134;600772
134;600788
134;600821
134;600893
134;600894
134;600966
134;610023
134;610081
134;610220
134;610221
134;610239
134;610241
134;610291
134;610478
134;610651
134;610708
134;610727
134;610770
134;610818
134;610993
134;617294
134;617720
134;617747
134;617771
134;617800
134;617803
135;600856
135;600993
135;610408
136;600015
136;600020
136;600032
136;600050
136;600056
136;600082
136;600083
136;600096
136;600101
136;600124
136;600125
136;600133
136;600135
136;600173
136;600199
136;600200
136;600325
136;600333
136;600422
136;600454
136;600470
136;600522
136;600553
136;600582
136;600612
136;600722
136;600732
136;600751
136;600772
136;600845
136;600931
136;600953
136;600966
136;600993
136;600997
136;610028
136;610047
136;610075
136;610083
136;610086
136;610188
136;610191
136;610226
136;610237
136;610239
136;610254
136;610298
136;610322
136;610400
136;610406
136;610423
136;610429
136;610432
136;610436
136;610474
136;610476
136;610585
136;610589
136;610627
136;610630
136;610653
136;610698
136;610708
136;610741
136;610752
136;610772
136;610779
136;610975
136;610979
136;610993
136;617108
136;617190
136;617284
136;617327
136;617727
136;617749
136;617769
136;617782
136;617789
136;617809
136;617833
137;600415
137;600582
137;600661
137;600688
137;600752
137;600788
137;600796
137;610153
137;610458
137;610474
137;610685
137;610810
137;610904
137;610914
137;610941
137;610979
137;617224
137;617707
137;617721
138;600032
138;600082
138;600124
138;600572
138;600751
138;600954
138;610181
138;610461
138;610916
138;617114
138;617200
138;617771
138;617782
138;617795
138;617809
138;617843
138;617999
139;600010
139;600051
139;600056
139;600065
139;600074
139;600077
139;600079
139;600081
139;600083
139;600084
139;600085
139;600088
139;600091
139;600099
139;600106
139;600110
139;600113
139;600114
139;600117
139;600120
139;600123
139;600124
139;600125
139;600127
139;600137
139;600144
139;600147
139;600148
139;600152
139;600154
139;600159
139;600160
139;600166
139;600169
139;600172
139;600173
139;600175
139;600176
139;600177
139;600178
139;600182
139;600185
139;600189
139;600191
139;600195
139;600198
139;600199
139;600200
139;600205
139;600225
139;600248
139;600267
139;600269
139;600288
139;600328
139;600415
139;600422
139;600425
139;600457
139;600464
139;600470
139;600494
139;600497
139;600514
139;600551
139;600554
139;600558
139;600572
139;600582
139;600588
139;600604
139;600618
139;600644
139;600658
139;600665
139;600722
139;600731
139;600733
139;600736
139;600746
139;600748
139;600749
139;600780
139;600789
139;600796
139;600806
139;600819
139;600831
139;600841
139;600843
139;600845
139;600848
139;600856
139;600858
139;600861
139;600865
139;600870
139;600872
139;600880
139;600882
139;600884
139;600894
139;600899
139;600904
139;600939
139;600953
139;600957
139;600975
139;600984
139;600993
139;600997
139;610047
139;610048
139;610058
139;610070
139;610076
139;610077
139;610083
139;610176
139;610180
139;610202
139;610203
139;610221
139;610223
139;610225
139;610226
139;610227
139;610231
139;610232
139;610237
139;610240
139;610249
139;610310
139;610339
139;610352
139;610371
139;610372
139;610375
139;610391
139;610395
139;610396
139;610400
139;610408
139;610410
139;610422
139;610429
139;610436
139;610451
139;610452
139;610458
139;610463
139;610481
139;610546
139;610547
139;610584
139;610614
139;610625
139;610632
139;610637
139;610647
139;610652
139;610662
139;610685
139;610711
139;610724
139;610729
139;610741
139;610746
139;610747
139;610752
139;610770
139;610779
139;610784
139;610798
139;610812
139;610831
139;610863
139;610864
139;610888
139;610892
139;610903
139;610914
139;610916
139;610926
139;610975
139;610993
139;617016
139;617021
139;617032
139;617048
139;617087
139;617114
139;617140
139;617163
139;617190
139;617200
139;617205
139;617206
139;617227
139;617230
139;617231
139;617236
139;617244
139;617261
139;617264
139;617275
139;617284
139;617311
139;617328
139;617355
139;617691
139;617693
139;617694
139;617707
139;617708
139;617719
139;617721
139;617747
139;617749
139;617752
139;617753
139;617761
139;617763
139;617771
139;617778
139;617786
139;617795
139;617800
139;617802
139;617803
139;617809
139;617810
139;617812
139;617813
139;617818
139;617827
139;617833
139;617834
140;600100
140;600266
140;600324
140;600476
140;600477
140;600606
140;600661
140;600685
140;600708
140;610093
140;610113
140;610188
140;610550
140;610630
140;610648
140;610709
140;610772
140;610810
140;610829
140;610844
140;610925
140;610927
140;610951
140;610952
140;617711
141;600101
141;600135
141;600316
141;600477
141;600497
141;600563
141;600612
141;600644
141;600708
141;600722
141;600734
141;600736
141;600788
141;600831
141;600845
141;600856
141;600975
141;600991
141;600993
141;610007
141;610023
141;610028
141;610146
141;610226
141;610242
141;610298
141;610422
141;610573
141;610634
141;610637
141;610698
141;610810
141;610812
141;610844
141;610904
141;610925
141;617059
141;617126
141;617144
141;617261
141;617294
141;617720
141;617771
141;617773
141;617789
141;617818
142;600325
142;600440
142;600477
142;600570
142;600788
142;610221
142;610234
142;610310
142;610550
142;610730
142;617002
143;600015
143;600020
143;600081
143;600100
143;600101
143;600111
143;600124
143;600125
143;600129
143;600133
143;600135
143;600147
143;600205
143;600248
143;600288
143;600325
143;600333
143;600337
143;600340
143;600420
143;600422
143;600454
143;600464
143;600470
143;600509
143;600551
143;600553
143;600554
143;600563
143;600589
143;600612
143;600622
143;600646
143;600658
143;600661
143;600669
143;600688
143;600722
143;600734
143;600736
143;600780
143;600789
143;600806
143;600845
143;600856
143;600885
143;600887
143;600894
143;600899
143;600907
143;600923
143;600965
143;600984
143;610023
143;610028
143;610075
143;610076
143;610093
143;610127
143;610135
143;610136
143;610146
143;610181
143;610221
143;610222
143;610223
143;610227
143;610371
143;610372
143;610400
143;610406
143;610410
143;610422
143;610429
143;610432
143;610436
143;610451
143;610452
143;610459
143;610461
143;610476
143;610478
143;610550
143;610571
143;610584
143;610651
143;610652
143;610653
143;610672
143;610685
143;610698
143;610708
143;610729
143;610730
143;610750
143;610772
143;610792
143;610802
143;610810
143;610831
143;610853
143;610864
143;610888
143;610910
143;610925
143;610941
143;617114
143;617126
143;617144
143;617177
143;617224
143;617261
143;617264
143;617284
143;617709
143;617710
143;617747
143;617749
143;617754
143;617759
143;617763
143;617767
143;617782
143;617789
143;617794
143;617800
143;617803
143;617812
143;617813
143;617829
143;617834
144;610146
145;600013
145;600015
145;600020
145;600032
145;600082
145;600124
145;600138
145;600296
145;600324
145;600325
145;600420
145;600522
145;600751
145;600752
145;600780
145;600804
145;600843
145;600885
145;600897
145;600903
145;600923
145;600931
145;600945
145;600954
145;600960
145;600965
145;600980
145;600997
145;610007
145;610030
145;610047
145;610057
145;610072
145;610076
145;610083
145;610136
145;610146
145;610147
145;610196
145;610212
145;610220
145;610226
145;610239
145;610296
145;610298
145;610317
145;610339
145;610371
145;610396
145;610400
145;610451
145;610571
145;610630
145;610632
145;610654
145;610662
145;610708
145;610729
145;610752
145;610769
145;610772
145;610812
145;610818
145;610903
145;610927
145;610944
145;617048
145;617138
145;617144
145;617217
145;617224
145;617230
145;617261
145;617275
145;617280
145;617284
145;617294
145;617303
145;617335
145;617342
145;617709
145;617710
145;617711
145;617727
145;617754
145;617771
145;617773
145;617789
145;617795
145;617802
145;617803
145;617809
145;617818
145;617834
146;600020
146;600038
146;600056
146;600065
146;600084
146;600100
146;600133
146;600138
146;600194
146;600206
146;600266
146;600288
146;600499
146;600509
146;600525
146;600563
146;600582
146;600618
146;600678
146;600722
146;600734
146;600741
146;600752
146;600806
146;600821
146;600831
146;600861
146;600870
146;600900
146;600902
146;600907
146;600948
146;600953
146;600980
146;600997
146;610023
146;610024
146;610030
146;610047
146;610052
146;610069
146;610113
146;610135
146;610146
146;610147
146;610149
146;610177
146;610203
146;610234
146;610241
146;610296
146;610298
146;610399
146;610400
146;610410
146;610456
146;610459
146;610476
146;610478
146;610481
146;610573
146;610632
146;610637
146;610651
146;610652
146;610668
146;610672
146;610685
146;610730
146;610750
146;610792
146;610800
146;610810
146;610829
146;610844
146;610910
146;610924
146;610926
146;610951
146;617048
146;617169
146;617177
146;617205
146;617217
146;617275
146;617280
146;617311
146;617325
146;617328
146;617708
146;617711
146;617727
146;617749
146;617754
146;617769
146;617789
146;617800
146;617810
146;617834
147;610146
148;610192
148;610221
148;617236
149;600052
149;600056
149;600088
149;600101
149;600105
149;600111
149;600112
149;600114
149;600135
149;600146
149;600147
149;600169
149;600266
149;600316
149;600340
149;600360
149;600415
149;600554
149;600563
149;600570
149;600604
149;600606
149;600678
149;600731
149;600831
149;600845
149;600870
149;600872
149;600887
149;600907
149;600948
149;600949
149;610023
149;610047
149;610070
149;610075
149;610077
149;610093
149;610149
149;610177
149;610203
149;610212
149;610221
149;610223
149;610241
149;610296
149;610310
149;610371
149;610408
149;610460
149;610481
149;610584
149;610651
149;610662
149;610668
149;610730
149;610747
149;610748
149;610818
149;610863
149;610904
149;610925
149;610947
149;610964
149;617048
149;617224
149;617720
149;617727
149;617747
149;617749
149;617753
150;600038
150;600052
150;600072
150;600088
150;600100
150;600117
150;600121
150;600138
150;600146
150;600177
150;600266
150;600288
150;600340
150;600440
150;600477
150;600525
150;600570
150;600604
150;600606
150;600633
150;600644
150;600646
150;600661
150;600669
150;600678
150;600685
150;600688
150;600708
150;600736
150;600749
150;600800
150;600806
150;600813
150;600848
150;600856
150;600880
150;600887
150;600900
150;600907
150;600957
150;600991
150;610023
150;610030
150;610052
150;610070
150;610080
150;610093
150;610128
150;610146
150;610147
150;610177
150;610181
150;610221
150;610227
150;610232
150;610291
150;610306
150;610310
150;610379
150;610391
150;610458
150;610460
150;610481
150;610582
150;610625
150;610637
150;610651
150;610672
150;610709
150;610711
150;610730
150;610731
150;610733
150;610743
150;610747
150;610750
150;610800
150;610816
150;610844
150;610883
150;610900
150;610910
150;610914
150;610918
150;610926
150;610927
150;610952
150;610964
150;617126
150;617138
150;617169
150;617205
151;600101
151;600135
151;600316
151;600477
151;600497
151;600563
151;600612
151;600644
151;600708
151;600722
151;600734
151;600736
151;600831
151;600845
151;600975
151;600991
151;600993
151;610007
151;610023
151;610028
151;610146
151;610226
151;610242
151;610298
151;610422
151;610573
151;610634
151;610637
151;610698
151;610810
151;610812
151;610844
151;610904
151;610925
151;617059
151;617126
151;617144
151;617261
151;617294
151;617720
151;617771
151;617773
151;617818
152;600101
152;600135
152;600316
152;600477
152;600497
152;600563
152;600612
152;600644
152;600708
152;600722
152;600734
152;600736
152;600788
152;600831
152;600845
152;600856
152;600975
152;600991
152;600993
152;610007
152;610023
152;610028
152;610146
152;610226
152;610242
152;610298
152;610422
152;610573
152;610634
152;610637
152;610698
152;610810
152;610812
152;610844
152;610904
152;610925
152;617059
152;617126
152;617144
152;617261
152;617294
152;617720
152;617771
152;617773
152;617789
152;617818
153;600612
153;610408
154;617087
155;600072
155;600104
155;600112
155;600121
155;600296
155;600420
155;600524
155;600570
155;600633
155;600669
155;600683
155;600751
155;600931
155;600991
155;610007
155;610016
155;610042
155;610081
155;610153
155;610167
155;610179
155;610191
155;610194
155;610204
155;610212
155;610241
155;610242
155;610291
155;610300
155;610322
155;610406
155;610423
155;610456
155;610459
155;610461
155;610474
155;610482
155;610573
155;610609
155;610708
155;610727
155;610741
155;610759
155;610769
155;610887
155;610904
155;610944
155;610964
155;610979
155;617002
155;617029
155;617108
155;617123
155;617144
155;617736
155;617737
155;617739
155;617769
155;617773
155;617843
155;617999
156;600013
156;600020
156;600060
156;600065
156;600072
156;600100
156;600114
156;600138
156;600296
156;600316
156;600420
156;600476
156;600509
156;600522
156;600554
156;600570
156;600604
156;600606
156;600612
156;600633
156;600644
156;600734
156;600780
156;600800
156;600804
156;600806
156;600856
156;600860
156;600861
156;600885
156;600893
156;600907
156;600931
156;600945
156;600984
156;600991
156;600993
156;600997
156;610023
156;610028
156;610057
156;610069
156;610072
156;610076
156;610080
156;610081
156;610083
156;610146
156;610147
156;610149
156;610153
156;610177
156;610191
156;610194
156;610196
156;610226
156;610227
156;610241
156;610242
156;610296
156;610298
156;610300
156;610317
156;610339
156;610399
156;610423
156;610436
156;610478
156;610550
156;610568
156;610585
156;610630
156;610647
156;610665
156;610698
156;610708
156;610710
156;610712
156;610729
156;610741
156;610772
156;610802
156;610818
156;610853
156;610862
156;610863
156;610903
156;610904
156;610910
156;610918
156;610944
156;610947
156;610964
156;610975
156;617002
156;617029
156;617048
156;617123
156;617144
156;617177
156;617261
156;617269
156;617294
156;617303
156;617327
156;617711
156;617761
156;617789
156;617800
156;617813
156;617829
156;617834
157;610180
158;600032
158;600081
158;600084
158;600121
158;600124
158;600146
158;600288
158;600316
158;600415
158;600557
158;600589
158;600644
158;600732
158;610153
158;610300
158;610452
158;610476
158;610685
158;610748
158;610810
158;610947
158;610964
158;610979
158;610993
158;617048
158;617727
158;617754
158;617771
158;617812
159;600020
159;600360
159;600563
159;610070
159;610310
159;610862
159;617747
160;617829
161;600688
161;610177
161;610747
161;610863
162;600085
162;600100
162;600128
162;600266
162;600324
162;600476
162;600477
162;600522
162;600606
162;600661
162;600685
162;600731
162;600732
162;600741
162;600945
162;610093
162;610113
162;610177
162;610221
162;610310
162;610550
162;610630
162;610636
162;610709
162;610750
162;610772
162;610810
162;610818
162;610829
162;610844
162;610904
162;610914
162;610927
162;610951
162;610952
162;617325
163;610024
164;610179
165;610203
166;600117
166;600166
166;600199
166;600225
166;600296
166;600478
166;600494
166;600522
166;600751
166;600804
166;600843
166;600931
166;600954
166;600965
166;600984
166;610028
166;610057
166;610070
166;610083
166;610135
166;610203
166;610339
166;610456
166;610547
166;610571
166;610752
166;610772
166;610779
166;610812
166;610818
166;610863
166;610904
166;617254
166;617261
166;617264
166;617284
166;617294
166;617693
166;617708
166;617710
166;617759
166;617766
166;617767
166;617782
166;617795
166;617809
166;617813
167;600146
167;600328
167;600477
167;600574
167;600644
167;600831
167;600903
167;600904
167;600931
167;600953
167;600980
167;610072
167;610083
167;610153
167;610180
167;610298
167;610300
167;610379
167;610547
167;610568
167;610634
167;610660
167;610769
167;610816
167;610924
167;610927
167;610944
167;610993
167;617048
167;617123
167;617190
167;617231
167;617240
167;617303
167;617714
167;617739
167;617795
168;600083
168;600101
168;600105
168;600111
168;600133
168;600144
168;600147
168;600166
168;600206
168;600324
168;600337
168;600420
168;600554
168;600559
168;600646
168;600658
168;600731
168;600733
168;600831
168;600856
168;600893
168;600899
168;600954
168;600960
168;610052
168;610073
168;610077
168;610080
168;610086
168;610093
168;610119
168;610180
168;610227
168;610239
168;610249
168;610296
168;610371
168;610456
168;610481
168;610568
168;610630
168;610662
168;610698
168;610862
168;610883
168;610892
168;610910
168;610914
168;610924
168;610927
168;610947
168;617029
168;617144
168;617169
168;617224
168;617230
168;617244
168;617311
168;617342
168;617727
168;617749
168;617802
169;600101
169;600135
169;600316
169;600477
169;600497
169;600563
169;600612
169;600644
169;600708
169;600722
169;600734
169;600736
169;600788
169;600831
169;600845
169;600856
169;600975
169;600991
169;600993
169;610007
169;610023
169;610028
169;610146
169;610226
169;610242
169;610298
169;610422
169;610573
169;610634
169;610637
169;610698
169;610810
169;610812
169;610844
169;610904
169;610925
169;617059
169;617126
169;617144
169;617261
169;617294
169;617720
169;617773
169;617789
169;617818
170;600015
170;600038
170;600050
170;600082
170;600091
170;600137
170;600148
170;600176
170;600194
170;600225
170;600328
170;600332
170;600470
170;600478
170;600522
170;600553
170;600558
170;600572
170;600597
170;600612
170;600734
170;600741
170;600751
170;600752
170;600772
170;600780
170;600800
170;600819
170;600821
170;600843
170;600868
170;600897
170;600931
170;600945
170;600953
170;600984
170;610007
170;610016
170;610030
170;610069
170;610072
170;610075
170;610081
170;610135
170;610136
170;610153
170;610181
170;610192
170;610194
170;610203
170;610220
170;610225
170;610226
170;610231
170;610339
170;610375
170;610451
170;610482
170;610585
170;610627
170;610634
170;610647
170;610651
170;610652
170;610660
170;610685
170;610708
170;610710
170;610752
170;610770
170;610800
170;610829
170;610831
170;610863
170;610918
170;610925
170;610928
170;610944
170;617002
170;617037
170;617048
170;617059
170;617123
170;617138
170;617190
170;617217
170;617227
170;617231
170;617261
170;617280
170;617284
170;617294
170;617303
170;617313
170;617327
170;617352
170;617355
170;617739
170;617761
170;617763
170;617767
170;617769
170;617773
170;617778
170;617782
170;617786
170;617789
170;617800
170;617809
170;617812
170;617813
170;617818
170;617843
171;600010
171;600013
171;600015
171;600020
171;600032
171;600038
171;600050
171;600051
171;600052
171;600056
171;600060
171;600065
171;600072
171;600074
171;600077
171;600078
171;600079
171;600081
171;600082
171;600083
171;600084
171;600085
171;600088
171;600091
171;600096
171;600099
171;600100
171;600101
171;600104
171;600105
171;600106
171;600110
171;600111
171;600112
171;600113
171;600114
171;600117
171;600120
171;600121
171;600123
171;600124
171;600125
171;600127
171;600128
171;600129
171;600133
171;600135
171;600137
171;600138
171;600144
171;600146
171;600147
171;600148
171;600152
171;600154
171;600159
171;600160
171;600166
171;600169
171;600172
171;600173
171;600175
171;600176
171;600177
171;600178
171;600182
171;600185
171;600189
171;600191
171;600194
171;600195
171;600198
171;600199
171;600200
171;600204
171;600205
171;600206
171;600210
171;600212
171;600213
171;600214
171;600225
171;600228
171;600248
171;600264
171;600266
171;600267
171;600269
171;600288
171;600296
171;600316
171;600324
171;600325
171;600328
171;600332
171;600333
171;600337
171;600340
171;600360
171;600415
171;600420
171;600422
171;600425
171;600440
171;600454
171;600457
171;600463
171;600464
171;600470
171;600476
171;600477
171;600478
171;600494
171;600497
171;600499
171;600509
171;600514
171;600522
171;600524
171;600525
171;600551
171;600553
171;600554
171;600557
171;600558
171;600559
171;600563
171;600570
171;600572
171;600573
171;600574
171;600582
171;600588
171;600589
171;600597
171;600604
171;600606
171;600612
171;600618
171;600622
171;600633
171;600644
171;600646
171;600658
171;600661
171;600665
171;600669
171;600678
171;600683
171;600685
171;600688
171;600708
171;600722
171;600731
171;600732
171;600733
171;600734
171;600736
171;600741
171;600746
171;600748
171;600749
171;600751
171;600752
171;600772
171;600780
171;600788
171;600789
171;600796
171;600798
171;600800
171;600802
171;600804
171;600806
171;600813
171;600819
171;600821
171;600831
171;600841
171;600843
171;600845
171;600848
171;600856
171;600858
171;600860
171;600861
171;600865
171;600868
171;600870
171;600872
171;600880
171;600882
171;600884
171;600885
171;600887
171;600893
171;600894
171;600897
171;600899
171;600900
171;600902
171;600903
171;600904
171;600907
171;600923
171;600931
171;600939
171;600945
171;600948
171;600949
171;600953
171;600954
171;600957
171;600960
171;600965
171;600966
171;600975
171;600977
171;600980
171;600984
171;600991
171;600993
171;600997
171;610006
171;610007
171;610011
171;610016
171;610023
171;610024
171;610028
171;610030
171;610042
171;610047
171;610048
171;610052
171;610057
171;610058
171;610069
171;610070
171;610072
171;610073
171;610075
171;610076
171;610077
171;610080
171;610081
171;610083
171;610086
171;610093
171;610113
171;610119
171;610127
171;610128
171;610135
171;610136
171;610146
171;610147
171;610149
171;610153
171;610161
171;610167
171;610176
171;610177
171;610179
171;610180
171;610181
171;610188
171;610191
171;610192
171;610194
171;610196
171;610202
171;610203
171;610204
171;610212
171;610220
171;610221
171;610222
171;610223
171;610225
171;610226
171;610227
171;610231
171;610232
171;610234
171;610237
171;610239
171;610240
171;610241
171;610242
171;610249
171;610254
171;610269
171;610291
171;610296
171;610298
171;610300
171;610306
171;610310
171;610317
171;610318
171;610322
171;610339
171;610345
171;610352
171;610371
171;610372
171;610375
171;610379
171;610391
171;610395
171;610396
171;610399
171;610400
171;610406
171;610408
171;610410
171;610419
171;610422
171;610423
171;610429
171;610432
171;610436
171;610451
171;610452
171;610456
171;610458
171;610459
171;610460
171;610461
171;610463
171;610468
171;610474
171;610476
171;610478
171;610481
171;610482
171;610546
171;610547
171;610550
171;610568
171;610571
171;610573
171;610579
171;610582
171;610584
171;610585
171;610589
171;610609
171;610614
171;610619
171;610625
171;610627
171;610630
171;610632
171;610634
171;610636
171;610637
171;610647
171;610648
171;610651
171;610652
171;610653
171;610654
171;610660
171;610662
171;610665
171;610668
171;610672
171;610685
171;610698
171;610708
171;610709
171;610710
171;610711
171;610712
171;610724
171;610727
171;610729
171;610730
171;610731
171;610733
171;610737
171;610741
171;610743
171;610746
171;610747
171;610748
171;610750
171;610752
171;610759
171;610769
171;610770
171;610772
171;610779
171;610784
171;610792
171;610795
171;610798
171;610800
171;610802
171;610810
171;610812
171;610816
171;610818
171;610829
171;610831
171;610844
171;610853
171;610862
171;610863
171;610864
171;610883
171;610887
171;610888
171;610892
171;610900
171;610903
171;610904
171;610910
171;610914
171;610916
171;610918
171;610924
171;610925
171;610926
171;610927
171;610928
171;610941
171;610944
171;610947
171;610951
171;610952
171;610964
171;610975
171;610979
171;610993
171;617002
171;617016
171;617021
171;617029
171;617032
171;617037
171;617048
171;617051
171;617059
171;617087
171;617108
171;617114
171;617123
171;617126
171;617138
171;617140
171;617144
171;617163
171;617169
171;617177
171;617190
171;617200
171;617205
171;617206
171;617217
171;617224
171;617227
171;617230
171;617231
171;617236
171;617240
171;617244
171;617254
171;617261
171;617264
171;617269
171;617275
171;617278
171;617280
171;617284
171;617294
171;617303
171;617308
171;617311
171;617313
171;617325
171;617327
171;617328
171;617335
171;617342
171;617352
171;617355
171;617691
171;617693
171;617694
171;617707
171;617708
171;617709
171;617710
171;617711
171;617714
171;617719
171;617720
171;617721
171;617727
171;617736
171;617737
171;617739
171;617747
171;617749
171;617752
171;617753
171;617754
171;617759
171;617761
171;617763
171;617766
171;617767
171;617769
171;617771
171;617773
171;617776
171;617778
171;617782
171;617786
171;617789
171;617794
171;617795
171;617800
171;617801
171;617802
171;617803
171;617806
171;617809
171;617810
171;617812
171;617813
171;617818
171;617827
171;617829
171;617830
171;617833
171;617834
171;617843
171;617999
172;600096
172;600939
172;610242
173;610242
174;600020
174;600056
174;600135
174;600248
174;600269
174;600316
174;600360
174;600425
174;600554
174;600559
174;600574
174;600582
174;600661
174;600800
174;600806
174;600900
174;600991
174;610194
174;610203
174;610212
174;610379
174;610432
174;610452
174;610474
174;610482
174;610573
174;610585
174;610634
174;610637
174;610668
174;610710
174;610711
174;610752
174;610798
174;610810
174;610844
174;610883
174;610926
174;610941
174;610947
174;610964
174;610993
174;617002
174;617037
174;617123
174;617206
174;617710
174;617714
174;617794
174;617812
174;617818
174;617834
175;600612
175;600708
175;600945
175;600975
175;610468
175;617721
176;600072
176;600084
176;600121
176;600288
176;600557
176;600574
176;600606
176;600612
176;600708
176;600945
176;600975
176;610023
176;610146
176;610432
176;610468
176;610747
176;610924
176;617144
176;617739
177;600032
177;600124
177;600269
177;600316
177;600557
177;600806
177;600991
177;610072
177;610075
177;610135
177;610153
177;610212
177;610231
177;610291
177;610371
177;610379
177;610395
177;610399
177;610452
177;610474
177;610482
177;610585
177;610710
177;610748
177;610752
177;610792
177;610810
177;610941
177;610947
177;617227
177;617230
177;617714
177;617720
177;617786
178;600204
178;600731
178;610024
178;610136
178;610179
178;617294
178;617802
179;600020
179;600032
179;600050
179;600051
179;600056
179;600060
179;600077
179;600084
179;600096
179;600111
179;600112
179;600121
179;600124
179;600125
179;600138
179;600204
179;600228
179;600264
179;600324
179;600325
179;600328
179;600332
179;600333
179;600337
179;600360
179;600415
179;600422
179;600440
179;600454
179;600463
179;600464
179;600470
179;600478
179;600494
179;600497
179;600514
179;600551
179;600553
179;600554
179;600557
179;600558
179;600563
179;600570
179;600572
179;600574
179;600582
179;600588
179;600597
179;600644
179;600646
179;600658
179;600665
179;600678
179;600683
179;600685
179;600708
179;600722
179;600736
179;600741
179;600746
179;600748
179;600749
179;600751
179;600752
179;600772
179;600796
179;600798
179;600802
179;600804
179;600806
179;600819
179;600821
179;600831
179;600841
179;600843
179;600848
179;600858
179;600860
179;600865
179;600868
179;600884
179;600887
179;600893
179;600899
179;600900
179;600902
179;600903
179;600931
179;600939
179;600945
179;600949
179;600953
179;600954
179;600966
179;600975
179;600980
179;600984
179;600991
179;600993
179;610006
179;610007
179;610011
179;610028
179;610030
179;610042
179;610047
179;610048
179;610052
179;610057
179;610070
179;610072
179;610073
179;610075
179;610077
179;610080
179;610081
179;610083
179;610086
179;610113
179;610119
179;610127
179;610128
179;610135
179;610136
179;610147
179;610149
179;610153
179;610161
179;610167
179;610180
179;610188
179;610191
179;610192
179;610194
179;610196
179;610202
179;610204
179;610212
179;610221
179;610222
179;610225
179;610226
179;610227
179;610231
179;610232
179;610237
179;610239
179;610240
179;610242
179;610249
179;610296
179;610306
179;610310
179;610317
179;610318
179;610322
179;610352
179;610371
179;610372
179;610391
179;610396
179;610400
179;610419
179;610429
179;610432
179;610436
179;610452
179;610461
179;610474
179;610481
179;610482
179;610546
179;610547
179;610550
179;610568
179;610573
179;610579
179;610584
179;610585
179;610589
179;610609
179;610614
179;610625
179;610634
179;610636
179;610637
179;610647
179;610651
179;610653
179;610654
179;610665
179;610672
179;610685
179;610698
179;610708
179;610709
179;610710
179;610729
179;610731
179;610733
179;610748
179;610752
179;610769
179;610770
179;610779
179;610784
179;610795
179;610800
179;610812
179;610829
179;610831
179;610844
179;610853
179;610862
179;610864
179;610883
179;610903
179;610904
179;610925
179;610941
179;610944
179;610951
179;610964
179;610975
179;610979
179;617016
179;617032
179;617048
179;617051
179;617059
179;617087
179;617108
179;617114
179;617123
179;617126
179;617144
179;617163
179;617169
179;617177
179;617190
179;617200
179;617205
179;617206
179;617217
179;617224
179;617230
179;617231
179;617236
179;617240
179;617244
179;617261
179;617278
179;617294
179;617303
179;617308
179;617313
179;617327
179;617328
179;617335
179;617342
179;617352
179;617355
179;617691
179;617693
179;617694
179;617707
179;617710
179;617711
179;617714
179;617719
179;617720
179;617727
179;617736
179;617737
179;617739
179;617749
179;617754
179;617761
179;617767
179;617769
179;617771
179;617773
179;617776
179;617782
179;617786
179;617789
179;617794
179;617795
179;617801
179;617802
179;617803
179;617806
179;617809
179;617827
179;617829
179;617833
179;617834
179;617843
180;600288
180;600604
180;600860
180;600975
180;610408
180;610468
180;610698
180;610747
180;610924
180;617224
180;617818
181;600288
181;600574
181;600734
181;600751
181;600806
181;600893
181;600991
181;610181
181;610212
181;610379
181;610468
181;610474
181;610478
181;610482
181;610710
181;610941
181;610944
181;610993
181;617714
181;617739
181;617754
181;617818
181;617833
182;600893
182;600902
182;600966
182;610075
182;610451
182;610452
182;610585
182;610589
182;610634
182;610975
182;617200
182;617230
182;617707
182;617710
182;617711
182;617809
183;600015
183;600032
183;600056
183;600065
183;600072
183;600081
183;600085
183;600101
183;600105
183;600112
183;600114
183;600123
183;600125
183;600127
183;600133
183;600135
183;600146
183;600166
183;600173
183;600177
183;600189
183;600195
183;600198
183;600204
183;600228
183;600248
183;600266
183;600288
183;600316
183;600325
183;600340
183;600360
183;600415
183;600425
183;600440
183;600454
183;600457
183;600476
183;600477
183;600497
183;600509
183;600525
183;600559
183;600570
183;600574
183;600582
183;600588
183;600604
183;600606
183;600633
183;600644
183;600646
183;600661
183;600665
183;600669
183;600678
183;600683
183;600685
183;600688
183;600708
183;600733
183;600788
183;600806
183;600813
183;600848
183;600861
183;600865
183;600870
183;600884
183;600885
183;600887
183;600900
183;600904
183;600907
183;600948
183;600957
183;600977
183;600993
183;610023
183;610058
183;610076
183;610093
183;610146
183;610177
183;610221
183;610232
183;610234
183;610240
183;610291
183;610296
183;610298
183;610310
183;610322
183;610345
183;610371
183;610379
183;610406
183;610408
183;610423
183;610458
183;610460
183;610463
183;610546
183;610550
183;610568
183;610579
183;610627
183;610651
183;610653
183;610654
183;610668
183;610672
183;610709
183;610711
183;610724
183;610730
183;610733
183;610747
183;610750
183;610792
183;610798
183;610800
183;610818
183;610844
183;610883
183;610900
183;610914
183;610924
183;610926
183;610951
183;610952
183;610964
183;610993
183;617002
183;617126
183;617205
183;617355
183;617749
183;617771
184;600020
184;600082
184;600105
184;600144
184;600160
184;600199
184;600633
184;600708
184;600772
184;600780
184;600802
184;600893
184;600966
184;610076
184;610220
184;610221
184;610291
184;610478
184;610584
184;610609
184;610614
184;610632
184;610708
184;610727
184;610779
184;610818
184;610924
184;610993
184;617037
184;617275
184;617342
184;617720
184;617747
184;617754
184;617809
185;600050
185;600065
185;600072
185;600081
185;600100
185;600101
185;600114
185;600125
185;600133
185;600288
185;600316
185;600333
185;600337
185;600340
185;600422
185;600476
185;600509
185;600553
185;600554
185;600557
185;600588
185;600589
185;600606
185;600612
185;600633
185;600644
185;600722
185;600733
185;600734
185;600746
185;600821
185;600841
185;600856
185;600860
185;600861
185;600882
185;600884
185;600893
185;600949
185;600975
185;600991
185;600993
185;610023
185;610028
185;610052
185;610070
185;610080
185;610086
185;610119
185;610149
185;610161
185;610177
185;610181
185;610225
185;610227
185;610241
185;610300
185;610310
185;610399
185;610422
185;610423
185;610429
185;610432
185;610436
185;610452
185;610460
185;610461
185;610474
185;610476
185;610478
185;610550
185;610582
185;610585
185;610665
185;610672
185;610698
185;610710
185;610712
185;610741
185;610802
185;610831
185;610853
185;610862
185;610904
185;610910
185;610916
185;610924
185;610925
185;610928
185;610941
185;610964
185;610993
185;617029
185;617059
185;617177
185;617311
185;617327
185;617720
185;617801
185;617810
185;617843
186;600137
186;600176
186;600420
186;600751
186;610070
186;610609
186;617327
187;600013
187;600020
187;600056
187;600072
187;600081
187;600082
187;600104
187;600114
187;600269
187;600288
187;600316
187;600360
187;600420
187;600440
187;600582
187;600604
187;600708
187;600731
187;600732
187;600788
187;600813
187;600856
187;600870
187;600948
187;600997
187;610030
187;610069
187;610113
187;610146
187;610177
187;610203
187;610234
187;610241
187;610310
187;610395
187;610408
187;610423
187;610451
187;610463
187;610468
187;610476
187;610634
187;610711
187;610741
187;610759
187;610798
187;610818
187;610863
187;610900
187;610914
187;610927
187;610928
187;610947
187;610952
187;610975
187;617002
187;617051
187;617126
187;617244
187;617280
187;617711
187;617720
187;617818
188;600112
188;600125
188;600415
188;600522
188;600644
188;600661
188;600732
188;610023
188;610076
188;610177
188;610234
188;610240
188;610298
188;610863
188;610941
189;600328
189;600802
189;610220
189;617169
190;600013
190;600032
190;600060
190;600065
190;600074
190;600077
190;600084
190;600091
190;600104
190;600111
190;600124
190;600129
190;600147
190;600225
190;600228
190;600288
190;600296
190;600324
190;600325
190;600332
190;600337
190;600340
190;600422
190;600425
190;600440
190;600454
190;600464
190;600477
190;600499
190;600524
190;600525
190;600574
190;600589
190;600606
190;600622
190;600669
190;600683
190;600688
190;600708
190;600722
190;600732
190;600733
190;600736
190;600741
190;600788
190;600798
190;600800
190;600806
190;600813
190;600821
190;600860
190;600861
190;600949
190;600953
190;600960
190;600975
190;600980
190;600993
190;610007
190;610023
190;610030
190;610057
190;610072
190;610075
190;610083
190;610086
190;610113
190;610119
190;610128
190;610135
190;610176
190;610177
190;610180
190;610192
190;610196
190;610202
190;610220
190;610221
190;610222
190;610234
190;610239
190;610240
190;610242
190;610249
190;610254
190;610291
190;610300
190;610352
190;610395
190;610406
190;610422
190;610456
190;610459
190;610460
190;610468
190;610474
190;610478
190;610546
190;610550
190;610573
190;610579
190;610582
190;610627
190;610654
190;610672
190;610685
190;610712
190;610729
190;610733
190;610741
190;610748
190;610769
190;610770
190;610802
190;610818
190;610831
190;610853
190;610862
190;610892
190;610904
190;610914
190;610918
190;610944
190;610947
190;610979
190;610993
190;617002
190;617016
190;617037
190;617108
190;617123
190;617126
190;617138
190;617190
190;617200
190;617205
190;617217
190;617224
190;617230
190;617240
190;617244
190;617264
190;617278
190;617342
190;617352
190;617694
190;617708
190;617711
190;617714
190;617720
190;617736
190;617737
190;617749
190;617763
190;617771
190;617773
190;617778
190;617786
190;617794
190;617800
190;617812
191;600477
191;600604
191;600612
191;610291
191;610372
191;610408
191;610711
191;610750
191;610914
192;617830
193;600266
193;600494
193;600633
193;600665
193;610147
193;610237
193;610291
193;610647
193;610747
193;617736
194;600858
194;617829
195;600013
195;600015
195;600072
195;600081
195;600082
195;600104
195;600114
195;600133
195;600135
195;600146
195;600266
195;600269
195;600316
195;600420
195;600476
195;600477
195;600522
195;600606
195;600612
195;600633
195;600661
195;600688
195;600732
195;600733
195;600734
195;600788
195;600813
195;600845
195;600856
195;600870
195;600885
195;600997
195;610023
195;610069
195;610076
195;610146
195;610181
195;610203
195;610234
195;610241
195;610269
195;610291
195;610298
195;610300
195;610395
195;610408
195;610451
195;610459
195;610463
195;610468
195;610476
195;610478
195;610711
195;610730
195;610741
195;610747
195;610750
195;610759
195;610772
195;610798
195;610802
195;610810
195;610816
195;610818
195;610863
195;610888
195;610900
195;610910
195;610914
195;610924
195;610927
195;610928
195;610947
195;610952
195;610993
195;617002
195;617280
195;617778
195;617818
196;600050
196;600056
196;600065
196;600072
196;600088
196;600101
196;600111
196;600112
196;600159
196;600316
196;600606
196;600646
196;600819
196;600831
196;600870
196;600897
196;600949
196;600984
196;600993
196;610073
196;610086
196;610181
196;610194
196;610231
196;610239
196;610296
196;610668
196;610748
196;610800
196;610810
196;610900
196;610918
196;610925
196;610928
196;610944
196;610947
196;617227
196;617303
196;617749
196;617769
196;617773
197;600032
197;600072
197;600085
197;600114
197;600123
197;600127
197;600133
197;600135
197;600146
197;600166
197;600177
197;600189
197;600195
197;600198
197;600204
197;600228
197;600248
197;600266
197;600316
197;600325
197;600340
197;600360
197;600415
197;600425
197;600440
197;600476
197;600477
197;600497
197;600570
197;600574
197;600582
197;600588
197;600604
197;600606
197;600633
197;600644
197;600661
197;600678
197;600685
197;600688
197;600708
197;600788
197;600806
197;600813
197;600848
197;600870
197;600887
197;600900
197;600907
197;610023
197;610058
197;610177
197;610221
197;610232
197;610234
197;610240
197;610291
197;610310
197;610322
197;610345
197;610379
197;610406
197;610423
197;610460
197;610463
197;610546
197;610550
197;610627
197;610651
197;610709
197;610711
197;610724
197;610730
197;610747
197;610750
197;610792
197;610798
197;610818
197;610844
197;610883
197;610900
197;610914
197;610924
197;610926
197;610951
197;610964
197;617002
197;617126
197;617205
198;600557
198;600612
198;610458
198;610798
198;610924
199;600020
199;600052
199;600056
199;600065
199;600072
199;600088
199;600110
199;600112
199;600114
199;600121
199;600135
199;600146
199;600159
199;600169
199;600266
199;600288
199;600316
199;600340
199;600360
199;600415
199;600509
199;600563
199;600570
199;600582
199;600604
199;600606
199;600618
199;600644
199;600678
199;600806
199;600845
199;600870
199;600872
199;600885
199;600887
199;600907
199;600948
199;600949
199;600957
199;600993
199;610023
199;610047
199;610070
199;610083
199;610128
199;610149
199;610177
199;610212
199;610220
199;610221
199;610223
199;610241
199;610310
199;610322
199;610400
199;610408
199;610460
199;610573
199;610584
199;610668
199;610727
199;610730
199;610747
199;610748
199;610810
199;610818
199;610900
199;610904
199;610927
199;610964
199;610993
199;617032
199;617720
199;617747
199;617753
199;617834
200;617126
201;600081
201;600557
202;600060
202;600083
202;600091
202;600182
202;600572
202;600665
202;600733
202;600897
202;610069
202;610081
202;610147
202;610153
202;610231
202;610647
202;610712
202;610944
202;617190
202;617227
202;617739
202;617769
202;617771
202;617789
202;617800
202;617999
