<svg id="business_center-24px" xmlns="http://www.w3.org/2000/svg" width="24" height="24" viewBox="0 0 24 24">
  <path id="Tracé_2564" data-name="Tracé 2564" d="M0,0H24V24H0ZM10,5h4V7H10Zm0,0h4V7H10Z" fill="none"/>
  <g id="inventory" transform="translate(2.389 2.389)">
    <path id="Tracé_2776" data-name="Tracé 2776" d="M8.81,13.6a.6.6,0,0,0-.6-.6h-3v2.4a.8.8,0,0,1-1.6,0V13H.6a.6.6,0,0,0-.6.6V21.21a.6.6,0,0,0,.6.6H8.21a.6.6,0,0,0,.6-.6Z" transform="translate(0 -2.588)" fill="#424242"/>
    <path id="Tracé_2777" data-name="Tracé 2777" d="M21.81,13.6a.6.6,0,0,0-.6-.6h-3v2.4a.8.8,0,0,1-1.6,0V13h-3a.6.6,0,0,0-.6.6V21.21a.6.6,0,0,0,.6.6H21.21a.6.6,0,0,0,.6-.6Z" transform="translate(-2.588 -2.588)" fill="#424242"/>
    <path id="Tracé_2778" data-name="Tracé 2778" d="M15.31.6a.6.6,0,0,0-.6-.6h-3V2.4a.8.8,0,0,1-1.6,0V0h-3a.6.6,0,0,0-.6.6V8.21a.6.6,0,0,0,.6.6H14.71a.6.6,0,0,0,.6-.6Z" transform="translate(-1.294)" fill="#424242"/>
  </g>
</svg>
