<svg id="bar_chart-24px" xmlns="http://www.w3.org/2000/svg" width="28.654" height="28.654" viewBox="0 0 28.654 28.654">
  <path id="Tracé_2545" data-name="Tracé 2545" d="M0,0H28.654V28.654H0Z" fill="none"/>
  <g id="sale" transform="translate(2.388 1.194)">
    <g id="Groupe_12525" data-name="Groupe 12525" transform="translate(0 0)">
      <g id="Groupe_12524" data-name="Groupe 12524" transform="translate(0 0)">
        <path id="Tracé_2783" data-name="Tracé 2783" d="M33.32,12.895a.737.737,0,0,1,0-.651l.938-1.918a2.183,2.183,0,0,0-.942-2.9l-1.886-1a.737.737,0,0,1-.383-.527l-.369-2.1A2.183,2.183,0,0,0,28.213,2L26.1,2.3a.737.737,0,0,1-.619-.2L23.945.618a2.182,2.182,0,0,0-3.047,0L19.363,2.1a.737.737,0,0,1-.619.2l-2.114-.3A2.182,2.182,0,0,0,14.164,3.8L13.8,5.9a.737.737,0,0,1-.383.527l-1.886,1a2.183,2.183,0,0,0-.942,2.9l.938,1.918a.737.737,0,0,1,0,.651l-.938,1.918a2.183,2.183,0,0,0,.942,2.9l1.886,1a.737.737,0,0,1,.383.527l.369,2.1a2.181,2.181,0,0,0,2.152,1.813,2.242,2.242,0,0,0,.314-.022l2.114-.3a.737.737,0,0,1,.619.2L20.9,24.52a2.182,2.182,0,0,0,3.047,0l1.535-1.485a.738.738,0,0,1,.619-.2l2.114.3a2.182,2.182,0,0,0,2.465-1.791l.369-2.1a.737.737,0,0,1,.383-.527l1.886-1a2.183,2.183,0,0,0,.942-2.9Zm-13.8-6.851A2.658,2.658,0,1,1,16.863,8.7,2.662,2.662,0,0,1,19.521,6.044ZM18.149,17.867a.725.725,0,1,1-1.025-1.025l9.57-9.57A.725.725,0,1,1,27.719,8.3Zm7.172,1.228a2.658,2.658,0,1,1,2.658-2.658A2.662,2.662,0,0,1,25.321,19.094Z" transform="translate(-10.359 0.002)" fill="#fff"/>
      </g>
    </g>
    <g id="Groupe_12527" data-name="Groupe 12527" transform="translate(13.754 15.229)">
      <g id="Groupe_12526" data-name="Groupe 12526">
        <path id="Tracé_2784" data-name="Tracé 2784" d="M291.66,310.141a1.208,1.208,0,1,0,1.208,1.208A1.21,1.21,0,0,0,291.66,310.141Z" transform="translate(-290.452 -310.141)" fill="#fff"/>
      </g>
    </g>
    <g id="Groupe_12529" data-name="Groupe 12529" transform="translate(7.954 7.496)">
      <g id="Groupe_12528" data-name="Groupe 12528" transform="translate(0)">
        <path id="Tracé_2785" data-name="Tracé 2785" d="M173.541,152.646a1.208,1.208,0,1,0,1.208,1.208A1.21,1.21,0,0,0,173.541,152.646Z" transform="translate(-172.333 -152.646)" fill="#fff"/>
      </g>
    </g>
  </g>
</svg>
