<svg id="bar_chart-24px" xmlns="http://www.w3.org/2000/svg" width="28.654" height="28.654" viewBox="0 0 28.654 28.654">
  <path id="Tracé_2545" data-name="Tracé 2545" d="M0,0H28.654V28.654H0Z" fill="none"/>
  <g id="Groupe_12530" data-name="Groupe 12530" transform="translate(2.891 1.783)">
    <g id="Groupe_12530-2" data-name="Groupe 12530" transform="translate(0 0)">
      <path id="Tracé_2786" data-name="Tracé 2786" d="M32.654,12.519a.715.715,0,0,1,0-.632l.91-1.863A2.119,2.119,0,0,0,32.65,7.21l-1.831-.972a.715.715,0,0,1-.372-.512l-.358-2.042a2.119,2.119,0,0,0-2.394-1.739l-2.053.29a.715.715,0,0,1-.6-.2L23.551.6a2.119,2.119,0,0,0-2.959,0L19.1,2.041a.716.716,0,0,1-.6.2l-2.053-.29a2.118,2.118,0,0,0-2.393,1.739L13.7,5.727a.715.715,0,0,1-.371.512l-1.831.972a2.12,2.12,0,0,0-.914,2.814l.911,1.862a.715.715,0,0,1,0,.632l-.911,1.863a2.119,2.119,0,0,0,.914,2.814l1.831.972a.716.716,0,0,1,.371.512l.359,2.042a2.117,2.117,0,0,0,2.089,1.761,2.2,2.2,0,0,0,.3-.021l2.053-.29a.715.715,0,0,1,.6.2l1.49,1.441a2.12,2.12,0,0,0,2.959,0l1.49-1.441a.717.717,0,0,1,.6-.2l2.053.29a2.119,2.119,0,0,0,2.394-1.739l.358-2.042a.715.715,0,0,1,.372-.512L32.65,17.2a2.119,2.119,0,0,0,.914-2.814Zm-8.47-2.428V11.5H19.664a4.4,4.4,0,0,0,0,1.408h4.519v1.408H20.128a4.561,4.561,0,0,0,4.055,2.464,4.51,4.51,0,0,0,2.971-1.105l1.253,1.246a6.327,6.327,0,0,1-10.193-2.605H15.736V12.907H17.89a5.861,5.861,0,0,1,0-1.408H15.736V10.091h2.478a6.326,6.326,0,0,1,10.193-2.6L27.161,8.733a4.567,4.567,0,0,0-7.032,1.358Z" transform="translate(-10.36 0.002)" fill="#fff"/>
    </g>
  </g>
</svg>
