<svg id="business_center-24px" xmlns="http://www.w3.org/2000/svg" width="24" height="24" viewBox="0 0 24 24">
  <path id="Tracé_2564" data-name="Tracé 2564" d="M0,0H24V24H0ZM10,5h4V7H10Zm0,0h4V7H10Z" fill="none"/>
  <g id="Icon_ionic-md-pricetags" data-name="Icon ionic-md-pricetags" transform="translate(-0.813 -1.709)">
    <path id="Tracé_2815" data-name="Tracé 2815" d="M26.2,7.523V14.2l-10.08,9.649a2.159,2.159,0,0,0,1.364.583,2.36,2.36,0,0,0,1.487-.583L28,15.339V9.276Z" transform="translate(-4.525 -1.354)" fill="#424242"/>
    <path id="Tracé_2816" data-name="Tracé 2816" d="M18.923,3.375H11.344L2.832,12.261a1.939,1.939,0,0,0-.583,1.345,2.072,2.072,0,0,0,.583,1.511L8.7,20.972a2.174,2.174,0,0,0,1.364.592,2.364,2.364,0,0,0,1.483-.592l8.9-8.5V4.891ZM17.469,8.24a1.517,1.517,0,1,1,1.014-1.014A1.475,1.475,0,0,1,17.469,8.24Z" transform="translate(0 0)" fill="#424242"/>
  </g>
</svg>
