<svg xmlns="http://www.w3.org/2000/svg" width="17.5" height="20" viewBox="0 0 17.5 20">
  <path id="Icon_awesome-calendar" data-name="Icon awesome-calendar" d="M.469,7.5H17.031a.47.47,0,0,1,.469.469V18.125A1.875,1.875,0,0,1,15.625,20H1.875A1.875,1.875,0,0,1,0,18.125V7.969A.47.47,0,0,1,.469,7.5ZM17.5,5.781V4.375A1.875,1.875,0,0,0,15.625,2.5H13.75V.469A.47.47,0,0,0,13.281,0H11.719a.47.47,0,0,0-.469.469V2.5h-5V.469A.47.47,0,0,0,5.781,0H4.219A.47.47,0,0,0,3.75.469V2.5H1.875A1.875,1.875,0,0,0,0,4.375V5.781a.47.47,0,0,0,.469.469H17.031A.47.47,0,0,0,17.5,5.781Z" fill="#1c4d7a"/>
</svg>
