<svg id="store_mall_directory-24px" xmlns="http://www.w3.org/2000/svg" width="49" height="49" viewBox="0 0 49 49">
  <path id="Tracé_2503" data-name="Tracé 2503" d="M0,0H49V49H0Z" fill="none"/>
  <path id="Tracé_2504" data-name="Tracé 2504" d="M37.708,4H5.042V8.083H37.708ZM39.75,24.417V20.333L37.708,10.125H5.042L3,20.333v4.083H5.042v12.25H25.458V24.417h8.167v12.25h4.083V24.417ZM21.375,32.583H9.125V24.417h12.25Z" transform="translate(3.125 4.167)" fill="#fff"/>
</svg>
