<svg id="receipt_long-24px" xmlns="http://www.w3.org/2000/svg" width="24" height="24" viewBox="0 0 24 24">
  <path id="Tracé_2763" data-name="Tracé 2763" d="M0,0H24V24H0Z" fill="none"/>
  <g id="Groupe_12434" data-name="Groupe 12434">
    <path id="Tracé_2764" data-name="Tracé 2764" d="M19.5,3.5,18,2,16.5,3.5,15,2,13.5,3.5,12,2,10.5,3.5,9,2,7.5,3.5,6,2V16H3v3a3,3,0,0,0,3,3H18a3,3,0,0,0,3-3V2ZM19,19a1,1,0,0,1-2,0V16H8V5H19Z" fill="#424242"/>
    <rect id="Rectangle_18149" data-name="Rectangle 18149" width="6" height="2" transform="translate(9 7)" fill="#424242"/>
    <rect id="Rectangle_18150" data-name="Rectangle 18150" width="2" height="2" transform="translate(16 7)" fill="#424242"/>
    <rect id="Rectangle_18151" data-name="Rectangle 18151" width="6" height="2" transform="translate(9 10)" fill="#424242"/>
    <rect id="Rectangle_18152" data-name="Rectangle 18152" width="2" height="2" transform="translate(16 10)" fill="#424242"/>
  </g>
</svg>
