<svg xmlns="http://www.w3.org/2000/svg" xmlns:xlink="http://www.w3.org/1999/xlink" width="193.719" height="201.562" viewBox="0 0 193.719 201.562">
  <defs>
    <clipPath id="clip-path">
      <path id="Tracé_5192" data-name="Tracé 5192" d="M79.1,240.179s-.641,13.415-.568,17.133.161,5.109,2,5.437,8.957,1.042,10.936.323a5.2,5.2,0,0,0,3.27-2.453c.667-1.1,3.8-15.92,4.51-20.081s3.567-48.495,3.567-48.495.109-.943-1.791-1.781c-1.562-.7-9.228-1.042-11.707-1.125a2.6,2.6,0,0,0-2.63,1.916v.057C86.221,193.023,79.1,240.179,79.1,240.179Z" transform="translate(-78.529 -189.135)" fill="#e34168" stroke="#263238" stroke-linecap="round" stroke-linejoin="round" stroke-width="1"/>
    </clipPath>
    <clipPath id="clip-path-2">
      <path id="Tracé_5198" data-name="Tracé 5198" d="M93.667,288.611c-2.224,0-11.8-1.01-13.285-1.328a11.634,11.634,0,0,1-1.25-.333v.1s-.641,13.415-.568,17.133.161,5.109,2,5.437,8.957,1.042,10.936.323a5.2,5.2,0,0,0,3.27-2.453c.667-1.1,3.645-15.1,4.447-19.717C97.349,288.752,95.5,288.6,93.667,288.611Z" transform="translate(-78.559 -286.95)" fill="#263238" stroke="#263238" stroke-linecap="round" stroke-linejoin="round" stroke-width="1"/>
    </clipPath>
    <clipPath id="clip-path-3">
      <path id="Tracé_5231" data-name="Tracé 5231" d="M318.745,355.227l-25.789-44.578s-2.885-20.253-9.035-28.4-14.774-14.1-9.77-18.264,17.706-12.134,20.31-11.624,20.133,9.374,25.086,10.806,6.687,3.536,5.947,7.812-1.042,34.257.422,38.4,17.743,33.647,17.743,33.647" transform="translate(-272.652 -252.335)" fill="#fff" stroke="#263238" stroke-linecap="round" stroke-miterlimit="10" stroke-width="1"/>
    </clipPath>
    <clipPath id="clip-path-4">
      <path id="Tracé_5245" data-name="Tracé 5245" d="M300.823,293.816s-5.906,1.385-8.546.76-8.03-8.207-11.733-10.7a20.162,20.162,0,0,0-9.832-3.671c-3.875-.583-6.551,1.286-5.729,4.833s5.328,7.843,8.614,10.686,6.421,7.707,8.369,13.358,3.166,10.843,7.5,16.55S299.2,333.687,301.02,334" transform="translate(-264.834 -280.098)" fill="#fff" stroke="#263238" stroke-linecap="round" stroke-miterlimit="10" stroke-width="1"/>
    </clipPath>
    <clipPath id="clip-path-5">
      <path id="Tracé_5255" data-name="Tracé 5255" d="M319.167,259.032l.708-2.286a8.03,8.03,0,0,0-1.771-7.556c-1.942-1.911-8.853-5.275-10.874-7.041s-17.144-12.566-19.831-11.9-5.921,4.5-8.66,6.64-12.561,10.176-12.561,10.176-6.9,2.989-6.588,4.4,1.745,3.2,6.072,3.062,11.54-4.453,12.634-5.088,7.9-5.093,7.9-5.093a23.842,23.842,0,0,0,6,4.322c3.213,1.489,3.645,1.64,3.645,1.64a9.025,9.025,0,0,0,3.2,4.609" transform="translate(-259.58 -230.214)" fill="#fff" stroke="#263238" stroke-linecap="round" stroke-miterlimit="10" stroke-width="1"/>
    </clipPath>
  </defs>
  <g id="Compte_rendu" data-name="Compte rendu" transform="translate(-69.049 -64.18)">
    <g id="freepik--background-simple--inject-42" transform="translate(69.049 75.211)">
      <path id="Tracé_5115" data-name="Tracé 5115" d="M229.787,159.988s1.807-6.119,7.937-19.066c8.39-17.706-3.671-37.631-27.57-48.021-28.018-12.171-64.055-7.635-90.047-.2C98.619,98.86,89.74,114.931,85.876,130.95c-1.963,8.119-2.333,16.42-3.573,24.648-1.646,10.968-5.239,22.107-8.384,32.85-3.8,12.978-7.567,27.632-2.2,41.662,16.524,43.151,107.327,45.016,143.057,25.044,20.2-11.285,27.643-27.882,20.831-47.25C230.547,193.558,225.642,173.976,229.787,159.988Z" transform="translate(-69.049 -85.363)" fill="#ebebeb"/>
      <path id="Tracé_5116" data-name="Tracé 5116" d="M229.787,159.988s1.807-6.119,7.937-19.066c8.39-17.706-3.671-37.631-27.57-48.021-28.018-12.171-64.055-7.635-90.047-.2C98.619,98.86,89.74,114.931,85.876,130.95c-1.963,8.119-2.333,16.42-3.573,24.648-1.646,10.968-5.239,22.107-8.384,32.85-3.8,12.978-7.567,27.632-2.2,41.662,16.524,43.151,107.327,45.016,143.057,25.044,20.2-11.285,27.643-27.882,20.831-47.25C230.547,193.558,225.642,173.976,229.787,159.988Z" transform="translate(-69.049 -85.363)" fill="#ebebeb" opacity="0.7"/>
    </g>
    <g id="freepik--Notebook--inject-42" transform="translate(100.636 101.988)">
      <path id="Tracé_5117" data-name="Tracé 5117" d="M255.488,146.888a.521.521,0,1,0-.151-.984l-1.974.307-.057-.375,1.974-.307a.521.521,0,0,0-.151-.984l-1.979.312-.422-2.724L246.8,136.78,169.17,279.472l5.947,4.02,97.25-15.155-1.083-6.978,1.974-.307a.521.521,0,1,0-.151-.979l-1.979.307-.057-.38,1.979-.307a.49.49,0,0,0,.411-.562.521.521,0,0,0-.568-.417l-1.974.307-.573-3.671,1.979-.307a.521.521,0,0,0-.13-.974l-1.974.307-.057-.375,1.974-.307a.521.521,0,0,0-.151-.984l-1.979.307-.568-3.645,1.974-.312a.484.484,0,0,0,.411-.562.521.521,0,0,0-.562-.417l-1.979.307-.057-.375,1.974-.307a.521.521,0,0,0-.151-.984l-1.974.307-.573-3.645,1.974-.307a.521.521,0,0,0-.151-.984l-1.974.307-.062-.375,1.979-.307a.521.521,0,0,0,.411-.568.484.484,0,0,0-.562-.411l-1.979.307-.568-3.645,1.974-.307a.521.521,0,0,0,.411-.568.484.484,0,0,0-.562-.411l-1.979.307-.057-.38,1.974-.307a.521.521,0,1,0-.151-.979l-1.974.307-.573-3.671,1.974-.307a.521.521,0,1,0-.151-.979l-1.974.307-.062-.38,1.979-.307a.521.521,0,1,0-.156-.979l-1.974.307-.573-3.671,1.979-.307a.521.521,0,1,0-.156-.979l-1.974.307-.057-.38,1.974-.307a.5.5,0,1,0-.151-.979l-1.979.307-.568-3.645,1.974-.307a.5.5,0,1,0-.151-.979l-1.974.307-.063-.375,1.979-.307a.521.521,0,0,0-.156-.984l-1.974.307-.573-3.645,1.979-.307a.521.521,0,0,0-.156-.984l-1.974.307-.057-.375,1.974-.307a.521.521,0,0,0-.151-.984l-1.979.312-.568-3.645,1.974-.307a.521.521,0,0,0-.151-.984l-1.979.307-.057-.375,1.974-.307a.521.521,0,1,0-.151-.979l-1.974.307-.573-3.671,1.974-.307a.521.521,0,1,0-.151-.979l-1.974.307-.057-.38,1.974-.307a.521.521,0,0,0-.151-.979l-1.979.307-.568-3.645,1.974-.307a.521.521,0,0,0-.151-.979l-1.979.307-.057-.38,1.974-.307a.5.5,0,1,0-.151-.979l-1.974.307-.573-3.671,1.974-.307a.521.521,0,1,0-.151-.979l-1.974.307-.062-.375,1.979-.307a.521.521,0,0,0-.156-.984l-1.974.307-.573-3.645,1.979-.312a.521.521,0,0,0-.151-.979l-1.979.307-.057-.375,1.974-.307a.521.521,0,0,0-.151-.984l-1.974.307-.573-3.645,1.974-.307a.521.521,0,1,0-.151-.984l-1.974.307-.062-.375,1.979-.307a.521.521,0,1,0-.156-.979l-1.974.307-.573-3.645,1.979-.307a.521.521,0,0,0-.156-.979l-1.974.307-.057-.38,1.974-.307a.521.521,0,1,0-.151-.979l-1.979.307-.568-3.671,1.974-.307a.521.521,0,1,0-.151-.979l-1.979.307-.057-.38,1.979-.307a.521.521,0,0,0-.156-.979l-1.974.307-.573-3.671,1.979-.307a.521.521,0,0,0-.156-.979l-1.974.307-.057-.38,1.974-.307a.5.5,0,1,0-.151-.979l-1.979.307-.568-3.671,1.974-.307a.5.5,0,1,0-.151-.979l-1.979.307-.057-.375,1.974-.307a.521.521,0,0,0-.151-.984l-1.974.307-.573-3.645Z" transform="translate(-148.616 -136.78)" opacity="0.3"/>
      <path id="Tracé_5118" data-name="Tracé 5118" d="M153.4,281.464l90.172-14.03L223.446,138.1l-90.177,14.061a4.213,4.213,0,0,0-3.515,4.812l18.852,120.976a4.208,4.208,0,0,0,4.791,3.515Z" transform="translate(-129.702 -137.413)" fill="#263238" stroke="#263238" stroke-linecap="round" stroke-miterlimit="10" stroke-width="1"/>
      <path id="Tracé_5119" data-name="Tracé 5119" d="M0,0H5.208a1.38,1.38,0,0,1,1.38,1.38V13.15a1.38,1.38,0,0,1-1.38,1.38H0Z" transform="translate(25.369 139.532) rotate(171.15)" fill="#fff" stroke="#263238" stroke-linecap="round" stroke-miterlimit="10" stroke-width="1"/>
      <path id="Tracé_5120" data-name="Tracé 5120" d="M0,0H5.208a1.38,1.38,0,0,1,1.38,1.38V13.15a1.38,1.38,0,0,1-1.38,1.38H0Z" transform="translate(23.023 124.44) rotate(171.15)" fill="#e34168" stroke="#263238" stroke-linecap="round" stroke-miterlimit="10" stroke-width="1"/>
      <path id="Tracé_5121" data-name="Tracé 5121" d="M0,0H5.208a1.38,1.38,0,0,1,1.38,1.38V13.15a1.38,1.38,0,0,1-1.38,1.38H0Z" transform="translate(20.669 109.323) rotate(171.15)" fill="#fff" stroke="#263238" stroke-linecap="round" stroke-miterlimit="10" stroke-width="1"/>
      <path id="Tracé_5122" data-name="Tracé 5122" d="M0,0H5.208a1.38,1.38,0,0,1,1.38,1.38V13.15a1.38,1.38,0,0,1-1.38,1.38H0Z" transform="translate(18.324 94.236) rotate(171.15)" fill="#e34168" stroke="#263238" stroke-linecap="round" stroke-miterlimit="10" stroke-width="1"/>
      <path id="Tracé_5123" data-name="Tracé 5123" d="M141.85,202.381l3.078-.479-7.848-50.411,94.344-14.681,20.123,129.329L157.208,280.8l-10.046-64.545-3.078.479a1.375,1.375,0,0,1-1.562-1.151l-1.838-11.629a1.38,1.38,0,0,1,1.167-1.578Z" transform="translate(-133.238 -136.794)" fill="#fff" stroke="#263238" stroke-linecap="round" stroke-miterlimit="10" stroke-width="1"/>
      <path id="Tracé_5124" data-name="Tracé 5124" d="M165.61,213.653l.312,7.067,35.2-5.744-.922-5.916Z" transform="translate(-146.91 -171.418)" fill="#e34168"/>
      <path id="Tracé_5125" data-name="Tracé 5125" d="M308.153,150.062a1.844,1.844,0,1,0,1.536-2.083,1.843,1.843,0,0,0-1.536,2.083Z" transform="translate(-215.211 -142.136)" fill="#263238" stroke="#263238" stroke-linecap="round" stroke-miterlimit="10" stroke-width="1"/>
      <path id="Tracé_5126" data-name="Tracé 5126" d="M311.489,149.205l5.51-.859a.521.521,0,0,0,.411-.568h0a.521.521,0,0,0-.568-.411l-5.489.849a.521.521,0,0,0-.417.568h0A.521.521,0,0,0,311.489,149.205Z" transform="translate(-216.553 -141.852)" fill="#fff" stroke="#263238" stroke-linecap="round" stroke-miterlimit="10" stroke-width="1"/>
      <path id="Tracé_5127" data-name="Tracé 5127" d="M311.91,151.805l5.5-.854a.521.521,0,0,0,.417-.568h0a.521.521,0,0,0-.568-.417l-5.51.859a.521.521,0,0,0-.411.568h0A.521.521,0,0,0,311.91,151.805Z" transform="translate(-216.745 -143.098)" fill="#fff" stroke="#263238" stroke-linecap="round" stroke-miterlimit="10" stroke-width="1"/>
      <path id="Tracé_5128" data-name="Tracé 5128" d="M309.983,161.6a1.844,1.844,0,1,0,1.562-2.083,1.844,1.844,0,0,0-1.562,2.083Z" transform="translate(-216.088 -147.665)" fill="#263238" stroke="#263238" stroke-linecap="round" stroke-miterlimit="10" stroke-width="1"/>
      <path id="Tracé_5129" data-name="Tracé 5129" d="M313.3,160.735l5.5-.854a.521.521,0,0,0,.417-.568h0a.521.521,0,0,0-.568-.417l-5.51.859a.521.521,0,0,0-.411.568h0A.521.521,0,0,0,313.3,160.735Z" transform="translate(-217.415 -147.378)" fill="#fff" stroke="#263238" stroke-linecap="round" stroke-miterlimit="10" stroke-width="1"/>
      <path id="Tracé_5130" data-name="Tracé 5130" d="M313.7,163.305l5.51-.854a.521.521,0,0,0,.411-.568h0a.521.521,0,0,0-.568-.417l-5.5.859a.521.521,0,0,0-.417.568h0A.521.521,0,0,0,313.7,163.305Z" transform="translate(-217.607 -148.609)" fill="#fff" stroke="#263238" stroke-linecap="round" stroke-miterlimit="10" stroke-width="1"/>
      <path id="Tracé_5131" data-name="Tracé 5131" d="M311.743,173.132a1.844,1.844,0,1,0,1.536-2.083A1.843,1.843,0,0,0,311.743,173.132Z" transform="translate(-216.931 -153.192)" fill="#263238" stroke="#263238" stroke-linecap="round" stroke-miterlimit="10" stroke-width="1"/>
      <path id="Tracé_5132" data-name="Tracé 5132" d="M315.095,172.305l5.51-.854a.521.521,0,0,0,.411-.568h0a.521.521,0,0,0-.568-.417l-5.5.859a.521.521,0,0,0-.417.568h0A.521.521,0,0,0,315.095,172.305Z" transform="translate(-218.273 -152.922)" fill="#fff" stroke="#263238" stroke-linecap="round" stroke-miterlimit="10" stroke-width="1"/>
      <path id="Tracé_5133" data-name="Tracé 5133" d="M315.475,174.885l5.5-.859a.521.521,0,0,0,.417-.562h0a.521.521,0,0,0-.568-.417l-5.5.859a.521.521,0,0,0-.417.562h0A.521.521,0,0,0,315.475,174.885Z" transform="translate(-218.456 -154.159)" fill="#fff" stroke="#263238" stroke-linecap="round" stroke-miterlimit="10" stroke-width="1"/>
      <path id="Tracé_5134" data-name="Tracé 5134" d="M313.533,184.676a1.844,1.844,0,1,0,1.562-2.083,1.844,1.844,0,0,0-1.562,2.083Z" transform="translate(-217.79 -158.725)" fill="#263238" stroke="#263238" stroke-linecap="round" stroke-miterlimit="10" stroke-width="1"/>
      <path id="Tracé_5135" data-name="Tracé 5135" d="M316.9,183.815l5.51-.859a.521.521,0,0,0,.417-.562h0a.521.521,0,0,0-.568-.417l-5.51.859a.49.49,0,0,0-.411.562h0A.521.521,0,0,0,316.9,183.815Z" transform="translate(-219.138 -158.438)" fill="#fff" stroke="#263238" stroke-linecap="round" stroke-miterlimit="10" stroke-width="1"/>
      <path id="Tracé_5136" data-name="Tracé 5136" d="M317.3,186.423l5.51-.859a.49.49,0,0,0,.411-.568h0a.49.49,0,0,0-.562-.411l-5.51.854a.521.521,0,0,0-.411.568h0A.521.521,0,0,0,317.3,186.423Z" transform="translate(-219.332 -159.686)" fill="#fff" stroke="#263238" stroke-linecap="round" stroke-miterlimit="10" stroke-width="1"/>
      <path id="Tracé_5137" data-name="Tracé 5137" d="M315.333,196.212a1.844,1.844,0,1,0,1.536-2.083A1.843,1.843,0,0,0,315.333,196.212Z" transform="translate(-218.652 -164.252)" fill="#263238" stroke="#263238" stroke-linecap="round" stroke-miterlimit="10" stroke-width="1"/>
      <path id="Tracé_5138" data-name="Tracé 5138" d="M318.689,195.353l5.51-.859a.521.521,0,0,0,.411-.568h0a.49.49,0,0,0-.562-.411l-5.51.854a.521.521,0,0,0-.411.568h0A.521.521,0,0,0,318.689,195.353Z" transform="translate(-219.999 -163.965)" fill="#fff" stroke="#263238" stroke-linecap="round" stroke-miterlimit="10" stroke-width="1"/>
      <path id="Tracé_5139" data-name="Tracé 5139" d="M319.095,197.961l5.5-.864a.521.521,0,0,0,.417-.568h0a.521.521,0,0,0-.568-.411l-5.5.854a.521.521,0,0,0-.417.568h0A.521.521,0,0,0,319.095,197.961Z" transform="translate(-220.19 -165.214)" fill="#fff" stroke="#263238" stroke-linecap="round" stroke-miterlimit="10" stroke-width="1"/>
      <path id="Tracé_5140" data-name="Tracé 5140" d="M317.12,207.732a1.844,1.844,0,1,0,.34-1.381,1.844,1.844,0,0,0-.34,1.381Z" transform="translate(-219.507 -169.762)" fill="#263238" stroke="#263238" stroke-linecap="round" stroke-miterlimit="10" stroke-width="1"/>
      <path id="Tracé_5141" data-name="Tracé 5141" d="M320.475,206.9l5.5-.859a.521.521,0,0,0,.417-.568h0a.521.521,0,0,0-.568-.411l-5.5.854a.521.521,0,0,0-.417.568h0A.521.521,0,0,0,320.475,206.9Z" transform="translate(-220.852 -169.499)" fill="#fff" stroke="#263238" stroke-linecap="round" stroke-miterlimit="10" stroke-width="1"/>
      <path id="Tracé_5142" data-name="Tracé 5142" d="M320.9,209.5l5.51-.854a.521.521,0,0,0,.417-.568h0a.521.521,0,0,0-.568-.417l-5.51.859a.521.521,0,0,0-.411.568h0A.521.521,0,0,0,320.9,209.5Z" transform="translate(-221.058 -170.745)" fill="#fff" stroke="#263238" stroke-linecap="round" stroke-miterlimit="10" stroke-width="1"/>
      <path id="Tracé_5143" data-name="Tracé 5143" d="M318.923,219.282a1.844,1.844,0,1,0,1.536-2.083,1.843,1.843,0,0,0-1.536,2.083Z" transform="translate(-220.372 -175.308)" fill="#263238" stroke="#263238" stroke-linecap="round" stroke-miterlimit="10" stroke-width="1"/>
      <path id="Tracé_5144" data-name="Tracé 5144" d="M322.279,218.43l5.51-.854a.521.521,0,0,0,.417-.568h0a.521.521,0,0,0-.568-.411l-5.51.854a.521.521,0,0,0-.411.568h0a.484.484,0,0,0,.562.411Z" transform="translate(-221.719 -175.029)" fill="#fff" stroke="#263238" stroke-linecap="round" stroke-miterlimit="10" stroke-width="1"/>
      <path id="Tracé_5145" data-name="Tracé 5145" d="M322.685,221.035l5.51-.854a.521.521,0,0,0,.411-.568h0a.521.521,0,0,0-.568-.417l-5.5.859a.521.521,0,0,0-.417.568h0A.521.521,0,0,0,322.685,221.035Z" transform="translate(-221.911 -176.275)" fill="#fff" stroke="#263238" stroke-linecap="round" stroke-miterlimit="10" stroke-width="1"/>
      <path id="Tracé_5146" data-name="Tracé 5146" d="M320.723,230.822a1.844,1.844,0,1,0,1.536-2.083A1.843,1.843,0,0,0,320.723,230.822Z" transform="translate(-221.235 -180.838)" fill="#263238" stroke="#263238" stroke-linecap="round" stroke-miterlimit="10" stroke-width="1"/>
      <path id="Tracé_5147" data-name="Tracé 5147" d="M324.075,229.956l5.51-.865a.521.521,0,0,0,.411-.568h0a.521.521,0,0,0-.568-.417l-5.5.859a.521.521,0,0,0-.417.568h0A.521.521,0,0,0,324.075,229.956Z" transform="translate(-222.577 -180.545)" fill="#fff" stroke="#263238" stroke-linecap="round" stroke-miterlimit="10" stroke-width="1"/>
      <path id="Tracé_5148" data-name="Tracé 5148" d="M324.475,232.575l5.5-.859a.521.521,0,0,0,.417-.562h0a.521.521,0,0,0-.568-.417l-5.51.859a.521.521,0,0,0-.411.568h0A.521.521,0,0,0,324.475,232.575Z" transform="translate(-222.768 -181.805)" fill="#fff" stroke="#263238" stroke-linecap="round" stroke-miterlimit="10" stroke-width="1"/>
      <path id="Tracé_5149" data-name="Tracé 5149" d="M322.513,242.366a1.844,1.844,0,1,0,1.562-2.083A1.844,1.844,0,0,0,322.513,242.366Z" transform="translate(-222.093 -186.372)" fill="#263238" stroke="#263238" stroke-linecap="round" stroke-miterlimit="10" stroke-width="1"/>
      <path id="Tracé_5150" data-name="Tracé 5150" d="M325.889,241.505l5.52-.854a.521.521,0,0,0,.417-.568h0a.521.521,0,0,0-.568-.417l-5.51.859a.521.521,0,0,0-.411.568h0A.521.521,0,0,0,325.889,241.505Z" transform="translate(-223.454 -186.085)" fill="#fff" stroke="#263238" stroke-linecap="round" stroke-miterlimit="10" stroke-width="1"/>
      <path id="Tracé_5151" data-name="Tracé 5151" d="M326.275,244.115l5.51-.859a.521.521,0,0,0,.411-.568h0a.521.521,0,0,0-.568-.411l-5.5.859a.521.521,0,0,0-.417.562h0A.521.521,0,0,0,326.275,244.115Z" transform="translate(-223.632 -187.335)" fill="#fff" stroke="#263238" stroke-linecap="round" stroke-miterlimit="10" stroke-width="1"/>
      <path id="Tracé_5152" data-name="Tracé 5152" d="M324.313,253.9a1.844,1.844,0,1,0,1.536-2.083A1.843,1.843,0,0,0,324.313,253.9Z" transform="translate(-222.955 -191.899)" fill="#263238" stroke="#263238" stroke-linecap="round" stroke-miterlimit="10" stroke-width="1"/>
      <path id="Tracé_5153" data-name="Tracé 5153" d="M327.665,253.045l5.51-.859a.521.521,0,0,0,.411-.568h0a.521.521,0,0,0-.568-.411l-5.5.859a.521.521,0,0,0-.417.562h0A.521.521,0,0,0,327.665,253.045Z" transform="translate(-224.298 -191.615)" fill="#fff" stroke="#263238" stroke-linecap="round" stroke-miterlimit="10" stroke-width="1"/>
      <path id="Tracé_5154" data-name="Tracé 5154" d="M328.075,255.655l5.5-.859a.521.521,0,0,0,.417-.568h0a.521.521,0,0,0-.568-.411l-5.51.854a.521.521,0,0,0-.411.568h0A.521.521,0,0,0,328.075,255.655Z" transform="translate(-224.494 -192.865)" fill="#fff" stroke="#263238" stroke-linecap="round" stroke-miterlimit="10" stroke-width="1"/>
      <path id="Tracé_5155" data-name="Tracé 5155" d="M326.1,265.422a1.844,1.844,0,1,0,.34-1.381A1.844,1.844,0,0,0,326.1,265.422Z" transform="translate(-223.81 -197.409)" fill="#263238" stroke="#263238" stroke-linecap="round" stroke-miterlimit="10" stroke-width="1"/>
      <path id="Tracé_5156" data-name="Tracé 5156" d="M329.475,264.585l5.5-.859a.521.521,0,0,0,.417-.568h0a.521.521,0,0,0-.568-.411l-5.51.854a.521.521,0,0,0-.411.568h0A.521.521,0,0,0,329.475,264.585Z" transform="translate(-225.165 -197.145)" fill="#fff" stroke="#263238" stroke-linecap="round" stroke-miterlimit="10" stroke-width="1"/>
      <path id="Tracé_5157" data-name="Tracé 5157" d="M329.865,267.187l5.525-.854a.521.521,0,0,0,.411-.568h0a.484.484,0,0,0-.562-.411l-5.525.854a.521.521,0,0,0-.417.568h0A.521.521,0,0,0,329.865,267.187Z" transform="translate(-225.352 -198.392)" fill="#fff" stroke="#263238" stroke-linecap="round" stroke-miterlimit="10" stroke-width="1"/>
      <path id="Tracé_5158" data-name="Tracé 5158" d="M327.9,276.972a1.844,1.844,0,1,0,1.536-2.083,1.844,1.844,0,0,0-1.536,2.083Z" transform="translate(-224.676 -202.954)" fill="#263238" stroke="#263238" stroke-linecap="round" stroke-miterlimit="10" stroke-width="1"/>
      <path id="Tracé_5159" data-name="Tracé 5159" d="M331.255,276.126l5.51-.859a.521.521,0,0,0,.411-.568h0a.521.521,0,0,0-.562-.411l-5.51.854a.521.521,0,0,0-.417.568h0A.521.521,0,0,0,331.255,276.126Z" transform="translate(-226.018 -202.676)" fill="#fff" stroke="#263238" stroke-linecap="round" stroke-miterlimit="10" stroke-width="1"/>
      <path id="Tracé_5160" data-name="Tracé 5160" d="M331.665,278.725l5.5-.854a.521.521,0,0,0,.417-.568h0a.521.521,0,0,0-.568-.417l-5.5.859a.521.521,0,0,0-.417.568h0A.521.521,0,0,0,331.665,278.725Z" transform="translate(-226.214 -203.921)" fill="#fff" stroke="#263238" stroke-linecap="round" stroke-miterlimit="10" stroke-width="1"/>
      <path id="Tracé_5161" data-name="Tracé 5161" d="M329.694,288.516a1.844,1.844,0,1,0,1.562-2.083A1.844,1.844,0,0,0,329.694,288.516Z" transform="translate(-225.535 -208.488)" fill="#263238" stroke="#263238" stroke-linecap="round" stroke-miterlimit="10" stroke-width="1"/>
      <path id="Tracé_5162" data-name="Tracé 5162" d="M333.055,287.655l5.5-.854a.521.521,0,0,0,.417-.568h0a.521.521,0,0,0-.568-.417l-5.5.859a.521.521,0,0,0-.417.568h0A.521.521,0,0,0,333.055,287.655Z" transform="translate(-226.88 -208.201)" fill="#fff" stroke="#263238" stroke-linecap="round" stroke-miterlimit="10" stroke-width="1"/>
      <path id="Tracé_5163" data-name="Tracé 5163" d="M333.479,290.306l5.51-.854a.521.521,0,0,0,.411-.568h0a.521.521,0,0,0-.562-.417l-5.51.859a.521.521,0,0,0-.411.568h0a.49.49,0,0,0,.562.411Z" transform="translate(-227.086 -209.471)" fill="#fff" stroke="#263238" stroke-linecap="round" stroke-miterlimit="10" stroke-width="1"/>
      <path id="Tracé_5164" data-name="Tracé 5164" d="M331.493,300.062a1.844,1.844,0,1,0,1.536-2.083,1.844,1.844,0,0,0-1.536,2.083Z" transform="translate(-226.396 -214.02)" fill="#263238" stroke="#263238" stroke-linecap="round" stroke-miterlimit="10" stroke-width="1"/>
      <path id="Tracé_5165" data-name="Tracé 5165" d="M334.846,299.2l5.536-.854a.489.489,0,0,0,.411-.568h0a.521.521,0,0,0-.562-.417l-5.536.854a.49.49,0,0,0-.411.568h0a.49.49,0,0,0,.562.417Z" transform="translate(-227.739 -213.732)" fill="#fff" stroke="#263238" stroke-linecap="round" stroke-miterlimit="10" stroke-width="1"/>
      <path id="Tracé_5166" data-name="Tracé 5166" d="M335.255,301.805l5.5-.859a.489.489,0,0,0,.417-.562h0a.521.521,0,0,0-.568-.417l-5.5.859a.521.521,0,0,0-.417.562h0A.521.521,0,0,0,335.255,301.805Z" transform="translate(-227.935 -214.982)" fill="#fff" stroke="#263238" stroke-linecap="round" stroke-miterlimit="10" stroke-width="1"/>
      <path id="Tracé_5167" data-name="Tracé 5167" d="M333.284,311.6a1.844,1.844,0,1,0,1.562-2.083A1.844,1.844,0,0,0,333.284,311.6Z" transform="translate(-227.255 -219.549)" fill="#263238" stroke="#263238" stroke-linecap="round" stroke-miterlimit="10" stroke-width="1"/>
      <path id="Tracé_5168" data-name="Tracé 5168" d="M336.645,310.735l5.5-.859a.521.521,0,0,0,.417-.562h0A.521.521,0,0,0,342,308.9l-5.5.859a.521.521,0,0,0-.417.562h0A.521.521,0,0,0,336.645,310.735Z" transform="translate(-228.601 -219.261)" fill="#fff" stroke="#263238" stroke-linecap="round" stroke-miterlimit="10" stroke-width="1"/>
      <path id="Tracé_5169" data-name="Tracé 5169" d="M337.055,313.305l5.5-.859a.521.521,0,0,0,.417-.568h0a.521.521,0,0,0-.568-.411l-5.51.854a.521.521,0,0,0-.411.568h0A.521.521,0,0,0,337.055,313.305Z" transform="translate(-228.797 -220.493)" fill="#fff" stroke="#263238" stroke-linecap="round" stroke-miterlimit="10" stroke-width="1"/>
      <path id="Tracé_5170" data-name="Tracé 5170" d="M335.083,323.132a1.844,1.844,0,1,0,1.536-2.083,1.844,1.844,0,0,0-1.536,2.083Z" transform="translate(-228.116 -225.075)" fill="#263238" stroke="#263238" stroke-linecap="round" stroke-miterlimit="10" stroke-width="1"/>
      <path id="Tracé_5171" data-name="Tracé 5171" d="M338.475,322.305l5.5-.859a.521.521,0,0,0,.417-.568h0a.521.521,0,0,0-.568-.411l-5.51.854a.521.521,0,0,0-.411.568h0A.521.521,0,0,0,338.475,322.305Z" transform="translate(-229.478 -224.806)" fill="#fff" stroke="#263238" stroke-linecap="round" stroke-miterlimit="10" stroke-width="1"/>
      <path id="Tracé_5172" data-name="Tracé 5172" d="M338.869,324.885l5.536-.859a.521.521,0,0,0,.411-.568h0a.521.521,0,0,0-.568-.411l-5.5.854a.521.521,0,0,0-.417.568h0A.521.521,0,0,0,338.869,324.885Z" transform="translate(-229.679 -226.042)" fill="#fff" stroke="#263238" stroke-linecap="round" stroke-miterlimit="10" stroke-width="1"/>
      <path id="Tracé_5173" data-name="Tracé 5173" d="M336.88,334.652a1.843,1.843,0,1,0,.34-1.381A1.844,1.844,0,0,0,336.88,334.652Z" transform="translate(-228.976 -230.586)" fill="#263238" stroke="#263238" stroke-linecap="round" stroke-miterlimit="10" stroke-width="1"/>
      <path id="Tracé_5174" data-name="Tracé 5174" d="M340.216,333.822l5.51-.859a.521.521,0,0,0,.411-.568h0a.521.521,0,0,0-.588-.4l-5.5.854a.521.521,0,0,0-.417.568h0A.521.521,0,0,0,340.216,333.822Z" transform="translate(-230.302 -230.328)" fill="#fff" stroke="#263238" stroke-linecap="round" stroke-miterlimit="10" stroke-width="1"/>
      <path id="Tracé_5175" data-name="Tracé 5175" d="M340.645,336.415l5.5-.854a.521.521,0,0,0,.417-.568h0a.521.521,0,0,0-.568-.417l-5.51.859a.521.521,0,0,0-.411.568h0A.521.521,0,0,0,340.645,336.415Z" transform="translate(-230.518 -231.568)" fill="#fff" stroke="#263238" stroke-linecap="round" stroke-miterlimit="10" stroke-width="1"/>
      <path id="Tracé_5176" data-name="Tracé 5176" d="M338.673,346.2a1.844,1.844,0,1,0,1.536-2.083A1.844,1.844,0,0,0,338.673,346.2Z" transform="translate(-229.837 -236.131)" fill="#263238" stroke="#263238" stroke-linecap="round" stroke-miterlimit="10" stroke-width="1"/>
      <path id="Tracé_5177" data-name="Tracé 5177" d="M342.035,345.307l5.5-.854a.521.521,0,0,0,.417-.568h0a.49.49,0,0,0-.568-.411l-5.51.854a.521.521,0,0,0-.411.568h0a.49.49,0,0,0,.568.411Z" transform="translate(-231.184 -235.829)" fill="#fff" stroke="#263238" stroke-linecap="round" stroke-miterlimit="10" stroke-width="1"/>
      <path id="Tracé_5178" data-name="Tracé 5178" d="M342.456,347.951l5.489-.859a.521.521,0,0,0,.411-.568h0a.521.521,0,0,0-.568-.417l-5.5.859a.521.521,0,0,0-.417.568h0A.521.521,0,0,0,342.456,347.951Z" transform="translate(-231.375 -237.093)" fill="#fff" stroke="#263238" stroke-linecap="round" stroke-miterlimit="10" stroke-width="1"/>
      <path id="Tracé_5179" data-name="Tracé 5179" d="M340.473,357.742a1.844,1.844,0,1,0,1.536-2.083A1.844,1.844,0,0,0,340.473,357.742Z" transform="translate(-230.7 -241.661)" fill="#263238" stroke="#263238" stroke-linecap="round" stroke-miterlimit="10" stroke-width="1"/>
      <path id="Tracé_5180" data-name="Tracé 5180" d="M343.825,356.885l5.51-.854a.521.521,0,0,0,.411-.568h0a.521.521,0,0,0-.568-.417l-5.5.859a.521.521,0,0,0-.417.568h0A.521.521,0,0,0,343.825,356.885Z" transform="translate(-232.042 -241.378)" fill="#fff" stroke="#263238" stroke-linecap="round" stroke-miterlimit="10" stroke-width="1"/>
      <path id="Tracé_5181" data-name="Tracé 5181" d="M344.235,359.5l5.5-.859a.521.521,0,0,0,.417-.562h0a.521.521,0,0,0-.568-.417l-5.51.859a.521.521,0,0,0-.411.568h0A.521.521,0,0,0,344.235,359.5Z" transform="translate(-232.238 -242.628)" fill="#fff" stroke="#263238" stroke-linecap="round" stroke-miterlimit="10" stroke-width="1"/>
      <path id="Tracé_5182" data-name="Tracé 5182" d="M342.263,369.285a1.844,1.844,0,1,0,1.562-2.083,1.844,1.844,0,0,0-1.562,2.083Z" transform="translate(-231.558 -247.195)" fill="#263238" stroke="#263238" stroke-linecap="round" stroke-miterlimit="10" stroke-width="1"/>
      <path id="Tracé_5183" data-name="Tracé 5183" d="M345.625,368.425l5.5-.854a.521.521,0,0,0,.417-.568h0a.521.521,0,0,0-.568-.417l-5.51.859a.521.521,0,0,0-.411.568h0A.521.521,0,0,0,345.625,368.425Z" transform="translate(-232.904 -246.908)" fill="#fff" stroke="#263238" stroke-linecap="round" stroke-miterlimit="10" stroke-width="1"/>
      <path id="Tracé_5184" data-name="Tracé 5184" d="M346.026,371.033l5.51-.859a.521.521,0,0,0,.411-.568h0a.49.49,0,0,0-.562-.411l-5.51.859a.484.484,0,0,0-.411.562h0A.521.521,0,0,0,346.026,371.033Z" transform="translate(-233.097 -248.156)" fill="#fff" stroke="#263238" stroke-linecap="round" stroke-miterlimit="10" stroke-width="1"/>
      <g id="Groupe_14248" data-name="Groupe 14248" transform="translate(14.315 15.545)" opacity="0.3">
        <line id="Ligne_576" data-name="Ligne 576" y1="0.208" x2="1.37" transform="translate(17.649 4.416)" fill="none" stroke="#000" stroke-linecap="round" stroke-miterlimit="10" stroke-width="1"/>
        <line id="Ligne_577" data-name="Ligne 577" y1="0.214" x2="1.37" transform="translate(20.388 3.989)" fill="none" stroke="#000" stroke-linecap="round" stroke-miterlimit="10" stroke-width="1"/>
        <line id="Ligne_578" data-name="Ligne 578" y1="0.214" x2="1.364" transform="translate(4.265 8.426)" fill="none" stroke="#000" stroke-linecap="round" stroke-miterlimit="10" stroke-width="1"/>
        <line id="Ligne_579" data-name="Ligne 579" y1="0.214" x2="1.37" transform="translate(6.999 7.999)" fill="none" stroke="#000" stroke-linecap="round" stroke-miterlimit="10" stroke-width="1"/>
        <line id="Ligne_580" data-name="Ligne 580" y1="0.214" x2="1.364" transform="translate(9.738 7.577)" fill="none" stroke="#000" stroke-linecap="round" stroke-miterlimit="10" stroke-width="1"/>
        <line id="Ligne_581" data-name="Ligne 581" y1="0.214" x2="1.37" transform="translate(12.473 7.15)" fill="none" stroke="#000" stroke-linecap="round" stroke-miterlimit="10" stroke-width="1"/>
        <line id="Ligne_582" data-name="Ligne 582" y1="0.214" x2="1.37" transform="translate(15.207 6.723)" fill="none" stroke="#000" stroke-linecap="round" stroke-miterlimit="10" stroke-width="1"/>
        <line id="Ligne_583" data-name="Ligne 583" y1="0.214" x2="1.364" transform="translate(17.946 6.296)" fill="none" stroke="#000" stroke-linecap="round" stroke-miterlimit="10" stroke-width="1"/>
        <line id="Ligne_584" data-name="Ligne 584" y1="0.208" x2="1.37" transform="translate(20.68 5.874)" fill="none" stroke="#000" stroke-linecap="round" stroke-miterlimit="10" stroke-width="1"/>
        <line id="Ligne_585" data-name="Ligne 585" y1="0.214" x2="1.37" transform="translate(4.557 10.311)" fill="none" stroke="#000" stroke-linecap="round" stroke-miterlimit="10" stroke-width="1"/>
        <line id="Ligne_586" data-name="Ligne 586" y1="0.214" x2="1.37" transform="translate(7.291 9.884)" fill="none" stroke="#000" stroke-linecap="round" stroke-miterlimit="10" stroke-width="1"/>
        <line id="Ligne_587" data-name="Ligne 587" y1="0.208" x2="1.37" transform="translate(10.03 9.462)" fill="none" stroke="#000" stroke-linecap="round" stroke-miterlimit="10" stroke-width="1"/>
        <line id="Ligne_588" data-name="Ligne 588" y1="0.214" x2="1.37" transform="translate(12.764 9.035)" fill="none" stroke="#000" stroke-linecap="round" stroke-miterlimit="10" stroke-width="1"/>
        <line id="Ligne_589" data-name="Ligne 589" y1="0.214" x2="1.364" transform="translate(15.503 8.608)" fill="none" stroke="#000" stroke-linecap="round" stroke-miterlimit="10" stroke-width="1"/>
        <line id="Ligne_590" data-name="Ligne 590" y1="0.214" x2="1.37" transform="translate(18.238 8.181)" fill="none" stroke="#000" stroke-linecap="round" stroke-miterlimit="10" stroke-width="1"/>
        <line id="Ligne_591" data-name="Ligne 591" y1="0.214" x2="1.37" transform="translate(20.972 7.754)" fill="none" stroke="#000" stroke-linecap="round" stroke-miterlimit="10" stroke-width="1"/>
        <line id="Ligne_592" data-name="Ligne 592" y1="0.214" x2="1.37" transform="translate(4.848 12.197)" fill="none" stroke="#000" stroke-linecap="round" stroke-miterlimit="10" stroke-width="1"/>
        <line id="Ligne_593" data-name="Ligne 593" y1="0.214" x2="1.364" transform="translate(7.588 11.77)" fill="none" stroke="#000" stroke-linecap="round" stroke-miterlimit="10" stroke-width="1"/>
        <line id="Ligne_594" data-name="Ligne 594" y1="0.214" x2="1.37" transform="translate(10.322 11.342)" fill="none" stroke="#000" stroke-linecap="round" stroke-miterlimit="10" stroke-width="1"/>
        <line id="Ligne_595" data-name="Ligne 595" y1="0.214" x2="1.364" transform="translate(13.061 10.921)" fill="none" stroke="#000" stroke-linecap="round" stroke-miterlimit="10" stroke-width="1"/>
        <line id="Ligne_596" data-name="Ligne 596" y1="0.214" x2="1.37" transform="translate(15.795 10.494)" fill="none" stroke="#000" stroke-linecap="round" stroke-miterlimit="10" stroke-width="1"/>
        <line id="Ligne_597" data-name="Ligne 597" y1="0.214" x2="1.37" transform="translate(18.529 10.067)" fill="none" stroke="#000" stroke-linecap="round" stroke-miterlimit="10" stroke-width="1"/>
        <line id="Ligne_598" data-name="Ligne 598" y1="0.214" x2="1.364" transform="translate(21.268 9.64)" fill="none" stroke="#000" stroke-linecap="round" stroke-miterlimit="10" stroke-width="1"/>
        <line id="Ligne_599" data-name="Ligne 599" y1="0.214" x2="1.364" transform="translate(5.145 14.082)" fill="none" stroke="#000" stroke-linecap="round" stroke-miterlimit="10" stroke-width="1"/>
        <line id="Ligne_600" data-name="Ligne 600" y1="0.214" x2="1.37" transform="translate(7.879 13.655)" fill="none" stroke="#000" stroke-linecap="round" stroke-miterlimit="10" stroke-width="1"/>
        <line id="Ligne_601" data-name="Ligne 601" y1="0.214" x2="1.37" transform="translate(10.613 13.228)" fill="none" stroke="#000" stroke-linecap="round" stroke-miterlimit="10" stroke-width="1"/>
        <line id="Ligne_602" data-name="Ligne 602" y1="0.208" x2="1.37" transform="translate(13.353 12.806)" fill="none" stroke="#000" stroke-linecap="round" stroke-miterlimit="10" stroke-width="1"/>
        <line id="Ligne_603" data-name="Ligne 603" y1="0.214" x2="1.37" transform="translate(16.087 12.379)" fill="none" stroke="#000" stroke-linecap="round" stroke-miterlimit="10" stroke-width="1"/>
        <line id="Ligne_604" data-name="Ligne 604" y1="0.214" x2="1.364" transform="translate(18.826 11.952)" fill="none" stroke="#000" stroke-linecap="round" stroke-miterlimit="10" stroke-width="1"/>
        <line id="Ligne_605" data-name="Ligne 605" y1="0.214" x2="1.37" transform="translate(21.56 11.525)" fill="none" stroke="#000" stroke-linecap="round" stroke-miterlimit="10" stroke-width="1"/>
        <line id="Ligne_606" data-name="Ligne 606" y1="0.214" x2="1.37" transform="translate(3.583 4.067)" fill="none" stroke="#000" stroke-linecap="round" stroke-miterlimit="10" stroke-width="1"/>
        <line id="Ligne_607" data-name="Ligne 607" y1="0.208" x2="1.37" transform="translate(6.322 3.645)" fill="none" stroke="#000" stroke-linecap="round" stroke-miterlimit="10" stroke-width="1"/>
        <line id="Ligne_608" data-name="Ligne 608" y1="0.214" x2="1.37" transform="translate(9.056 3.218)" fill="none" stroke="#000" stroke-linecap="round" stroke-miterlimit="10" stroke-width="1"/>
        <line id="Ligne_609" data-name="Ligne 609" y1="0.214" x2="1.364" transform="translate(11.796 2.791)" fill="none" stroke="#000" stroke-linecap="round" stroke-miterlimit="10" stroke-width="1"/>
        <line id="Ligne_610" data-name="Ligne 610" y1="0.214" x2="1.37" transform="translate(14.53 2.364)" fill="none" stroke="#000" stroke-linecap="round" stroke-miterlimit="10" stroke-width="1"/>
        <line id="Ligne_611" data-name="Ligne 611" y1="0.208" x2="1.364" transform="translate(17.269 1.942)" fill="none" stroke="#000" stroke-linecap="round" stroke-miterlimit="10" stroke-width="1"/>
        <line id="Ligne_612" data-name="Ligne 612" y1="0.214" x2="1.37" transform="translate(20.003 1.515)" fill="none" stroke="#000" stroke-linecap="round" stroke-miterlimit="10" stroke-width="1"/>
        <line id="Ligne_613" data-name="Ligne 613" x1="18.019" y2="2.802" transform="translate(3.635 2.557)" fill="none" stroke="#000" stroke-linecap="round" stroke-miterlimit="10" stroke-width="1"/>
        <line id="Ligne_614" data-name="Ligne 614" y1="1.083" x2="6.952" transform="translate(8.634)" fill="none" stroke="#000" stroke-linecap="round" stroke-miterlimit="10" stroke-width="1"/>
        <line id="Ligne_615" data-name="Ligne 615" y1="11.931" x2="76.674" transform="translate(0 8.588)" fill="none" stroke="#000" stroke-linecap="round" stroke-miterlimit="10" stroke-width="1"/>
        <line id="Ligne_616" data-name="Ligne 616" y1="11.931" x2="76.669" transform="translate(0.963 14.764)" fill="none" stroke="#000" stroke-linecap="round" stroke-miterlimit="10" stroke-width="1"/>
        <line id="Ligne_617" data-name="Ligne 617" y1="11.931" x2="76.674" transform="translate(1.922 20.935)" fill="none" stroke="#000" stroke-linecap="round" stroke-miterlimit="10" stroke-width="1"/>
        <line id="Ligne_618" data-name="Ligne 618" y1="11.931" x2="76.669" transform="translate(2.885 27.112)" fill="none" stroke="#000" stroke-linecap="round" stroke-miterlimit="10" stroke-width="1"/>
        <line id="Ligne_619" data-name="Ligne 619" y1="11.931" x2="76.674" transform="translate(3.843 33.288)" fill="none" stroke="#000" stroke-linecap="round" stroke-miterlimit="10" stroke-width="1"/>
        <line id="Ligne_620" data-name="Ligne 620" y1="11.936" x2="76.669" transform="translate(4.807 39.459)" fill="none" stroke="#000" stroke-linecap="round" stroke-miterlimit="10" stroke-width="1"/>
        <line id="Ligne_621" data-name="Ligne 621" y1="11.931" x2="76.674" transform="translate(5.765 45.636)" fill="none" stroke="#000" stroke-linecap="round" stroke-miterlimit="10" stroke-width="1"/>
        <line id="Ligne_622" data-name="Ligne 622" y1="11.931" x2="76.669" transform="translate(6.728 51.812)" fill="none" stroke="#000" stroke-linecap="round" stroke-miterlimit="10" stroke-width="1"/>
        <line id="Ligne_623" data-name="Ligne 623" y1="11.931" x2="76.674" transform="translate(7.687 57.988)" fill="none" stroke="#000" stroke-linecap="round" stroke-miterlimit="10" stroke-width="1"/>
        <line id="Ligne_624" data-name="Ligne 624" y1="11.936" x2="76.669" transform="translate(8.65 64.159)" fill="none" stroke="#000" stroke-linecap="round" stroke-miterlimit="10" stroke-width="1"/>
        <line id="Ligne_625" data-name="Ligne 625" y1="11.931" x2="76.674" transform="translate(9.608 70.336)" fill="none" stroke="#000" stroke-linecap="round" stroke-miterlimit="10" stroke-width="1"/>
        <line id="Ligne_626" data-name="Ligne 626" y1="11.931" x2="76.674" transform="translate(10.572 76.512)" fill="none" stroke="#000" stroke-linecap="round" stroke-miterlimit="10" stroke-width="1"/>
        <line id="Ligne_627" data-name="Ligne 627" y1="11.931" x2="76.674" transform="translate(11.53 82.689)" fill="none" stroke="#000" stroke-linecap="round" stroke-miterlimit="10" stroke-width="1"/>
        <line id="Ligne_628" data-name="Ligne 628" y1="11.931" x2="76.669" transform="translate(13.816 97.354)" fill="none" stroke="#000" stroke-linecap="round" stroke-miterlimit="10" stroke-width="1"/>
        <line id="Ligne_629" data-name="Ligne 629" y1="11.936" x2="76.669" transform="translate(14.576 102.239)" fill="none" stroke="#000" stroke-linecap="round" stroke-miterlimit="10" stroke-width="1"/>
        <line id="Ligne_630" data-name="Ligne 630" y1="11.931" x2="76.669" transform="translate(15.337 107.129)" fill="none" stroke="#000" stroke-linecap="round" stroke-miterlimit="10" stroke-width="1"/>
      </g>
      <path id="Tracé_5185" data-name="Tracé 5185" d="M174.567,217.241s-6.541,7.077-2.76,5.963,8.952-8.509,7.853-5.437-1.042,5.166.734,3.047,2.771-2.541,2.411-1.432,1.109.354,1.109.354,3.645-2.146,3.265-1.042-.609,1.151.422.989l3.343-.521s-.219.3,2.869-.182,4.291-1.193,5.838-1.432" transform="translate(-149.316 -175.236)" fill="none" stroke="#263238" stroke-linecap="round" stroke-miterlimit="10" stroke-width="1"/>
      <path id="Tracé_5186" data-name="Tracé 5186" d="M172.49,221.731s5.041-3.156,5.676-2.463-.234,1.88,2.041,1.265,4.348-2.521,4.51-1.495,1.625.276,1.625.276l1.286-.2a11.989,11.989,0,0,0,3.088-.479c.734-.38,1.495-3.921.932.911s-2.536.656,2.156-1.39,5.562.187,5.562.187a7.192,7.192,0,0,0,1.505-.521c.984-.422,1.854-1.609,2.786-.7s2.6-1.984,2.6-1.984a15.265,15.265,0,0,1,1.922.49,4.5,4.5,0,0,0,1.88.234,14.279,14.279,0,0,0,2.354-.1c1.042-.161,1.9-1.349,2.75-.953s2.135-3.234,1.489,1.083-4.822,6.286-3.125,3.645a21.617,21.617,0,0,1,5.671-5.89c1.9-1.349,2.453-1.172,2.869-.182s.932.906,1.922.49.141-.812.989-.417a2.474,2.474,0,0,0,1.88.234c.776-.12-2.843,2.026.776-.12s4.911-10.78,3.015-6-1.177,5.984,1.359,5.322" transform="translate(-150.207 -170.06)" fill="none" stroke="#263238" stroke-linecap="round" stroke-miterlimit="10" stroke-width="1"/>
      <path id="Tracé_5187" data-name="Tracé 5187" d="M173.54,243.06s6.187-5.968,5.807-6.7-2.354.1-3.8,2.7-.427,4.02,3.453,1.838-1.765.521,2.219.708,5.161-2.385,5.281-1.614-1.208.713,1.922.521,1.6-1.562,4.807-1.276,4.635-.724,4.635-.724l2.057-.318s-4.166.38,1.245-.458,7.786-7.536,5.182-3.968-1.38,4.687,1.292,3.224l2.672-1.469s3.375-3.687,1.781,1.3-3.479,1.333,2.453-1.172,5.781-.109,7.76-.943,1.656-2.9,2.968-1.255,1.229,1.13,3.286.807,1.505-.521,3.307-.776l3.885-.615" transform="translate(-150.71 -182.759)" fill="none" stroke="#263238" stroke-linecap="round" stroke-miterlimit="10" stroke-width="1"/>
      <path id="Tracé_5188" data-name="Tracé 5188" d="M175.54,280.237s4.312-2.781,5-6.843-2.713,1.213-2.343,6.952-1.651-2.114,4.364-4.1-.521,1.667.146,2.6,5.6-2.979,5.541-1.656,1.042,1.682,4.072-.9-1.9-2.083-2.135-.193,1.229,1.125,4.968-.25.078.521,2.4.156,7.416-4.843,6.411-2.843-.036,3.172,1.088,1.943,3.52-4.5,3.718-3.218a3.125,3.125,0,0,1-.463,2.182" transform="translate(-151.669 -201.387)" fill="none" stroke="#263238" stroke-linecap="round" stroke-miterlimit="10" stroke-width="1"/>
    </g>
    <g id="freepik--highlighter-pen--inject-42" transform="translate(73.986 129.253)">
      <path id="Tracé_5189" data-name="Tracé 5189" d="M107.148,192.2a3.124,3.124,0,0,0-.323-.3,4.854,4.854,0,0,0-1.078-.635l-.229-.083h-.057c-2.052-.635-9.067-.937-11.421-1.042a2.6,2.6,0,0,0-2.6,1.922v.057c-.5,1.911-7.635,49.062-7.635,49.062s-.052,1.042-.125,2.672c-.031.713-.062,1.562-.1,2.422v.677c0,.458-.036.927-.057,1.4-.068,1.672-.13,3.432-.177,5.041-.036,1.146-.062,2.219-.078,3.125v1.807a26.7,26.7,0,0,0,.182,3.265c.2,1.344.672,1.963,1.828,2.166.286.052.7.115,1.208.177l.312.036,1.432.156.4.036,1.224.1.844.052.849.042c.557.026,1.109.036,1.635.036a16.066,16.066,0,0,0,2.291-.13h.068l.193-.036h0l.214-.052h.042l.214-.068.359-.135.328-.135a6.428,6.428,0,0,0,1.255-.672,4.255,4.255,0,0,0,.365-.292,3.321,3.321,0,0,0,.312-.312l.135-.161a6.989,6.989,0,0,0,.521-.75h0a.611.611,0,0,0,.062-.13l.031-.078.052-.135a1.088,1.088,0,0,1,.042-.12.556.556,0,0,1,.052-.167l.047-.146a.8.8,0,0,1,.057-.2c.021-.073.036-.115.052-.172s.042-.156.068-.24.036-.141.057-.208.042-.167.068-.26.042-.156.063-.234.047-.187.073-.292l.063-.245.078-.318a1.18,1.18,0,0,1,.073-.281l.078-.333c.026-.094.047-.2.073-.3s.057-.234.083-.354l.078-.318a1.928,1.928,0,0,1,.083-.365c.026-.125.052-.229.083-.344s.057-.25.083-.38a.833.833,0,0,0,0-.109,1.112,1.112,0,0,1,.052-.219c.016-.073.063-.281.1-.427s.047-.219.073-.333.062-.286.1-.432l.078-.344.094-.432a1.989,1.989,0,0,1,.083-.38l.094-.411a2.146,2.146,0,0,1,.083-.4l.094-.411a.346.346,0,0,1,.036-.187.747.747,0,0,0,.052-.219c.016-.073.057-.271.083-.406s.057-.266.089-.4.057-.281.089-.417.057-.271.089-.406.052-.26.083-.391.057-.286.089-.432l.078-.375c.031-.135.057-.266.083-.4s.057-.276.089-.411l.078-.391a2.2,2.2,0,0,1,.073-.359c.021-.12.036-.177.057-.266l.031-.151a2.005,2.005,0,0,1,.068-.344c.021-.115.057-.26.083-.391s.042-.224.068-.333l.078-.4a1.655,1.655,0,0,1,.052-.271l.063-.3v-.115c0-.042.036-.172.052-.26l.078-.38.047-.26c.026-.12.047-.24.068-.349l.047-.229.062-.349a.3.3,0,0,1,.036-.177l.063-.338.031-.167a1.763,1.763,0,0,1,.052-.3h0a1.914,1.914,0,0,1,.063-.359c.089-.521.208-1.672.354-3.281.057-.6.115-1.271.177-2,.224-2.656.484-6.072.76-9.822,0-.338.047-.682.073-1.042,1.042-14.176,2.2-32.366,2.2-32.366A1.224,1.224,0,0,0,107.148,192.2Z" transform="translate(-80.796 -189.615)" opacity="0.3"/>
      <path id="Tracé_5190" data-name="Tracé 5190" d="M79.1,240.179s-.641,13.415-.568,17.133.161,5.109,2,5.437,8.957,1.042,10.936.323a5.2,5.2,0,0,0,3.27-2.453c.667-1.1,3.8-15.92,4.51-20.081s3.567-48.495,3.567-48.495.109-.943-1.791-1.781c-1.562-.7-9.228-1.042-11.707-1.125a2.6,2.6,0,0,0-2.63,1.916v.057C86.221,193.023,79.1,240.179,79.1,240.179Z" transform="translate(-78.529 -189.135)" fill="#e34168"/>
      <g id="Groupe_14249" data-name="Groupe 14249" transform="translate(0 0)" clip-path="url(#clip-path)">
        <path id="Tracé_5191" data-name="Tracé 5191" d="M101.37,264.161a4.686,4.686,0,0,0,1.042-.219,5.143,5.143,0,0,0,3.27-2.453c.667-1.1,3.8-15.92,4.51-20.081s3.567-48.495,3.567-48.495.109-.943-1.791-1.781a3.492,3.492,0,0,0-.568-.182,298.9,298.9,0,0,1-4.244,37.006C104.875,241.684,102.287,258.276,101.37,264.161Z" transform="translate(-89.475 -190.005)" opacity="0.5"/>
      </g>
      <path id="Tracé_5193" data-name="Tracé 5193" d="M79.1,240.179s-.641,13.415-.568,17.133.161,5.109,2,5.437,8.957,1.042,10.936.323a5.2,5.2,0,0,0,3.27-2.453c.667-1.1,3.8-15.92,4.51-20.081s3.567-48.495,3.567-48.495.109-.943-1.791-1.781c-1.562-.7-9.228-1.042-11.707-1.125a2.6,2.6,0,0,0-2.63,1.916v.057C86.221,193.023,79.1,240.179,79.1,240.179Z" transform="translate(-78.529 -189.135)" fill="none" stroke="#263238" stroke-linecap="round" stroke-linejoin="round" stroke-width="1"/>
      <path id="Tracé_5194" data-name="Tracé 5194" d="M93.667,288.611c-2.224,0-11.8-1.01-13.285-1.328a11.634,11.634,0,0,1-1.25-.333v.1s-.641,13.415-.568,17.133.161,5.109,2,5.437,8.957,1.042,10.936.323a5.2,5.2,0,0,0,3.27-2.453c.667-1.1,3.645-15.1,4.447-19.717C97.349,288.752,95.5,288.6,93.667,288.611Z" transform="translate(-78.543 -236.01)" fill="#263238"/>
      <g id="Groupe_14250" data-name="Groupe 14250" transform="translate(0.016 50.94)" clip-path="url(#clip-path-2)">
        <path id="Tracé_5195" data-name="Tracé 5195" d="M101.37,264.161a4.686,4.686,0,0,0,1.042-.219,5.143,5.143,0,0,0,3.27-2.453c.667-1.1,3.8-15.92,4.51-20.081s3.567-48.495,3.567-48.495.109-.943-1.791-1.781a3.492,3.492,0,0,0-.568-.182,298.9,298.9,0,0,1-4.244,37.006C104.875,241.684,102.287,258.276,101.37,264.161Z" transform="translate(-89.491 -240.944)" opacity="0.5"/>
        <path id="Tracé_5196" data-name="Tracé 5196" d="M107.61,291.907a19.9,19.9,0,0,0,4.328-.667" transform="translate(-92.481 -289.006)" fill="none" stroke="#fff" stroke-linecap="round" stroke-linejoin="round" stroke-width="1" opacity="0.26"/>
        <path id="Tracé_5197" data-name="Tracé 5197" d="M81.09,289.57s11.754,1.609,13.811,1.536" transform="translate(-79.772 -288.206)" fill="none" stroke="#fff" stroke-linecap="round" stroke-linejoin="round" stroke-width="1"/>
      </g>
      <path id="Tracé_5199" data-name="Tracé 5199" d="M93.667,288.611c-2.224,0-11.8-1.01-13.285-1.328a11.634,11.634,0,0,1-1.25-.333v.1s-.641,13.415-.568,17.133.161,5.109,2,5.437,8.957,1.042,10.936.323a5.2,5.2,0,0,0,3.27-2.453c.667-1.1,3.645-15.1,4.447-19.717C97.349,288.752,95.5,288.6,93.667,288.611Z" transform="translate(-78.543 -236.01)" fill="none" stroke="#263238" stroke-linecap="round" stroke-linejoin="round" stroke-width="1"/>
    </g>
    <g id="freepik--Plant--inject-42" transform="translate(193.981 64.18)">
      <circle id="Ellipse_3481" data-name="Ellipse 3481" cx="22.346" cy="22.346" r="22.346" transform="matrix(0.887, -0.462, 0.462, 0.887, 7.829, 33.35)" fill="#263238" stroke="#263238" stroke-linecap="round" stroke-linejoin="round" stroke-width="1"/>
      <circle id="Ellipse_3482" data-name="Ellipse 3482" cx="22.346" cy="22.346" r="22.346" transform="matrix(0.123, -0.992, 0.992, 0.123, 11.367, 60.047)" fill="#fff" stroke="#263238" stroke-linecap="round" stroke-linejoin="round" stroke-width="1"/>
      <circle id="Ellipse_3483" data-name="Ellipse 3483" cx="20.128" cy="20.128" r="20.128" transform="translate(13.179 57.231) rotate(-80.67)" fill="#263238" stroke="#263238" stroke-linecap="round" stroke-linejoin="round" stroke-width="1"/>
      <path id="Tracé_5200" data-name="Tracé 5200" d="M342.892,97.058a32.258,32.258,0,0,0-6.109-9.452c-3.89-3.9-19.706-6.385-19.706-6.385a57.92,57.92,0,0,1,6.937,8.051c3.609,4.994,15.55,16.378,15.55,16.378s-5.833-5-11.108-5.551-18.6,2.218-19.43,2.218,4.994,2.224,9.16,4.166,20.263,3.609,20.263,3.609-6.937,1.942-11.66,3.609-9.16,13.879-9.16,13.879,6.109-5.551,11.384-6.942,12.769-3.869,12.769-3.869-4.718,5.275-5.827,8.884-.281,11.936-.281,11.936,2.5-7.775,5.551-10.827a58.937,58.937,0,0,0,6.385-8.332,75.974,75.974,0,0,1,4.166,7.77,61.951,61.951,0,0,1,3.609,11.66s3.609-7.77,3.333-11.66-4.437-10.822-4.437-10.822a7.562,7.562,0,0,1,6.937-.276c4.161,1.666,11.384,8.608,11.384,8.608s-1.666-9.16-4.442-12.769-14.712-4.723-14.712-4.723,6.661-3.885,10.827-4.718,9.718,1.109,9.718,1.109-6.39-8.853-11.384-9.436-12.5,7.218-12.5,7.218,1.666-8.332,2.224-11.1-.557-9.718-.557-9.718-3.052,1.666-6.661,6.942a13.806,13.806,0,0,0-2.224,10.546Z" transform="translate(-308.946 -71.555)" fill="#e34168"/>
      <path id="Tracé_5201" data-name="Tracé 5201" d="M342.892,97.058a32.258,32.258,0,0,0-6.109-9.452c-3.89-3.9-19.706-6.385-19.706-6.385a57.92,57.92,0,0,1,6.937,8.051c3.609,4.994,15.55,16.378,15.55,16.378s-5.833-5-11.108-5.551-18.6,2.218-19.43,2.218,4.994,2.224,9.16,4.166,20.263,3.609,20.263,3.609-6.937,1.942-11.66,3.609-9.16,13.879-9.16,13.879,6.109-5.551,11.384-6.942,12.769-3.869,12.769-3.869-4.718,5.275-5.827,8.884-.281,11.936-.281,11.936,2.5-7.775,5.551-10.827a58.937,58.937,0,0,0,6.385-8.332,75.974,75.974,0,0,1,4.166,7.77,61.951,61.951,0,0,1,3.609,11.66s3.609-7.77,3.333-11.66-4.437-10.822-4.437-10.822a7.562,7.562,0,0,1,6.937-.276c4.161,1.666,11.384,8.608,11.384,8.608s-1.666-9.16-4.442-12.769-14.712-4.723-14.712-4.723,6.661-3.885,10.827-4.718,9.718,1.109,9.718,1.109-6.39-8.853-11.384-9.436-12.5,7.218-12.5,7.218,1.666-8.332,2.224-11.1-.557-9.718-.557-9.718-3.052,1.666-6.661,6.942a13.806,13.806,0,0,0-2.224,10.546Z" transform="translate(-308.946 -71.555)" opacity="0.5"/>
      <path id="Tracé_5202" data-name="Tracé 5202" d="M384.63,94.74c.193-.8.406-1.594.641-2.38" transform="translate(-345.216 -77.685)" fill="none" stroke="#263238" stroke-linecap="round" stroke-linejoin="round" stroke-width="0.5"/>
      <path id="Tracé_5203" data-name="Tracé 5203" d="M349,96.92c2.6,1.9,5.848,4.51,7.52,6.77,3.052,4.166,9.16,13.051,9.16,13.051a82.618,82.618,0,0,1,1.411-17.795" transform="translate(-328.141 -79.87)" fill="none" stroke="#263238" stroke-linecap="round" stroke-linejoin="round" stroke-width="0.5"/>
      <path id="Tracé_5204" data-name="Tracé 5204" d="M341.62,91.83s.807.521,2.021,1.349" transform="translate(-324.604 -77.431)" fill="none" stroke="#263238" stroke-linecap="round" stroke-linejoin="round" stroke-width="0.5"/>
      <path id="Tracé_5205" data-name="Tracé 5205" d="M381.06,124.4s10.551-10.551,14.993-11.384,8.332,2.5,8.332,2.5" transform="translate(-343.505 -87.52)" fill="none" stroke="#263238" stroke-linecap="round" stroke-linejoin="round" stroke-width="0.5"/>
      <path id="Tracé_5206" data-name="Tracé 5206" d="M342.282,152c-2.567,1.635-2.8,2.557-2.8,2.557" transform="translate(-323.579 -106.266)" fill="none" stroke="#263238" stroke-linecap="round" stroke-linejoin="round" stroke-width="0.5"/>
      <path id="Tracé_5207" data-name="Tracé 5207" d="M388.472,146s-1.667-4.166-7.5-6.109-14.988-2.224-14.988-2.224-12.848,4.208-17.545,6.4" transform="translate(-327.872 -99.398)" fill="none" stroke="#263238" stroke-linecap="round" stroke-linejoin="round" stroke-width="0.5"/>
      <path id="Tracé_5208" data-name="Tracé 5208" d="M371.36,134.63c3.125.9,5.609,1.562,5.609,1.562" transform="translate(-338.856 -97.941)" fill="none" stroke="#263238" stroke-linecap="round" stroke-linejoin="round" stroke-width="0.5"/>
      <path id="Tracé_5209" data-name="Tracé 5209" d="M333.81,125.16c3.015.182,6.9.594,9.061,1.521,1.76.755,5.234,1.849,8.5,2.823" transform="translate(-320.861 -93.403)" fill="none" stroke="#263238" stroke-linecap="round" stroke-linejoin="round" stroke-width="0.5"/>
      <path id="Tracé_5210" data-name="Tracé 5210" d="M325.62,124.88s1.016,0,2.515.057" transform="translate(-316.936 -93.269)" fill="none" stroke="#263238" stroke-linecap="round" stroke-linejoin="round" stroke-width="0.5"/>
      <path id="Tracé_5211" data-name="Tracé 5211" d="M372.88,140.87s-7.77,11.66-8.332,14.436a28.253,28.253,0,0,0-.557,5" transform="translate(-335.324 -100.932)" fill="none" stroke="#263238" stroke-linecap="round" stroke-linejoin="round" stroke-width="0.5"/>
      <path id="Tracé_5212" data-name="Tracé 5212" d="M387.7,147.92a27.59,27.59,0,0,1,4.036,6.6,45.2,45.2,0,0,1,1.948,7.77" transform="translate(-346.687 -104.31)" fill="none" stroke="#263238" stroke-linecap="round" stroke-linejoin="round" stroke-width="0.5"/>
      <path id="Tracé_5213" data-name="Tracé 5213" d="M383.19,142.47s.62.687,1.479,1.745" transform="translate(-344.525 -101.698)" fill="none" stroke="#263238" stroke-linecap="round" stroke-linejoin="round" stroke-width="0.5"/>
      <path id="Tracé_5214" data-name="Tracé 5214" d="M347.094,92.078a32.135,32.135,0,0,1-.547-11.233c.891-5.426,12.29-16.665,12.29-16.665a57.714,57.714,0,0,0-.943,10.587c0,6.166-3.078,22.393-3.078,22.393s1.823-7.463,5.786-10.988,16.4-9.067,17.076-9.587-2.76,4.718-5.01,8.728-14.358,14.748-14.358,14.748,6.77-2.468,11.577-3.869,15.556,5.952,15.556,5.952-8.2-.948-13.29,1-12.639,4.291-12.639,4.291,6.911,1.536,9.895,3.817,7.181,9.535,7.181,9.535-6.562-4.859-10.822-5.557a58.9,58.9,0,0,1-10.046-3.041,77.167,77.167,0,0,0,1.151,8.744,61.591,61.591,0,0,0,3.869,11.577s-7.463-4.208-9.5-7.53-2.708-11.384-2.708-11.384a7.573,7.573,0,0,0-5.8,3.822c-2.411,3.781-4.223,13.629-4.223,13.629s-3.994-8.41-3.843-12.962,9.2-12.415,9.2-12.415-7.681.729-11.551,2.479-7.244,6.572-7.244,6.572,0-10.936,3.739-14.306,14.363-1.437,14.363-1.437l-8.28-7.728c-2.083-1.927-5.208-8.213-5.208-8.213s3.448-.432,9.457,1.75A13.8,13.8,0,0,1,347.094,92.078Z" transform="translate(-316.673 -64.18)" fill="#e34168"/>
      <path id="Tracé_5215" data-name="Tracé 5215" d="M347.616,109.252q-.937-.807-1.906-1.562" transform="translate(-326.564 -85.031)" fill="none" stroke="#263238" stroke-linecap="round" stroke-linejoin="round" stroke-width="0.5"/>
      <path id="Tracé_5216" data-name="Tracé 5216" d="M365.854,89.92c-1.005,3.057-2.12,7.072-2.151,9.895-.052,5.161.172,15.941.172,15.941a82.446,82.446,0,0,0-11.525-13.634" transform="translate(-329.746 -76.515)" fill="none" stroke="#263238" stroke-linecap="round" stroke-linejoin="round" stroke-width="0.5"/>
      <path id="Tracé_5217" data-name="Tracé 5217" d="M380.549,81.46s-.365.891-.859,2.276" transform="translate(-342.848 -72.461)" fill="none" stroke="#263238" stroke-linecap="round" stroke-linejoin="round" stroke-width="0.5"/>
      <path id="Tracé_5218" data-name="Tracé 5218" d="M352.282,138.393s-14.722-2.416-18.816-.521-5.307,6.885-5.307,6.885" transform="translate(-318.154 -99.147)" fill="none" stroke="#263238" stroke-linecap="round" stroke-linejoin="round" stroke-width="0.5"/>
      <path id="Tracé_5219" data-name="Tracé 5219" d="M413.77,132.154c3.041-.167,3.765.448,3.765.448" transform="translate(-359.18 -96.741)" fill="none" stroke="#263238" stroke-linecap="round" stroke-linejoin="round" stroke-width="0.5"/>
      <path id="Tracé_5220" data-name="Tracé 5220" d="M349.282,157.574s-1.073-4.354,2.526-9.332S362.692,137.7,362.692,137.7s12.884-4.078,17.982-5.036" transform="translate(-328.204 -96.997)" fill="none" stroke="#263238" stroke-linecap="round" stroke-linejoin="round" stroke-width="0.5"/>
      <path id="Tracé_5221" data-name="Tracé 5221" d="M378.785,133.58c-1.995,2.541-3.645,4.557-3.645,4.557" transform="translate(-340.668 -97.438)" fill="none" stroke="#263238" stroke-linecap="round" stroke-linejoin="round" stroke-width="0.5"/>
      <path id="Tracé_5222" data-name="Tracé 5222" d="M396.323,104c-2.349,1.906-5.26,4.5-6.478,6.52-.989,1.64-3.166,4.557-5.255,7.254" transform="translate(-345.196 -83.263)" fill="none" stroke="#263238" stroke-linecap="round" stroke-linejoin="round" stroke-width="0.5"/>
      <path id="Tracé_5223" data-name="Tracé 5223" d="M411.755,99s-.823.588-2,1.51" transform="translate(-357.254 -80.867)" fill="none" stroke="#263238" stroke-linecap="round" stroke-linejoin="round" stroke-width="0.5"/>
      <path id="Tracé_5224" data-name="Tracé 5224" d="M377.9,144.3s13.113,4.937,15.186,6.869a28.612,28.612,0,0,1,3.364,3.734" transform="translate(-341.99 -102.575)" fill="none" stroke="#263238" stroke-linecap="round" stroke-linejoin="round" stroke-width="0.5"/>
      <path id="Tracé_5225" data-name="Tracé 5225" d="M376.588,153.89a27.727,27.727,0,0,0,.568,7.723,45.132,45.132,0,0,0,2.958,7.447" transform="translate(-341.345 -107.171)" fill="none" stroke="#263238" stroke-linecap="round" stroke-linejoin="round" stroke-width="0.5"/>
      <path id="Tracé_5226" data-name="Tracé 5226" d="M376.932,146.85s-.1.911-.182,2.276" transform="translate(-341.439 -103.798)" fill="none" stroke="#263238" stroke-linecap="round" stroke-linejoin="round" stroke-width="0.5"/>
    </g>
    <g id="freepik--Hand--inject-42" transform="translate(157.774 150.646)">
      <path id="Tracé_5227" data-name="Tracé 5227" d="M322.261,300.186c-1-2.817-1.177-17.6-.953-28.122l5.848,1.265a4.276,4.276,0,0,0,2.984-.443,4.169,4.169,0,0,0,.625-.427,3.643,3.643,0,0,0,.521-.521,4.223,4.223,0,0,0,1.042-2.192,4.16,4.16,0,0,0,.042-.437,4.265,4.265,0,0,0-.609-2.406,4.343,4.343,0,0,0-.49-.661,4.281,4.281,0,0,0-2.557-1.37l-7.062-1.042c.063-.917.135-1.63.208-2.083a9.77,9.77,0,0,0,.156-2.083l.484-1.562a8.023,8.023,0,0,0-1.771-7.562c-1.943-1.911-8.853-5.275-10.874-7.041s-17.149-12.54-19.862-11.9-5.921,4.5-8.655,6.645-12.582,10.218-12.582,10.218c.031-.338-5.062,1.719-6.3,3.713a.87.87,0,0,0-.266.7,3.6,3.6,0,0,0,2.26,2.489l-4.416-.651a1.328,1.328,0,0,0-1.3.583,19.325,19.325,0,0,0-7.051.047,36.534,36.534,0,0,0,6.562,2.453,1.328,1.328,0,0,0,.979.87l5.859,1.255a6.688,6.688,0,0,0-.24,1.042,1.828,1.828,0,0,0,.13.948c.026.2.063.4.109.615.833,3.541,5.333,7.843,8.614,10.686s6.421,7.713,8.369,13.358,3.166,10.848,7.5,16.576a26.86,26.86,0,0,0,2.4,2.744l40.4,25.518S323.714,304.327,322.261,300.186Zm-52.708-44.412c-.068.1-.135.208-.193.318l-1.114-.167A9.338,9.338,0,0,0,269.553,255.775Z" transform="translate(-245.295 -230.863)" opacity="0.3"/>
      <path id="Tracé_5228" data-name="Tracé 5228" d="M318.745,355.227l-25.789-44.578s-2.885-20.253-9.035-28.4-14.774-14.1-9.77-18.264,17.706-12.134,20.31-11.624,20.133,9.374,25.086,10.806,6.687,3.536,5.947,7.812-1.042,34.257.422,38.4,17.743,33.647,17.743,33.647" transform="translate(-255.345 -240.815)" fill="#fff"/>
      <g id="Groupe_14251" data-name="Groupe 14251" transform="translate(17.306 11.52)" clip-path="url(#clip-path-3)">
        <path id="Tracé_5229" data-name="Tracé 5229" d="M370.146,321.275c-1.474-4.14-1.161-34.111-.422-38.4.453-2.6-.026-4.421-1.6-5.729a19.117,19.117,0,0,1-1.141,6.973c-1.39,3.942-2.083,6.723-2.083,6.723s-.229,14.139.7,21.352,5.562,19.935,9.968,26.893a66.526,66.526,0,0,0,10.113,11.848C381.145,342.69,371.25,324.462,370.146,321.275Z" transform="translate(-316.846 -264.227)" fill="#e34168"/>
        <path id="Tracé_5230" data-name="Tracé 5230" d="M370.146,321.275c-1.474-4.14-1.161-34.111-.422-38.4.453-2.6-.026-4.421-1.6-5.729a19.117,19.117,0,0,1-1.141,6.973c-1.39,3.942-2.083,6.723-2.083,6.723s-.229,14.139.7,21.352,5.562,19.935,9.968,26.893a66.526,66.526,0,0,0,10.113,11.848C381.145,342.69,371.25,324.462,370.146,321.275Z" transform="translate(-316.846 -264.227)" fill="#fff" opacity="0.5"/>
      </g>
      <path id="Tracé_5232" data-name="Tracé 5232" d="M318.745,355.227l-25.789-44.578s-2.885-20.253-9.035-28.4-14.774-14.1-9.77-18.264,17.706-12.134,20.31-11.624,20.133,9.374,25.086,10.806,6.687,3.536,5.947,7.812-1.042,34.257.422,38.4,17.743,33.647,17.743,33.647" transform="translate(-255.345 -240.815)" fill="none" stroke="#263238" stroke-linecap="round" stroke-miterlimit="10" stroke-width="1"/>
      <path id="Tracé_5233" data-name="Tracé 5233" d="M262.471,264.935a23.206,23.206,0,0,0,11.358-3.708c5.8-3.708,3.942-4.406,3.942-4.406s3.01-.927,4.864-1.62a24.225,24.225,0,0,0,4.406-2.552s7.421,4.869,10.895,6.249a37.35,37.35,0,0,0,5.124,1.75l4.848,6.364a16.592,16.592,0,0,0-6.723,5.8c-2.781,4.166-6.249,9.733-7.885,10.416s-.927,1.39-8.114-1.39S262.007,269.112,262.471,264.935Z" transform="translate(-250.462 -240.966)" fill="#e34168"/>
      <path id="Tracé_5234" data-name="Tracé 5234" d="M262.471,264.935a23.206,23.206,0,0,0,11.358-3.708c5.8-3.708,3.942-4.406,3.942-4.406s3.01-.927,4.864-1.62a24.225,24.225,0,0,0,4.406-2.552s7.421,4.869,10.895,6.249a37.35,37.35,0,0,0,5.124,1.75l4.848,6.364a16.592,16.592,0,0,0-6.723,5.8c-2.781,4.166-6.249,9.733-7.885,10.416s-.927,1.39-8.114-1.39S262.007,269.112,262.471,264.935Z" transform="translate(-250.462 -240.966)" fill="#fff" opacity="0.5"/>
      <path id="Tracé_5235" data-name="Tracé 5235" d="M287.14,273.138s5.572-.687,9.5-7.838a16.366,16.366,0,0,0,9.436.7" transform="translate(-262.289 -247.028)" fill="none" stroke="#263238" stroke-linecap="round" stroke-miterlimit="10" stroke-width="1"/>
      <path id="Tracé_5236" data-name="Tracé 5236" d="M315.564,270.42s-2.687,7.114,2.979,16.524" transform="translate(-275.605 -249.482)" fill="none" stroke="#263238" stroke-linecap="round" stroke-miterlimit="10" stroke-width="1"/>
      <path id="Tracé_5237" data-name="Tracé 5237" d="M304.72,271.67s2.807,3.453,3.265,6.463" transform="translate(-270.713 -250.081)" fill="none" stroke="#263238" stroke-linecap="round" stroke-miterlimit="10" stroke-width="1"/>
      <path id="Tracé_5238" data-name="Tracé 5238" d="M314.81,295.956a35.463,35.463,0,0,0,7.182-6.046c2.495-3.083,3.619-6.333,7.551-7.629" transform="translate(-275.549 -255.165)" fill="none" stroke="#263238" stroke-linecap="round" stroke-miterlimit="10" stroke-width="1"/>
      <line id="Ligne_631" data-name="Ligne 631" x1="1.14" y1="1.349" transform="translate(33.21 16.923)" fill="none" stroke="#263238" stroke-linecap="round" stroke-miterlimit="10" stroke-width="1"/>
      <path id="Tracé_5239" data-name="Tracé 5239" d="M247.419,275.566s-4.843-.979-8-.115c0,0,4.645,2.276,7.463,2.6Z" transform="translate(-239.42 -251.722)" fill="#263238" stroke="#263238" stroke-linecap="round" stroke-miterlimit="10" stroke-width="1"/>
      <path id="Tracé_5240" data-name="Tracé 5240" d="M322.422,284.738l-68.659-10.2a1.333,1.333,0,0,0-1.489.995l-.312,1.323a1.328,1.328,0,0,0,1.01,1.63l67.935,14.686a4.291,4.291,0,0,0,5.15-3.562h0a4.291,4.291,0,0,0-3.635-4.869Z" transform="translate(-245.41 -251.447)" fill="#e34168" stroke="#263238" stroke-linecap="round" stroke-miterlimit="10" stroke-width="1"/>
      <path id="Tracé_5241" data-name="Tracé 5241" d="M375.44,292.7l-10.379-1.562a5.208,5.208,0,0,0-2.359,5.692,5.27,5.27,0,0,0,1,2.083l10.2,2.2a4.291,4.291,0,0,0,5.15-3.562h0a4.291,4.291,0,0,0-3.614-4.854Z" transform="translate(-298.428 -259.411)" fill="#263238" stroke="#263238" stroke-linecap="round" stroke-miterlimit="10" stroke-width="1"/>
      <path id="Tracé_5242" data-name="Tracé 5242" d="M300.823,293.816s-5.906,1.385-8.546.76-8.03-8.207-11.733-10.7a20.162,20.162,0,0,0-9.832-3.671c-3.875-.583-6.551,1.286-5.729,4.833s5.328,7.843,8.614,10.686,6.421,7.707,8.369,13.358,3.166,10.843,7.5,16.55S299.2,333.687,301.02,334" transform="translate(-251.599 -254.12)" fill="#fff"/>
      <g id="Groupe_14252" data-name="Groupe 14252" transform="translate(13.235 25.978)" clip-path="url(#clip-path-4)">
        <path id="Tracé_5243" data-name="Tracé 5243" d="M301.574,294.658l-.417-.214a16.322,16.322,0,0,1-5.208.135c-2.635-.625-8.03-8.207-11.728-10.7a20.144,20.144,0,0,0-9.832-3.671,8.55,8.55,0,0,0-1.87-.083,25.222,25.222,0,0,1,8.332,3.807c4.125,2.979,7.1,10.535,11.681,11.91S301.574,294.658,301.574,294.658Z" transform="translate(-268.517 -280.101)" fill="#e34168"/>
        <path id="Tracé_5244" data-name="Tracé 5244" d="M301.574,294.658l-.417-.214a16.322,16.322,0,0,1-5.208.135c-2.635-.625-8.03-8.207-11.728-10.7a20.144,20.144,0,0,0-9.832-3.671,8.55,8.55,0,0,0-1.87-.083,25.222,25.222,0,0,1,8.332,3.807c4.125,2.979,7.1,10.535,11.681,11.91S301.574,294.658,301.574,294.658Z" transform="translate(-268.517 -280.101)" fill="#fff" opacity="0.5"/>
      </g>
      <path id="Tracé_5246" data-name="Tracé 5246" d="M300.823,293.816s-5.906,1.385-8.546.76-8.03-8.207-11.733-10.7a20.162,20.162,0,0,0-9.832-3.671c-3.875-.583-6.551,1.286-5.729,4.833s5.328,7.843,8.614,10.686,6.421,7.707,8.369,13.358,3.166,10.843,7.5,16.55S299.2,333.687,301.02,334" transform="translate(-251.599 -254.12)" fill="none" stroke="#263238" stroke-linecap="round" stroke-miterlimit="10" stroke-width="1"/>
      <path id="Tracé_5247" data-name="Tracé 5247" d="M267.872,287.6s.281-3.057,4.468-5.906c0,0-2.8-1.838-4.713-1.51s-2.672,1.375-2.963,3.312S267.872,287.6,267.872,287.6Z" transform="translate(-251.509 -254.142)" fill="#fff" stroke="#263238" stroke-linecap="round" stroke-miterlimit="10" stroke-width="1"/>
      <path id="Tracé_5248" data-name="Tracé 5248" d="M276.12,300.69a5.569,5.569,0,0,0,1.073.844" transform="translate(-257.008 -263.988)" fill="none" stroke="#263238" stroke-linecap="round" stroke-miterlimit="10" stroke-width="1"/>
      <path id="Tracé_5249" data-name="Tracé 5249" d="M278.493,286.82s-4.447,2.291-3.734,5.864" transform="translate(-256.318 -257.341)" fill="none" stroke="#263238" stroke-linecap="round" stroke-miterlimit="10" stroke-width="1"/>
      <path id="Tracé_5250" data-name="Tracé 5250" d="M319.167,259.032l.708-2.286a8.03,8.03,0,0,0-1.771-7.556c-1.942-1.911-8.853-5.275-10.874-7.041s-17.144-12.566-19.831-11.9-5.921,4.5-8.66,6.64-12.561,10.176-12.561,10.176-6.9,2.989-6.588,4.4,1.745,3.2,6.072,3.062,11.54-4.453,12.634-5.088,7.9-5.093,7.9-5.093a23.842,23.842,0,0,0,6,4.322c3.213,1.489,3.645,1.64,3.645,1.64a9.025,9.025,0,0,0,3.2,4.609" transform="translate(-249.081 -230.214)" fill="#fff"/>
      <g id="Groupe_14253" data-name="Groupe 14253" transform="translate(10.499)" clip-path="url(#clip-path-5)">
        <path id="Tracé_5251" data-name="Tracé 5251" d="M355.335,257.665c2.5,1.963,2.661,5.854,1.969,9.337l1.87.38.708-2.286a8.03,8.03,0,0,0-1.771-7.556c-1.942-1.911-8.853-5.275-10.874-7.041-.521-.458-1.958-1.536-3.817-2.859l-.37.057S352.091,255.118,355.335,257.665Z" transform="translate(-299.581 -238.565)" fill="#e34168"/>
        <path id="Tracé_5252" data-name="Tracé 5252" d="M355.335,257.665c2.5,1.963,2.661,5.854,1.969,9.337l1.87.38.708-2.286a8.03,8.03,0,0,0-1.771-7.556c-1.942-1.911-8.853-5.275-10.874-7.041-.521-.458-1.958-1.536-3.817-2.859l-.37.057S352.091,255.118,355.335,257.665Z" transform="translate(-299.581 -238.565)" fill="#fff" opacity="0.5"/>
        <path id="Tracé_5253" data-name="Tracé 5253" d="M262.471,264.935a23.206,23.206,0,0,0,11.358-3.708c5.8-3.708,3.942-4.406,3.942-4.406s3.01-.927,4.864-1.62a24.225,24.225,0,0,0,4.406-2.552s7.421,4.869,10.895,6.249a37.35,37.35,0,0,0,5.124,1.75l4.848,6.364a16.592,16.592,0,0,0-6.723,5.8c-2.781,4.166-6.249,9.733-7.885,10.416s-.927,1.39-8.114-1.39S262.007,269.112,262.471,264.935Z" transform="translate(-260.961 -240.966)" fill="#e34168"/>
        <path id="Tracé_5254" data-name="Tracé 5254" d="M262.471,264.935a23.206,23.206,0,0,0,11.358-3.708c5.8-3.708,3.942-4.406,3.942-4.406s3.01-.927,4.864-1.62a24.225,24.225,0,0,0,4.406-2.552s7.421,4.869,10.895,6.249a37.35,37.35,0,0,0,5.124,1.75l4.848,6.364a16.592,16.592,0,0,0-6.723,5.8c-2.781,4.166-6.249,9.733-7.885,10.416s-.927,1.39-8.114-1.39S262.007,269.112,262.471,264.935Z" transform="translate(-260.961 -240.966)" fill="#fff" opacity="0.5"/>
      </g>
      <path id="Tracé_5256" data-name="Tracé 5256" d="M319.167,259.032l.708-2.286a8.03,8.03,0,0,0-1.771-7.556c-1.942-1.911-8.853-5.275-10.874-7.041s-17.144-12.566-19.831-11.9-5.921,4.5-8.66,6.64-12.561,10.176-12.561,10.176-6.9,2.989-6.588,4.4,1.745,3.2,6.072,3.062,11.54-4.453,12.634-5.088,7.9-5.093,7.9-5.093a23.842,23.842,0,0,0,6,4.322c3.213,1.489,3.645,1.64,3.645,1.64a9.025,9.025,0,0,0,3.2,4.609" transform="translate(-249.081 -230.214)" fill="none" stroke="#263238" stroke-linecap="round" stroke-miterlimit="10" stroke-width="1"/>
      <path id="Tracé_5257" data-name="Tracé 5257" d="M259.6,266.889a2.933,2.933,0,0,0,2.177-.26,14.025,14.025,0,0,0,4.385-4.166C266.193,262.056,259.834,264.727,259.6,266.889Z" transform="translate(-249.091 -245.648)" fill="#fff" stroke="#263238" stroke-linecap="round" stroke-miterlimit="10" stroke-width="1"/>
      <path id="Tracé_5258" data-name="Tracé 5258" d="M310.16,246.8a9.319,9.319,0,0,1,.245-.922" transform="translate(-273.32 -237.722)" fill="none" stroke="#263238" stroke-linecap="round" stroke-miterlimit="10" stroke-width="1"/>
      <path id="Tracé_5259" data-name="Tracé 5259" d="M310.253,253.785a10.135,10.135,0,0,1-.443-3.875" transform="translate(-273.137 -239.653)" fill="none" stroke="#263238" stroke-linecap="round" stroke-miterlimit="10" stroke-width="1"/>
    </g>
  </g>
</svg>
