{
  "routingKey": "commandelignes",
  "index": "commandeligne",
  "mappingProperties": {
    "optimiser": {
      "type": "keyword"
    },
    "quantiteCdee": {
      "type": "integer"
    },
    "quantiteLivree": {
      "type": "integer"
    },
    "uniteGratuite": {
      "type": "text"
    },
    "prixBaseHT": {
      "type": "double"
    },
    "remiseLigne": {
      "type": "double"
    },
    "remiseGamme": {
      "type": "double"
    },
    "prixNetUnitaireHT": {
      "type": "double"
    },
    "prixTotalHT": {
      "type": "double"
    },
    "dateCreation": {
      "type": "keyword"
    },
    "dateModification": {
      "type": "keyword"
    }
  },
  "instances": 1,
  "query": "query commandeLigne($id: ID!) { commandeLigne(id: $id) { optimiser quantiteCdee quantiteLivree uniteGratuite prixBaseHT remiseLigne remiseGamme prixNetUnitaireHT prixTotalHT dateCreation dateModification }}",
  "dataKey": "commandeLigne"
}
