{
  "routingKey": "pharmacies",
  "index": "pharmacie",
  "mappingProperties": {
    "id": {
      "type": "keyword"
    },
    "nom": {
      "type": "keyword"
    },
    "numFiness": {
      "type": "keyword"
    },
    "uga": {
      "type": "keyword"
    },
    "latitude": {
      "type": "keyword"
    },
    "longitude": {
      "type": "keyword"
    },
    "pharmacieType": {
      "type": "keyword"
    },
    "adresse1": {
      "type": "keyword"
    },
    "adresse2": {
      "type": "keyword"
    },
    "cp": {
      "type": "keyword"
    },
    "ville": {
      "type": "keyword"
    },
    "idGroupement": {
      "type": "keyword"
    },
    "actived": {
      "type": "keyword"
    },
    "nbReclamation": {
      "type": "keyword"
    },
    "cip": {
      "type": "keyword"
    },
    "nbAppel": {
      "type": "keyword"
    },
    "nbTicket": {
      "type": "keyword"
    },
    "user": {
      "properties": {
        "id": {
          "type": "keyword"
        },
        "userName": {
          "type": "keyword"
        },
        "email": {
          "type": "keyword"
        },
        "login": {
          "type": "keyword"
        },
        "status": {
          "type": "keyword"
        }
      }
    },
    "contact": {
      "properties": {
        "id": {
          "type": "keyword"
        },
        "telProf": {
          "type": "keyword"
        }
      }
    },
    "titulaires": {
      "properties": {
        "id": {
          "type": "keyword"
        },
        "nom": {
          "type": "keyword"
        },
        "prenom": {
          "type": "keyword"
        },
        "fullName": {
          "type": "keyword"
        },
        "adresse1": {
          "type": "keyword"
        },
        "adresse2": {
          "type": "keyword"
        },
        "mail": {
          "type": "keyword"
        },
        "ville": {
          "type": "keyword"
        },
        "estPresidentRegion": {
          "type": "keyword"
        },
        "sortie": {
          "type": "keyword"
        }
      }
    },
    "departement": {
      "properties": {
        "id": {
          "type": "keyword"
        },
        "code": {
          "type": "keyword"
        },
        "nom": {
          "type": "keyword"
        },
        "region": {
          "properties": {
            "id": {
              "type": "keyword"
            },
            "nom": {
              "type": "keyword"
            }
          }
        }
      }
    },
    "presidentRegion": {
      "properties": {
        "id": {
          "type": "keyword"
        },
        "departement": {
          "properties": {
            "id": {
              "type": "keyword"
            },
            "code": {
              "type": "keyword"
            },
            "nom": {
              "type": "keyword"
            }
          }
        },
        "titulaire": {
          "properties": {
            "id": {
              "type": "keyword"
            },
            "mail": {
              "type": "keyword"
            },
            "nom": {
              "type": "keyword"
            },
            "fullName": {
              "type": "keyword"
            },
            "sortie": {
              "type": "keyword"
            }
          }
        }
      }
    },
    "segmentation": {
      "properties": {
        "id": {
          "type": "keyword"
        },
        "typologie": {
          "properties": {
            "id": {
              "type": "keyword"
            },
            "code": {
              "type": "keyword"
            },
            "libelle": {
              "type": "keyword"
            }
          }
        },
        "trancheCA": {
          "properties": {
            "id": {
              "type": "keyword"
            },
            "libelle": {
              "type": "keyword"
            }
          }
        },
        "contrat": {
          "properties": {
            "id": {
              "type": "keyword"
            },
            "nom": {
              "type": "keyword"
            }
          }
        }
      }
    },
    "achat": {
      "properties": {
        "id": {
          "type": "keyword"
        },
        "canal": {
          "properties": {
            "id": {
              "type": "keyword"
            },
            "code": {
              "type": "keyword"
            },
            "libelle": {
              "type": "keyword"
            }
          }
        }
      }
    }
  },
  "instances": 1,
  "query": "query pharmacie($id: ID!) { pharmacie(id: $id) { id nom adresse1 adresse2 pharmacieType cp ville cip numFiness ancienFiness commentaire uga latitude longitude nbEmploye nbAssistant nbAutreTravailleur nbJourOuvre sortie codeMaj dateCreation dateModification actived idGroupement nbReclamation nbAppel nbTicket users { id userName email login  status } titulaires { id nom prenom fullName estPresidentRegion sortie} departement { id code nom region { id nom } } presidentRegion { id departement { id code nom } titulaire { id nom fullName } } contact { id cp ville pays adresse1 adresse2 telProf faxProf faxPerso telMobProf telPerso telMobPerso mailProf mailPerso siteProf sitePerso whatsAppMobProf whatsappMobPerso compteSkypeProf compteSkypePerso urlLinkedinProf urlLinkedinPerso urlTwitterProf urlTwitterPerso urlFacebookProf urlFacebookPerso } grossistes { id nom } generiqueurs { id nom } segmentation { id typologie { id code libelle } contrat { id nom } qualite { id libelle } dateSignature } entreeSortie { id contrat { id nom } concurrent { id nom } concurrentAncien { id nom } dateEntree pharmacieMotifEntree { id typeMotif libelle } commentaireEntree dateSortieFuture pharmacieMotifSortieFuture { id typeMotif libelle } commentaireSortieFuture dateSortie pharmacieMotifSortie { id typeMotif libelle } commentaireSortie codeMaj dateCreation dateModification } compta { id siret codeERP ape tvaIntra rcs contactCompta chequeGrp valeurChequeGrp commentaireChequeGrp droitAccesGrp valeurChequeAccesGrp commentaireChequeAccesGrp structureJuridique denominationSociale telCompta modifStatut raisonModif dateModifStatut nomBanque banqueGuichet banqueCompte banqueRib banqueCle dateMajRib iban swift dateMajIban } satisfaction { id dateSaisie commentaire } informatique { id logiciel { id nom ssii {   id   nom } } numVersion dateLogiciel nbrePoste nbreComptoir nbreBackOffice nbreBureau commentaire automate1 { id modeleAutomate } dateInstallation1 automate2 { id modeleAutomate } dateInstallation2 automate3 { id modeleAutomate } dateInstallation3 } achat { id identifiantAchatCanal canal { id code libelle } dateDebut dateFin } cap { identifiantCap commentaire dateDebut dateFin } concept { fournisseurMobilier { id typePrestataire nom } dateInstallConcept avecConcept concept { id typeConcept modele } avecFacade dateInstallFacade enseigniste { id typePrestataire nom } conformiteFacade facade { id modele } surfaceTotale surfaceVente SurfaceVitrine volumeLeaflet nbreLineaire nbreVitrine otcLibAcces leaflet { id modele } commentaire } statCA { exercice dateDebut dateFin caTTC caHt caTVA1 tauxTVA1 caTVA2 tauxTVA2 caTVA3 tauxTVA3 caTVA4 tauxTVA4 caTVA5 tauxTVA5 codeMaj dateCreation dateModification } digitales { id servicePharmacie { id nom } pharmaciePestataire { id typePrestataire nom } flagService dateInstallation url } } }",
  "dataKey": "pharmacie"
}
