<svg xmlns="http://www.w3.org/2000/svg" xmlns:xlink="http://www.w3.org/1999/xlink" width="68" height="68" viewBox="0 0 68 68">
  <defs>
    <filter id="Rectangle_3" x="0" y="0" width="68" height="68" filterUnits="userSpaceOnUse">
      <feOffset dy="3" input="SourceAlpha"/>
      <feGaussianBlur stdDeviation="3" result="blur"/>
      <feFlood flood-opacity="0.161"/>
      <feComposite operator="in" in2="blur"/>
      <feComposite in="SourceGraphic"/>
    </filter>
  </defs>
  <g id="Groupe_756" data-name="Groupe 756" transform="translate(-838.013 -661)">
    <g transform="matrix(1, 0, 0, 1, 838.01, 661)" filter="url(#Rectangle_3)">
      <rect id="Rectangle_3-2" data-name="Rectangle 3" width="50" height="50" rx="3" transform="translate(9 6)" fill="#fff"/>
    </g>
    <path id="linkedin-in" d="M4.172,18.649H.308V6.2H4.172ZM2.238,4.507A2.249,2.249,0,1,1,4.476,2.248,2.257,2.257,0,0,1,2.238,4.507Zm16.4,14.142H14.779V12.591c0-1.444-.029-3.3-2.009-3.3-2.009,0-2.317,1.569-2.317,3.191v6.162H6.593V6.2H10.3V7.9h.054a4.061,4.061,0,0,1,3.656-2.01c3.911,0,4.63,2.575,4.63,5.921v6.836Z" transform="translate(863.013 682.99)" fill="#e3454e"/>
  </g>
</svg>
