<svg id="playlist_add-24px" xmlns="http://www.w3.org/2000/svg" width="24" height="24" viewBox="0 0 24 24">
  <path id="Tracé_2971" data-name="Tracé 2971" d="M0,0H24V24H0Z" fill="none"/>
  <path id="Tracé_2972" data-name="Tracé 2972" d="M14,16H2V14H14Zm0,4H2V18H14Zm4-8v4H16V12H12V10h4V6h2v4h4v2ZM2,10h8v2H2Z" transform="translate(0 -1.021)" fill="#424242"/>
</svg>
