1;ADV;ADMINISTRATION DES VENTES;1
2;APPROV;RESPONSABLE APPROVISIONNEMENT;13
3;ASSIST;ASSISTANT(e);8
4;COMMUN;COMMUNICATION INTERNE;12
5;COMPTA;COMPTABILITE;6
6;CP;CHEF PROJET;13
7;DO;DIRECTRICE OPERATIONNNELLE;5
8;EXPLOI;RESPONSABLE EXPLOITATION;13
9;FORM;FORMATEUR(RICE);3
10;IC;INGENIEUR COMMERCIAL;4
11;JOURN;JOURNAL;9
12;LCP;PHARMACIEN RESPONSABLE CP;5
13;MARKT;MARKETING;10
14;MERCH;MERCHANDISEUR;4
15;PDG;PRESIDENT DIRECTEUR GENERAL;5
16;PF;PERSONNEL DE LA PLATE FORME;5
17;RDC;RESPONSABLE DU DEVELOPPEMENT CONSEIL;2
18;REFER;REFERENCEMENT;11
19;SI;SEVICE INFORMATIQUE;7
20;STOCK;GESTION DU STOCK;13
21;DZ;DIRECTEUR ZONE;2
22;DR;DIRECTEUR REGION;2
23;DGC;DIRECTEUR GENERAL EN CHARGE DU COMMERCE;15
24;RDCISR;Commercial INTER SECTEUR;2
