CLOGIN;CREATION LOGIN
PLOGIN;PREMIER LOGIN
RLOGIN;DEMANDE DE REINITIALISATION DU LOGIN
CONNECT;CONNEXION LOGIN
SSOLOGIN;LOGIN SSO
GROLES;GET ROLES
GPARAMETERS;GET PARAMETERS
GGROUPEMENT;GET GROUPEMENT
GGROUPEMENTS;GET GROUPEMENTS
GMYPANIER;GET MY PANIER
ULABORATOIRESORTIE;UPDATE LABORATOIRE SORTIE
GCOMMANDECANALS;GET COMMANDE CANALS
GCOMMANDETYPES;GET COMMANDE TYPES
GLABORATOIRES;GET LABORATOIRES
COPERATION;CREATE OPERATION
GCOMMENTS;GET COMMENTS
GSERVICES;GET SERVICES
CUSERSMYLEY;CREATE USER SMYLEY
CPERATIONVIEWER;CREATE OPERATION VIEWER
GOPERATION;GET OPERATION
GPHARMACIEPANIER;GET PHARMACIE PANIER
ATOPANIER;ADD TO PANIER
DPANIERLIGNE;DELETE PANIER LIGNE
GACTUALITEORIGINES;GET ACTUALITE ORIGINES
GPROJECTS;GET PROJECTS
GACTUALITEALLUSERSCIBLE;GET ACTUALITE ALL USERS CIBLE
GACTUALITE;GET ACTUALITE
CUACTUALITE;CREATE UPDATE ACTUALITE
GPHARMACIE;GET PHARMACIE
UPARAMETERVALUES;UPDATE PARAMETER VALUES
GTITULAIREPHARMACIES;GET TITULAIRE PHARMACIES
GTITULAIRE;GET TITULAIRE
RUSEREMAIL;RESEND USER EMAIL
SACTIONDUEDATE;SET ACTION DUE DATE
CACTIONSTATUS;CHANGE ACTION STATUS
GACTION;GET ACTION
GPPERSONNEL;GET PPERSONNEL
CUSERCOLLABORATEUROFFICINE;CREATE USER COLLABORATEUR OFFICINE
RPASSWORD;RESET PASSWORD
LOGIN;LOGIN
GPERSONNEL;GET PERSONNEL
GPFLARTICLE;GET PFLARTICLE
UQTEPANIERLIGNE;UPDATE QTE PANIER LIGNE
CGROUPEMENT;CREATE GROUPEMENT
CPPERSONNEL;CREATE PPERSONNEL
CUPDATEPROJECT;CREATE UPDATE PROJECT
CUACTION;CREATE UPDATE ACTION
CMYPANIER;CLEAR MY PANIER
AACTIONTOUSER;ASSIGN ACTION TO USER
CUSERGROUPEMENT;CREATE USER GROUPEMENT
UUSERPHOTO;UPDATE USER PHOTO
CCOMMENT;CREATE COMMENT
COPERATIONCOMMANDE;CREATE OPERATION COMMANDE
GCOMMANDE;GET COMMANDE
UPASSWORD;UPDATE PASSWORD
DACTUALITE;DELETE ACTUALITE
CUSERTITULAIRE;CREATE USER TITULAIRE
CUSERPRESIDENTREGION;CREATE USER PRESIDENT REGION
DOPERATION;DELETE OPERATION
GMYPANIERS;GET ALL MY PANIER
VPANIER;VALIDATE PANIER
USTATUTCOMMANDE;UPDATE STATUT COMMANDE
TPRODUCTTOMYPANIER;TAKE PRODUCT TO MY PANIER
UGROUPEMENT;UPDATE GROUPEMENT
DACTION;DELETE ACTION
APROJECT;ARCHIVED PROJECT
CPARTENAIRE;CREATE PARTENAIRE
GPARTENAIRE;GET PARTENAIRE
CUSERPARTENAIRESERVICE;CREATE USER PARTENAIRE SERVICE
UUSERSTATUS;UPDATE USER STATUS
DPROJECT;DELETE PROJECT
GPARAMETER;GET PARAMETER
UPROJECT;UNARCHIVED PROJECT
