1;1;1;"1"
2;2;1;"2"
3;3;1;"3"
4;4;1;"4"
5;5;1;"5"
6;6;1;"6"
7;7;1;"7"
8;8;1;"8"
9;9;1;"9"
10;10;1;"10"
11;11;1;"11"
12;12;1;"12"
13;13;1;"13"
14;14;2;"0"
15;15;2;"1"
16;16;2;"2"
17;17;2;"3"
18;18;2;"4"
19;19;2;"5"
20;20;2;"6"
21;21;2;"7"
22;22;2;"8"
23;23;2;"9"
24;24;2;"10"
25;25;2;"11"
26;26;4;"1"
27;27;4;"2"
28;28;4;"3"
29;29;4;"4"
30;30;4;"5"
31;31;4;"6"
32;32;5;"1"
33;33;5;"2"
34;34;5;"3"
35;35;5;"4"
36;36;5;"5"
37;37;5;"6"
38;38;5;"7"
39;39;5;"8"
40;40;5;"9"
41;41;5;"10"
42;42;5;"11"
43;43;6;"0"
44;44;6;"1"
45;45;6;"2"
46;46;6;"3"
47;47;6;"4"
48;48;6;"5"
49;49;6;"6"
50;50;7;"0"
51;51;7;"1"
52;52;7;"2"
53;53;7;"3"
54;54;7;"4"
55;55;7;"5"
56;56;7;"6"
57;57;8;"0"
58;58;8;"1"
59;59;8;"2"
60;60;8;"3"
61;61;8;"4"
62;62;8;"5"
63;63;8;"6"
64;64;8;"7"
65;65;8;"8"
66;66;9;"1"
67;67;9;"2"
68;68;9;"3"
69;69;1;"1"
70;70;1;"2"
71;71;1;"3"
72;72;1;"4"
73;73;1;"1"
74;74;1;"2"
75;75;1;"3"
76;76;1;"0"
77;77;1;"1"
78;78;1;"2"
79;79;1;"3"
80;80;1;"4"
81;81;1;"5"
82;82;1;"0"
83;83;1;"1"
84;84;1;"2"
85;85;1;"3"
86;86;1;"4"
87;87;1;"5"
88;88;1;"6"
89;89;1;"7"
90;90;1;"8"
91;91;1;"9"
92;92;1;"10"
93;93;1;"11"
