{
  "routingKey": "services",
  "index": "service",
  "mappingProperties": {
    "id": {
      "type": "keyword"
    },
    "code": {
      "type": "keyword"
    },
    "nom": {
      "type": "keyword"
    }
  },
  "instances": 1,
  "query": "query service($id: ID!) { service(id: $id) { id code nom } }",
  "dataKey": "service"
}
