<svg xmlns="http://www.w3.org/2000/svg" width="336.858" height="251" viewBox="0 0 336.858 251">
  <g id="autoevaluation" transform="translate(0 -55)">
    <g id="freepik--background-complete--inject-57" transform="translate(0 55)">
      <rect id="Rectangle_18902" data-name="Rectangle 18902" width="336.858" height="0.168" transform="translate(0 220.575)" fill="#ebebeb"/>
      <rect id="Rectangle_18903" data-name="Rectangle 18903" width="61.241" height="0.168" transform="translate(241.864 226.989)" fill="#ebebeb"/>
      <rect id="Rectangle_18904" data-name="Rectangle 18904" width="16.769" height="0.168" transform="translate(206.38 225.163)" fill="#ebebeb"/>
      <rect id="Rectangle_18905" data-name="Rectangle 18905" width="25.999" height="0.168" transform="translate(235.478 233.248)" fill="#ebebeb"/>
      <rect id="Rectangle_18906" data-name="Rectangle 18906" width="15.253" height="0.168" transform="translate(35.343 232.116)" fill="#ebebeb"/>
      <rect id="Rectangle_18907" data-name="Rectangle 18907" width="18.116" height="0.168" transform="translate(56.592 232.116)" fill="#ebebeb"/>
      <rect id="Rectangle_18908" data-name="Rectangle 18908" width="31.557" height="0.168" transform="translate(120.13 229.273)" fill="#ebebeb"/>
      <path id="Tracé_3188" data-name="Tracé 3188" d="M172.138,245.527H42.05a3.847,3.847,0,0,1-3.84-3.847V58.813A3.847,3.847,0,0,1,42.05,55H172.138a3.847,3.847,0,0,1,3.847,3.847V241.68A3.847,3.847,0,0,1,172.138,245.527ZM42.05,55.135a3.679,3.679,0,0,0-3.672,3.678V241.68a3.678,3.678,0,0,0,3.672,3.678H172.138a3.685,3.685,0,0,0,3.678-3.678V58.813a3.685,3.685,0,0,0-3.679-3.678Z" transform="translate(-12.467 -55)" fill="#ebebeb"/>
      <path id="Tracé_3189" data-name="Tracé 3189" d="M388.442,245.527H258.347a3.854,3.854,0,0,1-3.847-3.847V58.813A3.854,3.854,0,0,1,258.347,55H388.442a3.847,3.847,0,0,1,3.833,3.813V241.68A3.847,3.847,0,0,1,388.442,245.527ZM258.347,55.135a3.685,3.685,0,0,0-3.679,3.678V241.68a3.685,3.685,0,0,0,3.679,3.678H388.442a3.685,3.685,0,0,0,3.678-3.678V58.813a3.685,3.685,0,0,0-3.678-3.678Z" transform="translate(-83.039 -55)" fill="#ebebeb"/>
      <rect id="Rectangle_18909" data-name="Rectangle 18909" width="80.55" height="178.138" transform="translate(115.886 220.568) rotate(180)" fill="#f0f0f0"/>
      <rect id="Rectangle_18910" data-name="Rectangle 18910" width="76.73" height="178.138" transform="translate(112.073 220.568) rotate(180)" fill="#f5f5f5"/>
      <rect id="Rectangle_18911" data-name="Rectangle 18911" width="170.053" height="68.645" transform="translate(108.031 46.48) rotate(90)" fill="#f0f0f0"/>
      <path id="Tracé_3190" data-name="Tracé 3190" d="M83.732,241.258H69.739a1.806,1.806,0,0,1-1.8-1.8h0a1.806,1.806,0,0,1,1.8-1.8H83.732a1.806,1.806,0,0,1,1.8,1.8h0A1.806,1.806,0,0,1,83.732,241.258Z" transform="translate(-22.168 -114.599)" fill="#fff"/>
      <rect id="Rectangle_18912" data-name="Rectangle 18912" width="170.053" height="1.051" transform="translate(40.436 46.48) rotate(90)" fill="#f0f0f0"/>
      <rect id="Rectangle_18913" data-name="Rectangle 18913" width="11.992" height="52.011" transform="translate(165.62 217.193) rotate(180)" fill="#f0f0f0"/>
      <rect id="Rectangle_18914" data-name="Rectangle 18914" width="59.139" height="3.294" transform="translate(163.316 220.494) rotate(180)" fill="#f0f0f0"/>
      <rect id="Rectangle_18915" data-name="Rectangle 18915" width="51.755" height="52.011" transform="translate(101.873 165.189)" fill="#f5f5f5"/>
      <rect id="Rectangle_18916" data-name="Rectangle 18916" width="42.323" height="17.059" transform="translate(106.582 171.589)" fill="#f0f0f0"/>
      <rect id="Rectangle_18917" data-name="Rectangle 18917" width="42.323" height="17.059" transform="translate(106.582 193.734)" fill="#f0f0f0"/>
      <path id="Tracé_3191" data-name="Tracé 3191" d="M182,310.688H191.5a1.172,1.172,0,0,0,1.166-1.166h0a1.172,1.172,0,0,0-1.166-1.172H182a1.172,1.172,0,0,0-1.166,1.172h0A1.172,1.172,0,0,0,182,310.688Z" transform="translate(-59.002 -137.664)" fill="#f5f5f5"/>
      <path id="Tracé_3192" data-name="Tracé 3192" d="M182,343.581H191.5a1.172,1.172,0,0,0,1.166-1.145h0a1.172,1.172,0,0,0-1.166-1.166H182a1.172,1.172,0,0,0-1.166,1.166h0A1.172,1.172,0,0,0,182,343.581Z" transform="translate(-59.002 -148.405)" fill="#f5f5f5"/>
      <path id="Tracé_3193" data-name="Tracé 3193" d="M195.039,284.721h0a.9.9,0,0,1-.889-.889V256.809a.889.889,0,0,1,.889-.889h0a.9.9,0,0,1,.889.889v27.023a.9.9,0,0,1-.889.889Z" transform="translate(-63.348 -120.557)" fill="#f5f5f5"/>
      <rect id="Rectangle_18918" data-name="Rectangle 18918" width="16.641" height="2.095" transform="translate(123.371 163.114)" fill="#f0f0f0"/>
      <path id="Tracé_3194" data-name="Tracé 3194" d="M202.095,267.71h0a.445.445,0,0,1-.445-.438V253.785a.451.451,0,0,1,.445-.445h0a.451.451,0,0,1,.445.445v13.474a.445.445,0,0,1-.445.451Z" transform="translate(-65.795 -119.715)" fill="#f0f0f0"/>
      <path id="Tracé_3195" data-name="Tracé 3195" d="M176.26,254.733S176.59,242,189.2,242s12.935,12.72,12.935,12.72Z" transform="translate(-57.511 -116.015)" fill="#f0f0f0"/>
      <path id="Tracé_3196" data-name="Tracé 3196" d="M312.716,287.6h0c.357,0,.721,0,1.085.034a15.5,15.5,0,0,1,14.343,14.411,15.726,15.726,0,0,1-.5,5.033,77.343,77.343,0,0,0-2.425,20.137v19.767a2.594,2.594,0,0,1-2.607,2.6H259.87V287.6Z" transform="translate(-84.791 -130.893)" fill="#f0f0f0"/>
      <path id="Tracé_3197" data-name="Tracé 3197" d="M236.92,303.088A15.455,15.455,0,1,1,267.3,307.13a77.627,77.627,0,0,0-2.419,20.137v19.767a2.594,2.594,0,0,1-2.6,2.594H242.471a2.594,2.594,0,0,1-2.594-2.594V326.082a70.411,70.411,0,0,0-2.4-18.864,15.5,15.5,0,0,1-.559-4.13Z" transform="translate(-77.303 -130.919)" fill="#f5f5f5"/>
      <rect id="Rectangle_18919" data-name="Rectangle 18919" width="56.329" height="37.634" transform="translate(252.711 218.689) rotate(180)" fill="#f0f0f0"/>
      <path id="Tracé_3198" data-name="Tracé 3198" d="M0,0H75.4V57.717a11.7,11.7,0,0,1-11.7,11.7h-52A11.7,11.7,0,0,1,0,57.717Z" transform="translate(299.265 189.57) rotate(180)" fill="#e0e0e0"/>
      <path id="Tracé_3199" data-name="Tracé 3199" d="M0,0H75.4V58.283A11.137,11.137,0,0,1,64.259,69.42h-53.1A11.137,11.137,0,0,1,.027,58.283V0Z" transform="translate(284.531 189.57) rotate(180)" fill="#f5f5f5"/>
      <path id="Tracé_3200" data-name="Tracé 3200" d="M1.017,0H52.941a3.369,3.369,0,0,1,3.369,3.369V11.9a3.369,3.369,0,0,1-3.369,3.369H1.017A1.017,1.017,0,0,1,0,14.256V1.011A1.017,1.017,0,0,1,1.017,0Z" transform="translate(250.05 192.946) rotate(180)" fill="#e0e0e0"/>
      <path id="Tracé_3201" data-name="Tracé 3201" d="M426.853,287.6h0c.357,0,.714,0,1.085.034a15.462,15.462,0,0,1,13.838,19.443,77.343,77.343,0,0,0-2.425,20.144v19.767a2.594,2.594,0,0,1-2.6,2.594H374V287.6Z" transform="translate(-122.03 -130.893)" fill="#f0f0f0"/>
      <path id="Tracé_3202" data-name="Tracé 3202" d="M351.06,303.014A15.455,15.455,0,0,1,381.943,302a15.725,15.725,0,0,1-.5,5.033,77.344,77.344,0,0,0-2.425,20.137v19.767a2.594,2.594,0,0,1-2.594,2.594H356.6a2.594,2.594,0,0,1-2.594-2.594V326.008a70.675,70.675,0,0,0-2.392-18.864,15.5,15.5,0,0,1-.559-4.13Z" transform="translate(-114.545 -130.846)" fill="#f5f5f5"/>
      <path id="Tracé_3203" data-name="Tracé 3203" d="M260.59,381.486H388.131a1.88,1.88,0,0,0,1.88-1.886H258.71a1.88,1.88,0,0,0,1.88,1.886Z" transform="translate(-84.413 -160.911)" fill="#e0e0e0"/>
      <rect id="Rectangle_18920" data-name="Rectangle 18920" width="41.023" height="44.742" transform="translate(292.737 76.042) rotate(180)" fill="#e0e0e0"/>
      <rect id="Rectangle_18921" data-name="Rectangle 18921" width="42.087" height="44.742" transform="translate(291.356 76.042) rotate(180)" fill="#f5f5f5"/>
      <rect id="Rectangle_18922" data-name="Rectangle 18922" width="37.694" height="35.04" transform="translate(287.825 34.824) rotate(90)" fill="#fff"/>
      <path id="Tracé_3204" data-name="Tracé 3204" d="M396.58,120.52l9.58,16.6H387Z" transform="translate(-126.271 -76.378)" fill="#f5f5f5"/>
      <rect id="Rectangle_18923" data-name="Rectangle 18923" width="41.023" height="44.742" transform="translate(235.188 102.162) rotate(180)" fill="#e0e0e0"/>
      <rect id="Rectangle_18924" data-name="Rectangle 18924" width="42.087" height="44.742" transform="translate(233.807 102.162) rotate(180)" fill="#f5f5f5"/>
      <rect id="Rectangle_18925" data-name="Rectangle 18925" width="37.694" height="35.04" transform="translate(230.276 60.944) rotate(90)" fill="#fff"/>
      <path id="Tracé_3205" data-name="Tracé 3205" d="M307.108,176.333l-4.157-7.2a4.945,4.945,0,0,1,4.285-7.411h8.334a4.952,4.952,0,0,1,4.292,7.411l-4.157,7.2a4.952,4.952,0,0,1-8.6,0Z" transform="translate(-98.633 -89.821)" fill="#f5f5f5"/>
    </g>
    <g id="freepik--Shadow--inject-57" transform="translate(37.802 290.747)">
      <ellipse id="freepik--path--inject-57" cx="130.627" cy="7.626" rx="130.627" ry="7.626" fill="#f5f5f5"/>
    </g>
    <g id="freepik--Checklist--inject-57" transform="translate(57.926 70.744)">
      <path id="Tracé_3206" data-name="Tracé 3206" d="M241.285,99.3H85.98L96.2,310.807H251.506Z" transform="translate(-85.98 -85.199)" fill="#e34168"/>
      <path id="Tracé_3207" data-name="Tracé 3207" d="M241.285,99.3H85.98L96.2,310.807H251.506Z" transform="translate(-85.98 -85.199)" opacity="0.2"/>
      <path id="Tracé_3208" data-name="Tracé 3208" d="M243.415,99.3H88.11L98.337,310.807H253.642Z" transform="translate(-86.675 -85.199)" fill="#e34168"/>
      <path id="Tracé_3209" data-name="Tracé 3209" d="M238.655,109.86H98.65l9.782,194.832,121.741-.162L250.4,286.6Z" transform="translate(-90.114 -88.644)" opacity="0.2"/>
      <path id="Tracé_3210" data-name="Tracé 3210" d="M239.726,109.85a1586.346,1586.346,0,0,0,14.114,174.4Q237.2,295.7,220.728,307.155H116.018A1590.431,1590.431,0,0,1,98.65,109.85Z" transform="translate(-90.114 -88.641)" fill="#fff"/>
      <path id="Tracé_3211" data-name="Tracé 3211" d="M312.963,365.121q-16.641,11.453-33.113,22.906,3.6-15.159,7.5-30.317Z" transform="translate(-149.236 -169.513)" fill="#ebebeb"/>
      <path id="Tracé_3212" data-name="Tracé 3212" d="M143.5,135.217q.4,10.7.93,21.411h-21.4q-.539-10.712-.93-21.411h21.4m2.183-2.257H119.76q.451,12.956,1.125,25.925h25.931q-.674-12.962-1.125-25.925Z" transform="translate(-97.002 -96.181)" fill="#e34168"/>
      <path id="Tracé_3213" data-name="Tracé 3213" d="M249.223,145.9H175.909c-.067-1.61-.128-3.227-.189-4.837h73.307C249.088,142.67,249.155,144.287,249.223,145.9Z" transform="translate(-115.261 -98.824)" fill="#e0e0e0"/>
      <path id="Tracé_3214" data-name="Tracé 3214" d="M233.936,161H176.562c-.074-1.617-.155-3.227-.222-4.837h57.367Z" transform="translate(-115.463 -103.751)" fill="#e0e0e0"/>
      <path id="Tracé_3215" data-name="Tracé 3215" d="M146.589,197.457q.674,10.712,1.5,21.424H126.681q-.829-10.712-1.5-21.424h21.411M148.7,195.2H122.78q.795,12.969,1.812,25.938h25.958q-1.011-12.962-1.819-25.938Z" transform="translate(-97.987 -116.489)" fill="#e34168"/>
      <path id="Tracé_3216" data-name="Tracé 3216" d="M206.192,208.144H179.243c-.108-1.617-.222-3.227-.323-4.844h26.949C205.97,204.917,206.078,206.527,206.192,208.144Z" transform="translate(-116.305 -119.132)" fill="#e0e0e0"/>
      <path id="Tracé_3217" data-name="Tracé 3217" d="M247.517,208.144H227.7c-.108-1.617-.222-3.227-.323-4.844h19.814C247.3,204.917,247.4,206.527,247.517,208.144Z" transform="translate(-132.116 -119.132)" fill="#e0e0e0"/>
      <path id="Tracé_3218" data-name="Tracé 3218" d="M244.485,223.254H180.327c-.121-1.617-.236-3.227-.357-4.844h64.158C244.249,220.027,244.364,221.637,244.485,223.254Z" transform="translate(-116.647 -124.062)" fill="#e0e0e0"/>
      <path id="Tracé_3219" data-name="Tracé 3219" d="M151.33,259.727q.963,10.712,2.075,21.424H131.994q-1.112-10.712-2.075-21.424H151.33m2.062-2.257H127.46q1.145,12.976,2.506,25.945H155.9Q154.55,270.439,153.391,257.47Z" transform="translate(-99.514 -136.807)" fill="#e34168"/>
      <path id="Tracé_3220" data-name="Tracé 3220" d="M258.591,280.69H185.27l.485,4.837h73.321Z" transform="translate(-118.377 -144.383)" fill="#e0e0e0"/>
      <path id="Tracé_3221" data-name="Tracé 3221" d="M241.214,265.58H183.84c.148,1.61.3,3.227.451,4.837h57.367C241.51,268.807,241.355,267.21,241.214,265.58Z" transform="translate(-117.91 -139.453)" fill="#e0e0e0"/>
      <path id="Tracé_3222" data-name="Tracé 3222" d="M157.73,322q1.253,10.712,2.648,21.417H138.967q-1.395-10.7-2.648-21.417H157.73m2.021-2.257H133.8q1.482,12.976,3.2,25.931h25.9q-1.7-12.956-3.2-25.931Z" transform="translate(-101.583 -157.124)" fill="#e34168"/>
      <path id="Tracé_3223" data-name="Tracé 3223" d="M264.3,332.654H190.979c-.2-1.617-.391-3.227-.579-4.844h73.314C263.909,329.447,264.1,331.057,264.3,332.654Z" transform="translate(-120.05 -159.758)" fill="#e0e0e0"/>
      <path id="Tracé_3224" data-name="Tracé 3224" d="M226.229,347.787H192.853c-.209-1.61-.411-3.227-.613-4.837h33.376C225.818,344.56,226.02,346.177,226.229,347.787Z" transform="translate(-120.651 -164.697)" fill="#e0e0e0"/>
      <path id="Tracé_3225" data-name="Tracé 3225" d="M264.994,347.787H250.583c-.209-1.61-.411-3.227-.613-4.837h14.411C264.583,344.56,264.812,346.177,264.994,347.787Z" transform="translate(-139.487 -164.697)" fill="#e0e0e0"/>
      <path id="Tracé_3226" data-name="Tracé 3226" d="M136.778,154.835l-.95-1.509c-2.075-3.3-6.306-6.245-7.768-7.108l1.091-1.934a30.654,30.654,0,0,1,7.586,6.515c3.261-4.44,8.085-9.028,14.687-13.959l1.395,1.819c-7.047,5.275-11.979,10.106-15.091,14.754Z" transform="translate(-99.71 -97.447)" fill="#e34168"/>
      <path id="Tracé_3227" data-name="Tracé 3227" d="M140.47,217.088l-.99-1.509c-2.156-3.3-6.468-6.252-7.95-7.114l1.031-1.934a31.665,31.665,0,0,1,7.768,6.522c3.14-4.447,7.835-9.035,14.31-13.973.478.606.963,1.213,1.442,1.826-6.906,5.282-11.709,10.106-14.694,14.761C141.077,216.139,140.773,216.617,140.47,217.088Z" transform="translate(-100.842 -117.755)" fill="#e34168"/>
      <path id="Tracé_3228" data-name="Tracé 3228" d="M145.876,279.518l-1.031-1.509c-2.25-3.3-6.643-6.252-8.145-7.108.323-.674.674-1.294.984-1.934a33.073,33.073,0,0,1,7.936,6.515c3.025-4.447,7.6-9.028,13.932-13.973l1.5,1.826c-6.737,5.282-11.453,10.106-14.3,14.761Z" transform="translate(-102.529 -138.125)" fill="#e34168"/>
      <path id="Tracé_3229" data-name="Tracé 3229" d="M215.134,382.014a13.93,13.93,0,0,1-8.287-2.762c-2.021-1.294-3.759-2.412-7.114-2.412a9.016,9.016,0,0,0-6.434,2.412,10.781,10.781,0,0,1-7.5,2.762,13.89,13.89,0,0,1-8.28-2.762c-2.014-1.294-3.753-2.412-7.114-2.412a9,9,0,0,0-6.434,2.412,10.775,10.775,0,0,1-7.492,2.762,13.947,13.947,0,0,1-8.287-2.762c-2.021-1.294-3.753-2.412-7.114-2.412-.088-.674-.182-1.294-.269-1.94a13.907,13.907,0,0,1,8.28,2.762c2.021,1.294,3.753,2.412,7.108,2.412a9.016,9.016,0,0,0,6.434-2.412,10.8,10.8,0,0,1,7.505-2.762,13.884,13.884,0,0,1,8.273,2.762c2.021,1.294,3.759,2.412,7.114,2.412a9.016,9.016,0,0,0,6.434-2.412,10.8,10.8,0,0,1,7.505-2.762,13.907,13.907,0,0,1,8.28,2.762c2.021,1.294,3.753,2.412,7.114,2.412C214.946,380.721,215.047,381.368,215.134,382.014Z" transform="translate(-103.87 -175.122)" fill="#ebebeb"/>
      <path id="Tracé_3230" data-name="Tracé 3230" d="M222.824,97.705c-2.277-6.063-7.539-10.045-13.2-10.045H198.092a4.386,4.386,0,0,1-4.009-2.695,10.779,10.779,0,0,0-9.816-6.6,9.547,9.547,0,0,0-9.176,6.6,3.894,3.894,0,0,1-3.753,2.695H159.812c-5.666,0-10.544,4-12.228,10.045l-.674,2.405h76.8Z" transform="translate(-105.86 -78.369)" fill="#263238"/>
      <path id="Tracé_3231" data-name="Tracé 3231" d="M222.385,111.866H146.794a2.52,2.52,0,0,1-2.486-2.371h0a2.243,2.243,0,0,1,2.257-2.365h75.591a2.52,2.52,0,0,1,2.486,2.365h0a2.243,2.243,0,0,1-2.257,2.371Z" transform="translate(-105.01 -87.753)" fill="#e34168"/>
      <path id="Tracé_3232" data-name="Tracé 3232" d="M222.385,111.866H146.794a2.52,2.52,0,0,1-2.486-2.371h0a2.243,2.243,0,0,1,2.257-2.365h75.591a2.52,2.52,0,0,1,2.486,2.365h0a2.243,2.243,0,0,1-2.257,2.371Z" transform="translate(-105.01 -87.753)" opacity="0.2"/>
    </g>
    <g id="freepik--Character--inject-57" transform="translate(173.071 97.666)">
      <path id="Tracé_3233" data-name="Tracé 3233" d="M358.29,404.693h-4.938l-.492-11.433H357.8Z" transform="translate(-288.203 -208.035)" fill="#ffc3bd"/>
      <path id="Tracé_3234" data-name="Tracé 3234" d="M401.318,404.693h-4.938L393.9,393.26h4.932Z" transform="translate(-301.594 -208.035)" fill="#ffc3bd"/>
      <path id="Tracé_3235" data-name="Tracé 3235" d="M393.328,409.38h5.545a.424.424,0,0,1,.418.337l.977,4.393a.728.728,0,0,1-.721.876c-1.934-.034-2.877-.148-5.316-.148-1.5,0-4.595.155-6.663.155s-2.345-2.021-1.5-2.23c3.806-.835,5.235-1.981,6.454-3.079A1.213,1.213,0,0,1,393.328,409.38Z" transform="translate(-298.893 -213.295)" fill="#263238"/>
      <path id="Tracé_3236" data-name="Tracé 3236" d="M347.883,409.38h5.39a.425.425,0,0,1,.418.337l.977,4.393a.714.714,0,0,1-.674.876c-1.947-.034-4.756-.148-7.2-.148-2.857,0-5.322.155-8.677.155-2.021,0-2.587-2.021-1.738-2.23,3.86-.849,7.013-.936,10.348-3A2.317,2.317,0,0,1,347.883,409.38Z" transform="translate(-282.701 -213.295)" fill="#263238"/>
      <path id="Tracé_3237" data-name="Tracé 3237" d="M362.9,142.92c-.674,3.611-1.064,8.085,1.462,10.5,0,0-1.448,3.665-8.159,3.665-6.131,0-3.059-3.665-3.059-3.665,4.042-.963,3.813-5.942,3.113-8.758Z" transform="translate(-288.046 -126.353)" fill="#ffc3bd"/>
      <path id="Tracé_3238" data-name="Tracé 3238" d="M350.66,157.751c.135-.9,1.711-1.94,3.5-2.331s8.677-1.26,10.779-.391-.364,3.443-.364,3.443Z" transform="translate(-287.486 -130.183)" fill="#e34168"/>
      <path id="Tracé_3239" data-name="Tracé 3239" d="M350.66,157.751c.135-.9,1.711-1.94,3.5-2.331s8.677-1.26,10.779-.391-.364,3.443-.364,3.443Z" transform="translate(-287.486 -130.183)" fill="#fff" opacity="0.4"/>
      <path id="Tracé_3240" data-name="Tracé 3240" d="M352.86,393.27l.256,5.888h4.938l-.256-5.888Z" transform="translate(-288.203 -208.038)" opacity="0.2"/>
      <path id="Tracé_3241" data-name="Tracé 3241" d="M398.838,393.27H393.9l1.28,5.888h4.938Z" transform="translate(-301.594 -208.038)" opacity="0.2"/>
      <path id="Tracé_3242" data-name="Tracé 3242" d="M382.469,165.1l-5.949,3.975s8.543,15.192,7.829,17.624c-.977,3.315-2.338,10.557-4.191,14.236a6.92,6.92,0,0,0,2.163,2.917c4.716-3.584,9.479-14.822,9.3-17.968C391.214,178.75,382.469,165.1,382.469,165.1Z" transform="translate(-295.923 -133.59)" fill="#ffc3bd"/>
      <path id="Tracé_3243" data-name="Tracé 3243" d="M379.636,218.134l-4.716-.364,2.473,5.194s4.116.182,4.8-2.964Z" transform="translate(-295.401 -150.776)" fill="#b55b52"/>
      <path id="Tracé_3244" data-name="Tracé 3244" d="M369.167,231.657l-.4.748-2.668,5.046L271.39,187.374l3.059-5.794Z" transform="translate(-261.621 -138.967)" fill="#e34168"/>
      <path id="Tracé_3245" data-name="Tracé 3245" d="M378.257,214.481l-1.954,3.692-1.1,2.089L280.48,170.184l3.059-5.794Z" transform="translate(-264.587 -133.359)" fill="#e34168"/>
      <rect id="Rectangle_18926" data-name="Rectangle 18926" width="6.549" height="107.141" transform="translate(12.858 42.596) rotate(-62.09)" fill="#e34168"/>
      <rect id="Rectangle_18927" data-name="Rectangle 18927" width="6.549" height="107.141" transform="translate(12.858 42.596) rotate(-62.09)" opacity="0.2"/>
      <path id="Tracé_3246" data-name="Tracé 3246" d="M264,165.161l-2.755,5.215,6.838,11.393,9.183-17.368Z" transform="translate(-258.309 -133.362)" fill="#e34168"/>
      <path id="Tracé_3247" data-name="Tracé 3247" d="M264,165.161l-2.755,5.215,6.838,11.393,9.183-17.368Z" transform="translate(-258.309 -133.362)" fill="#fff" opacity="0.8"/>
      <path id="Tracé_3248" data-name="Tracé 3248" d="M256.89,165.86l2.931,4.884,2.755-5.215Z" transform="translate(-256.89 -133.731)" fill="#e34168"/>
      <path id="Tracé_3249" data-name="Tracé 3249" d="M369.29,220.135l2.466,4.595,3.82-1.765L373.1,217.77Z" transform="translate(-293.564 -150.776)" fill="#b55b52"/>
      <path id="Tracé_3250" data-name="Tracé 3250" d="M379.9,160.116c4.669.674,10.018,16.843,10.018,16.843L380.1,182.5a117.289,117.289,0,0,1-6.441-13.393C371.427,163.114,374.89,159.389,379.9,160.116Z" transform="translate(-294.765 -131.935)" fill="#263238"/>
      <path id="Tracé_3251" data-name="Tracé 3251" d="M378.667,168.251c-2.122-1.94-.822,6.367.189,11.682.519,1.038,1.011,1.981,1.428,2.769C382.649,178.525,381.591,170.925,378.667,168.251Z" transform="translate(-296.251 -134.524)" opacity="0.2"/>
      <path id="Tracé_3252" data-name="Tracé 3252" d="M340.912,159.8s-5.828,14.9-.3,42.66h26.43c.182-4.042-2.365-23.823,1.543-42.916a68.719,68.719,0,0,0-8.839-1.118,97.28,97.28,0,0,0-11.217,0A49.185,49.185,0,0,0,340.912,159.8Z" transform="translate(-283.43 -131.358)" fill="#263238"/>
      <path id="Tracé_3253" data-name="Tracé 3253" d="M332.715,169.544l-6.656-2.634s-7.667,15.65-10.106,16.439c-3.281,1.078-10.018,4.042-14.1,4.622a7.124,7.124,0,0,0-1.179,3.436c5.626,1.839,17.6-.6,20.077-2.526C326.436,184.487,332.715,169.544,332.715,169.544Z" transform="translate(-271.171 -134.181)" fill="#ffc3bd"/>
      <path id="Tracé_3254" data-name="Tracé 3254" d="M345.746,166.585a4.863,4.863,0,0,0-5.39-3.22,70.864,70.864,0,0,0-2.021,20.212l1.57.755S347.625,170.917,345.746,166.585Z" transform="translate(-283.454 -133.001)" opacity="0.2"/>
      <path id="Tracé_3255" data-name="Tracé 3255" d="M342.864,163.843c1.657,4.42-6.737,17.422-6.737,17.422l-9.877-5.39a60.284,60.284,0,0,1,5.706-11.554C335.426,159.141,341.038,159,342.864,163.843Z" transform="translate(-279.521 -132.031)" fill="#263238"/>
      <path id="Tracé_3256" data-name="Tracé 3256" d="M299.945,198.15,294.07,199.4l2.978,5.437a16.257,16.257,0,0,0,4.413-3.22Z" transform="translate(-269.021 -144.374)" fill="#ffc3bd"/>
      <path id="Tracé_3257" data-name="Tracé 3257" d="M289.95,201.246l2.345,3.247,3.409.984-2.978-5.437Z" transform="translate(-267.677 -144.991)" fill="#ffc3bd"/>
      <path id="Tracé_3258" data-name="Tracé 3258" d="M350.925,134.848a.608.608,0,0,1-.512.674c-.263,0-.451-.35-.424-.748s.249-.674.512-.674S350.952,134.45,350.925,134.848Z" transform="translate(-287.266 -123.475)" fill="#263238"/>
      <path id="Tracé_3259" data-name="Tracé 3259" d="M350.885,135.26a14.2,14.2,0,0,1-2.1,3.288,2.284,2.284,0,0,0,1.88.465Z" transform="translate(-286.875 -123.854)" fill="#ed847e"/>
      <path id="Tracé_3260" data-name="Tracé 3260" d="M350.529,132.459a.317.317,0,0,1-.1-.04.229.229,0,0,1-.067-.323,2.345,2.345,0,0,1,1.826-1.1.249.249,0,0,1,.236.236.236.236,0,0,1-.236.236h0a1.846,1.846,0,0,0-1.408.883.236.236,0,0,1-.249.115Z" transform="translate(-287.375 -122.461)" fill="#263238"/>
      <path id="Tracé_3261" data-name="Tracé 3261" d="M364.369,131.044c-.579,4.864-.674,7.734-3.281,10.106-3.928,3.557-9.823.977-10.712-3.968-.795-4.447.29-11.649,5.181-13.319a6.683,6.683,0,0,1,8.812,7.182Z" transform="translate(-287.316 -120.015)" fill="#ffc3bd"/>
      <path id="Tracé_3262" data-name="Tracé 3262" d="M352.5,130.309c-1.7.337-4.426-3.449-2.2-6.663-1.125-.559-4.8,1.651-6.178-.411s2.452-3.16,1.718-4.9c2.6.532-1.684,3.78.788,3.463s5.322-4.884,8.085-3.012c4.884,3.281,11.541-2.19,8.826,4.662,3.328-.674,5.605,3.261,2.432,5.989-6.326,5.423-2.432,6.138-6.441,6.414C357.524,135.995,352.855,133.6,352.5,130.309Z" transform="translate(-285.254 -118.33)" fill="#263238"/>
      <path id="Tracé_3263" data-name="Tracé 3263" d="M358.413,136.666a4.042,4.042,0,0,1-2.351,2.082c-1.347.465-2.122-.741-1.806-2.068.283-1.2,1.347-2.883,2.742-2.762a1.839,1.839,0,0,1,1.415,2.749Z" transform="translate(-288.636 -123.414)" fill="#ffc3bd"/>
      <path id="Tracé_3264" data-name="Tracé 3264" d="M355.67,223.86s5.605,37.728,8.677,51.876c3.369,15.5,16.055,67.028,16.055,67.028h9.041s-8.361-50.3-10.288-65.627c-2.082-16.627-6.447-53.257-6.447-53.257Z" transform="translate(-289.12 -152.763)" fill="#e34168"/>
      <path id="Tracé_3265" data-name="Tracé 3265" d="M355.67,223.86s5.605,37.728,8.677,51.876c3.369,15.5,16.055,67.028,16.055,67.028h9.041s-8.361-50.3-10.288-65.627c-2.082-16.627-6.447-53.257-6.447-53.257Z" transform="translate(-289.12 -152.763)" fill="#fff" opacity="0.2"/>
      <path id="Tracé_3266" data-name="Tracé 3266" d="M363.817,243.1c-.418-.593-.795-.795-1.145-.674H362.6a.984.984,0,0,0-.222.135,1.347,1.347,0,0,0-.2.2l-.108.135-.141.222a4.331,4.331,0,0,0-.3.613c-.054.128-.108.263-.155.4s-.121.344-.175.532-.155.512-.229.788a.844.844,0,0,1-.054.216c-.02.074-.074.31-.108.465s-.061.27-.088.4c-.061.263-.115.539-.168.822s-.115.613-.168.93a1.978,1.978,0,0,1-.054.33c-.067.4-.128.815-.189,1.24h0c1.5,9.392,3.274,20.158,4.716,27.67.067-.243.141-.5.2-.775a35.034,35.034,0,0,0,.674-3.8C367.105,263.262,366.519,246.958,363.817,243.1Z" transform="translate(-290.611 -158.809)" opacity="0.2"/>
      <path id="Tracé_3267" data-name="Tracé 3267" d="M341.6,223.86s-.674,36.906-.141,51.964c.559,15.657,6.03,66.92,6.03,66.92h8.361s.3-50.354.674-65.728c.4-16.762,2.425-53.156,2.425-53.156Z" transform="translate(-284.417 -152.763)" fill="#e34168"/>
      <path id="Tracé_3268" data-name="Tracé 3268" d="M341.6,223.86s-.674,36.906-.141,51.964c.559,15.657,6.03,66.92,6.03,66.92h8.361s.3-50.354.674-65.728c.4-16.762,2.425-53.156,2.425-53.156Z" transform="translate(-284.417 -152.763)" fill="#fff" opacity="0.2"/>
      <path id="Tracé_3269" data-name="Tracé 3269" d="M358.875,396.357c.034,0,0,2.729,0,2.729h-9.641l-.4-3.065Z" transform="translate(-286.888 -208.936)" fill="#263238"/>
      <path id="Tracé_3270" data-name="Tracé 3270" d="M400.782,396.641c.04,0,.451,2.526.451,2.526H391.3l-.876-2.9Z" transform="translate(-300.459 -209.017)" fill="#263238"/>
      <path id="Tracé_3271" data-name="Tracé 3271" d="M394.059,410.055a1.482,1.482,0,0,1-.95-.249.674.674,0,0,1-.243-.62.384.384,0,0,1,.2-.33c.546-.276,2.142.674,2.324.808a.121.121,0,0,1,.047.121.115.115,0,0,1-.088.094,5.941,5.941,0,0,1-1.287.175Zm-.734-1.017a.357.357,0,0,0-.155,0,.148.148,0,0,0-.074.135.478.478,0,0,0,.162.424,2.358,2.358,0,0,0,1.752.094A4.716,4.716,0,0,0,393.325,409.038Z" transform="translate(-301.255 -213.107)" fill="#e34168"/>
      <path id="Tracé_3272" data-name="Tracé 3272" d="M395.8,409.336a.087.087,0,0,1-.054,0c-.512-.276-1.5-1.347-1.395-1.907a.377.377,0,0,1,.371-.3.613.613,0,0,1,.5.148c.573.465.674,1.893.674,1.954a.141.141,0,0,1-.054.108.115.115,0,0,1-.04,0Zm-1-2.021h-.02c-.155,0-.168.088-.175.121-.061.323.566,1.139,1.078,1.523a2.789,2.789,0,0,0-.586-1.543.384.384,0,0,0-.317-.088Z" transform="translate(-301.741 -212.557)" fill="#e34168"/>
      <path id="Tracé_3273" data-name="Tracé 3273" d="M349.9,410.056a1.853,1.853,0,0,1-1.2-.3.674.674,0,0,1-.216-.566.35.35,0,0,1,.189-.31c.6-.337,2.587.674,2.809.788a.115.115,0,0,1-.034.216A7.988,7.988,0,0,1,349.9,410.056Zm-.9-1.017a.492.492,0,0,0-.216.04.148.148,0,0,0-.074.128.411.411,0,0,0,.141.371,3.167,3.167,0,0,0,2.21.135,6.494,6.494,0,0,0-2.062-.674Z" transform="translate(-286.776 -213.108)" fill="#e34168"/>
      <path id="Tracé_3274" data-name="Tracé 3274" d="M352.019,409.332h-.047c-.6-.269-1.779-1.347-1.684-1.893,0-.128.115-.3.431-.323a.842.842,0,0,1,.674.2,3.349,3.349,0,0,1,.761,1.907.1.1,0,0,1-.047.1.121.121,0,0,1-.088.013Zm-1.206-2.021h-.047c-.209,0-.222.1-.229.135-.054.33.748,1.172,1.347,1.536a2.7,2.7,0,0,0-.674-1.523.673.673,0,0,0-.4-.135Z" transform="translate(-287.362 -212.553)" fill="#e34168"/>
    </g>
  </g>
</svg>
