<svg id="bar_chart-24px" xmlns="http://www.w3.org/2000/svg" width="28.653" height="28.653" viewBox="0 0 28.653 28.653">
  <path id="Tracé_2545" data-name="Tracé 2545" d="M0,0H28.653V28.653H0Z" fill="none"/>
  <path id="ic_thumb_up_24px" d="M1,18.139H4.428V7.856H1ZM19.853,8.712A1.719,1.719,0,0,0,18.139,7H12.732l.814-3.916.026-.274a1.29,1.29,0,0,0-.377-.908L12.286,1,6.647,6.647a1.676,1.676,0,0,0-.506,1.208v8.569a1.719,1.719,0,0,0,1.714,1.714h7.712a1.7,1.7,0,0,0,1.577-1.045l2.588-6.041a1.693,1.693,0,0,0,.12-.626V8.79l-.009-.009Z" transform="translate(3.9 5.354)" fill="#fff"/>
</svg>
