<svg id="Group_14363" data-name="Group 14363" xmlns="http://www.w3.org/2000/svg" width="24" height="24" viewBox="0 0 24 24">
  <path id="Path_937" data-name="Path 937" d="M0,0H24V24H0Z" fill="none"/>
  <g id="filter" transform="translate(2 3)">
    <path id="Path_4544" data-name="Path 4544" d="M22,3H2l8,9.46V19l4,2V12.46Z" transform="translate(-2 -3)" fill="#fff"/>
  </g>
</svg>
