<svg id="bar_chart-24px" xmlns="http://www.w3.org/2000/svg" width="28.653" height="28.653" viewBox="0 0 28.653 28.653">
  <path id="Tracé_2545" data-name="Tracé 2545" d="M0,0H28.653V28.653H0Z" fill="none"/>
  <path id="Soustraction_6" data-name="Soustraction 6" d="M10.745,21.49A10.745,10.745,0,1,1,21.49,10.745,10.757,10.757,0,0,1,10.745,21.49Zm0-6.984a4.278,4.278,0,0,1,3.708,2.149h1.794a5.9,5.9,0,0,0-11,0H7.038A4.306,4.306,0,0,1,10.745,14.506Zm3.761-6.984a1.612,1.612,0,1,0,1.612,1.612A1.613,1.613,0,0,0,14.506,7.522Zm-7.522,0A1.612,1.612,0,1,0,8.6,9.134,1.613,1.613,0,0,0,6.984,7.522Zm8.124-4.048h0L12.069,6.512l.76.76,3.039-3.039-.76-.759Zm-8.727,0h0l-.759.759L8.662,7.272l.759-.76L6.382,3.474Z" transform="translate(3.582 4.179)" fill="#fff"/>
</svg>
