<svg id="Check-list" xmlns="http://www.w3.org/2000/svg" width="196.73" height="200.622" viewBox="0 0 196.73 200.622">
  <g id="freepik--background-complete--inject-3" transform="translate(3.338)">
    <path id="Tracé_4272" data-name="Tracé 4272" d="M55.86,70.71H131.9v99.384H55.86Zm74.033,2.006H57.866v95.372h72.027Z" transform="translate(-50.367 -54.965)" fill="#ebebeb"/>
    <rect id="Rectangle_19208" data-name="Rectangle 19208" width="2.006" height="95.852" transform="translate(43.291 18.277)" fill="#ebebeb"/>
    <rect id="Rectangle_19209" data-name="Rectangle 19209" width="79.678" height="2.79" transform="translate(83.349 22.593) rotate(180)" fill="#ebebeb"/>
    <rect id="Rectangle_19210" data-name="Rectangle 19210" width="79.678" height="2.79" transform="translate(83.349 25.734) rotate(180)" fill="#ebebeb"/>
    <rect id="Rectangle_19211" data-name="Rectangle 19211" width="79.678" height="2.79" transform="translate(83.349 28.87) rotate(180)" fill="#ebebeb"/>
    <rect id="Rectangle_19212" data-name="Rectangle 19212" width="79.678" height="2.79" transform="translate(83.349 32.015) rotate(180)" fill="#ebebeb"/>
    <rect id="Rectangle_19213" data-name="Rectangle 19213" width="79.678" height="2.79" transform="translate(83.349 35.156) rotate(180)" fill="#ebebeb"/>
    <rect id="Rectangle_19214" data-name="Rectangle 19214" width="79.678" height="2.79" transform="translate(83.349 38.296) rotate(180)" fill="#ebebeb"/>
    <rect id="Rectangle_19215" data-name="Rectangle 19215" width="79.678" height="2.79" transform="translate(83.349 41.437) rotate(180)" fill="#ebebeb"/>
    <rect id="Rectangle_19216" data-name="Rectangle 19216" width="79.678" height="2.79" transform="translate(83.349 44.582) rotate(180)" fill="#ebebeb"/>
    <rect id="Rectangle_19217" data-name="Rectangle 19217" width="79.678" height="2.79" transform="translate(83.349 47.723) rotate(180)" fill="#ebebeb"/>
    <rect id="Rectangle_19218" data-name="Rectangle 19218" width="0.503" height="64.358" transform="translate(9.629 19.231)" fill="#263238"/>
    <path id="Tracé_4273" data-name="Tracé 4273" d="M63.44,219.9h1.78l-.447-2.555h-.885Z" transform="translate(-54.452 -133.978)" fill="#263238"/>
    <rect id="Rectangle_19219" data-name="Rectangle 19219" width="0.503" height="93.103" transform="translate(7.822 19.231)" fill="#263238"/>
    <path id="Tracé_4274" data-name="Tracé 4274" d="M59.53,281.245h1.776l-.443-2.555h-.89Z" transform="translate(-52.345 -167.029)" fill="#263238"/>
    <rect id="Rectangle_19220" data-name="Rectangle 19220" width="85.899" height="5.843" transform="translate(86.462 21.196) rotate(180)" fill="#dbdbdb"/>
    <rect id="Rectangle_19221" data-name="Rectangle 19221" width="12.212" height="5.161" transform="translate(183.24 137.911) rotate(180)" fill="#ebebeb"/>
    <rect id="Rectangle_19222" data-name="Rectangle 19222" width="12.212" height="5.161" transform="translate(190.052 144.419) rotate(180)" fill="#ebebeb"/>
    <rect id="Rectangle_19223" data-name="Rectangle 19223" width="12.212" height="5.161" transform="translate(176.424 144.419) rotate(180)" fill="#ebebeb"/>
    <rect id="Rectangle_19224" data-name="Rectangle 19224" width="12.212" height="5.161" transform="translate(19.024 144.419) rotate(180)" fill="#ebebeb"/>
    <rect id="Rectangle_19225" data-name="Rectangle 19225" width="12.212" height="5.161" transform="translate(19.024 5.161) rotate(180)" fill="#ebebeb"/>
    <rect id="Rectangle_19226" data-name="Rectangle 19226" width="12.212" height="5.161" transform="translate(12.212 11.668) rotate(180)" fill="#ebebeb"/>
    <rect id="Rectangle_19227" data-name="Rectangle 19227" width="12.212" height="5.161" transform="translate(190.052 5.165) rotate(180)" fill="#ebebeb"/>
    <rect id="Rectangle_19228" data-name="Rectangle 19228" width="12.212" height="5.161" transform="translate(99.513 39.781)" fill="#ebebeb"/>
    <rect id="Rectangle_19229" data-name="Rectangle 19229" width="12.212" height="5.161" transform="translate(92.702 33.274)" fill="#ebebeb"/>
  </g>
  <g id="freepik--Floor--inject-3" transform="translate(0 171.946)">
    <path id="Tracé_4275" data-name="Tracé 4275" d="M36.71,409.641l24.59-.111,24.59-.042,49.185-.078,49.18.078,24.595.042,24.59.111-24.59.111-24.595.042-49.18.078-49.185-.078-24.59-.042Z" transform="translate(-36.71 -409.41)" fill="#263238"/>
  </g>
  <g id="freepik--Shadow--inject-3" transform="translate(0 182.646)">
    <ellipse id="Ellipse_3474" data-name="Ellipse 3474" cx="57.859" cy="8.988" rx="57.859" ry="8.988" transform="translate(0 0)" fill="#ebebeb"/>
    <ellipse id="Ellipse_3475" data-name="Ellipse 3475" cx="22.69" cy="5.783" rx="22.69" ry="5.783" transform="translate(126.414 3.205)" fill="#ebebeb"/>
  </g>
  <g id="freepik--Cheklist--inject-3" transform="translate(29.377 15.98)">
    <path id="Tracé_4276" data-name="Tracé 4276" d="M270.7,249.59h-116L165.473,95.5H281.483Z" transform="translate(-151.855 -84.303)" fill="#e34168"/>
    <g id="Groupe_14127" data-name="Groupe 14127" transform="translate(2.845 11.197)" opacity="0.1">
      <path id="Tracé_4277" data-name="Tracé 4277" d="M270.7,249.59h-116L165.473,95.5H281.483Z" transform="translate(-154.7 -95.5)"/>
    </g>
    <path id="Tracé_4278" data-name="Tracé 4278" d="M264.539,249.59H148.53L159.308,95.5h116Z" transform="translate(-148.53 -84.303)" fill="#e34168"/>
    <path id="Tracé_4279" data-name="Tracé 4279" d="M268.882,247.655,166.39,248.96l7.937-138.815,102.5-1.305Z" transform="translate(-158.153 -91.49)" fill="#ebebeb"/>
    <path id="Tracé_4280" data-name="Tracé 4280" d="M263.739,248.891,161.51,246.682l12.7-138.792,102.229,2.2Z" transform="translate(-155.524 -90.979)" fill="#dbdbdb"/>
    <path id="Tracé_4281" data-name="Tracé 4281" d="M266.969,249.074H164.56l9.708-138.824H276.677Z" transform="translate(-157.167 -92.25)" fill="#fff"/>
    <path id="Tracé_4282" data-name="Tracé 4282" d="M219.974,193.244H209.75l.715-10.224h10.224Z" transform="translate(-181.517 -131.46)" fill="#ebebeb"/>
    <path id="Tracé_4283" data-name="Tracé 4283" d="M278.336,184.519H245.21l.106-1.5h33.126Z" transform="translate(-200.623 -131.46)" fill="#263238"/>
    <path id="Tracé_4284" data-name="Tracé 4284" d="M303.049,190.819H244.77l.106-1.5h58.275Z" transform="translate(-200.386 -134.855)" fill="#ebebeb"/>
    <path id="Tracé_4285" data-name="Tracé 4285" d="M302.6,197.129H244.33l.106-1.5h58.275Z" transform="translate(-200.149 -138.255)" fill="#ebebeb"/>
    <path id="Tracé_4286" data-name="Tracé 4286" d="M302.165,203.439H243.89l.106-1.5h58.275Z" transform="translate(-199.912 -141.655)" fill="#ebebeb"/>
    <path id="Tracé_4287" data-name="Tracé 4287" d="M212.24,185.424c.355.314.692.646,1.024.973s.65.673.978,1.01c.641.683,1.254,1.384,1.845,2.089l-1.181.078a51.189,51.189,0,0,1,3.574-5.585c.659-.895,1.347-1.766,2.075-2.615a27.806,27.806,0,0,1,2.352-2.435,24.732,24.732,0,0,1-1.356,3.067c-.5.987-1.051,1.946-1.633,2.887a50.73,50.73,0,0,1-3.837,5.419l-.7.858-.461-.784c-.461-.8-.959-1.6-1.384-2.426-.221-.42-.461-.826-.66-1.25S212.429,185.839,212.24,185.424Z" transform="translate(-182.858 -129.262)" fill="#e34168"/>
    <path id="Tracé_4288" data-name="Tracé 4288" d="M217.074,234.694H206.85l.715-10.224h10.224Z" transform="translate(-179.954 -153.794)" fill="#ebebeb"/>
    <path id="Tracé_4289" data-name="Tracé 4289" d="M275.436,225.969H242.31l.106-1.5h33.126Z" transform="translate(-199.061 -153.794)" fill="#263238"/>
    <path id="Tracé_4290" data-name="Tracé 4290" d="M300.149,232.279H241.87l.106-1.5h58.275Z" transform="translate(-198.824 -157.194)" fill="#ebebeb"/>
    <path id="Tracé_4291" data-name="Tracé 4291" d="M299.709,238.589H241.43l.106-1.5h58.275Z" transform="translate(-198.587 -160.594)" fill="#ebebeb"/>
    <path id="Tracé_4292" data-name="Tracé 4292" d="M299.269,244.894H240.99l.106-1.494h58.274Z" transform="translate(-198.349 -163.994)" fill="#ebebeb"/>
    <path id="Tracé_4293" data-name="Tracé 4293" d="M209.34,226.834c.355.314.692.641,1.024.973s.65.673.978,1.01c.641.683,1.254,1.384,1.845,2.089l-1.176.074a50.27,50.27,0,0,1,3.574-5.585c.655-.89,1.342-1.762,2.071-2.61a27.176,27.176,0,0,1,2.352-2.435,26.087,26.087,0,0,1-1.351,3.067c-.507.987-1.056,1.946-1.637,2.887a51.185,51.185,0,0,1-3.823,5.414l-.7.858-.461-.784c-.489-.8-.964-1.6-1.411-2.43-.221-.415-.461-.826-.659-1.245S209.529,227.272,209.34,226.834Z" transform="translate(-181.296 -151.574)" fill="#e34168"/>
    <path id="Tracé_4294" data-name="Tracé 4294" d="M214.174,276.154H203.95l.715-10.224h10.224Z" transform="translate(-178.391 -176.134)" fill="#ebebeb"/>
    <path id="Tracé_4295" data-name="Tracé 4295" d="M272.536,267.429H239.41l.106-1.5h33.126Z" transform="translate(-197.498 -176.134)" fill="#263238"/>
    <path id="Tracé_4296" data-name="Tracé 4296" d="M297.249,273.739H238.97l.106-1.5h58.279Z" transform="translate(-197.261 -179.534)" fill="#ebebeb"/>
    <path id="Tracé_4297" data-name="Tracé 4297" d="M296.809,280.044H238.53l.106-1.494h58.279Z" transform="translate(-197.024 -182.934)" fill="#ebebeb"/>
    <path id="Tracé_4298" data-name="Tracé 4298" d="M296.369,286.349H238.09l.106-1.5h58.275Z" transform="translate(-196.787 -186.328)" fill="#ebebeb"/>
    <path id="Tracé_4299" data-name="Tracé 4299" d="M206.44,268.294c.355.314.692.641,1.024.973s.65.673.978,1.01c.641.678,1.254,1.384,1.845,2.089l-1.176.074a50.95,50.95,0,0,1,3.583-5.585c.655-.89,1.342-1.766,2.071-2.61a27.179,27.179,0,0,1,2.352-2.435,25.673,25.673,0,0,1-1.351,3.062c-.507.987-1.056,1.951-1.637,2.892a50.015,50.015,0,0,1-3.837,5.414l-.7.858-.461-.779c-.489-.8-.964-1.6-1.411-2.43-.217-.415-.461-.826-.66-1.25S206.629,268.732,206.44,268.294Z" transform="translate(-179.733 -173.914)" fill="#e34168"/>
    <path id="Tracé_4300" data-name="Tracé 4300" d="M211.274,317.614H201.05l.715-10.224h10.224Z" transform="translate(-176.829 -198.473)" fill="#ebebeb"/>
    <path id="Tracé_4301" data-name="Tracé 4301" d="M269.636,308.889H236.51l.106-1.5h33.126Z" transform="translate(-195.935 -198.473)" fill="#263238"/>
    <path id="Tracé_4302" data-name="Tracé 4302" d="M294.349,315.189H236.07l.106-1.5h58.279Z" transform="translate(-195.698 -201.868)" fill="#ebebeb"/>
    <path id="Tracé_4303" data-name="Tracé 4303" d="M293.909,321.5H235.63l.106-1.5h58.279Z" transform="translate(-195.461 -205.268)" fill="#ebebeb"/>
    <path id="Tracé_4304" data-name="Tracé 4304" d="M293.469,327.809H235.19l.106-1.5h58.279Z" transform="translate(-195.224 -208.668)" fill="#ebebeb"/>
    <path id="Tracé_4305" data-name="Tracé 4305" d="M208.374,359.07H198.15l.715-10.22h10.224Z" transform="translate(-175.266 -220.813)" fill="#ebebeb"/>
    <path id="Tracé_4306" data-name="Tracé 4306" d="M266.742,350.344H233.62l.1-1.494h33.126Z" transform="translate(-194.378 -220.813)" fill="#263238"/>
    <path id="Tracé_4307" data-name="Tracé 4307" d="M291.454,356.649H233.18l.1-1.5h58.279Z" transform="translate(-194.141 -224.207)" fill="#ebebeb"/>
    <path id="Tracé_4308" data-name="Tracé 4308" d="M291.009,362.959H232.73l.106-1.5h58.279Z" transform="translate(-193.899 -227.607)" fill="#ebebeb"/>
    <path id="Tracé_4309" data-name="Tracé 4309" d="M290.569,369.259H232.29l.106-1.5h58.279Z" transform="translate(-193.662 -231.002)" fill="#ebebeb"/>
    <path id="Tracé_4310" data-name="Tracé 4310" d="M251.956,145.44a2.569,2.569,0,0,1,1.628.567.19.19,0,1,1-.24.3,2.223,2.223,0,0,0-1.416-.5,2.49,2.49,0,0,0-2.481,2.274,2.1,2.1,0,0,0,2.168,2.246,2.352,2.352,0,0,0,1.467-.5.171.171,0,0,1,.254.042.175.175,0,0,1-.037.258,2.892,2.892,0,0,1-1.711.563,2.435,2.435,0,0,1-2.5-2.606,2.9,2.9,0,0,1,2.873-2.633Z" transform="translate(-202.707 -111.211)" fill="#263238"/>
    <path id="Tracé_4311" data-name="Tracé 4311" d="M264.732,148.357h-2.656l-.157,2.232a.2.2,0,0,1-.2.175.161.161,0,0,1-.161-.175l.337-4.815a.189.189,0,0,1,.189-.175.161.161,0,0,1,.171.175L262.1,148h2.661l.152-2.227a.2.2,0,0,1,.189-.175.166.166,0,0,1,.175.175l-.337,4.815a.2.2,0,0,1-.2.175.166.166,0,0,1-.166-.175Z" transform="translate(-209.432 -111.297)" fill="#263238"/>
    <path id="Tracé_4312" data-name="Tracé 4312" d="M273.226,145.795a.194.194,0,0,1,.189-.175h2.656a.157.157,0,0,1,.166.175.194.194,0,0,1-.189.184h-2.472l-.143,2.043H275.6a.166.166,0,0,1,.161.184.194.194,0,0,1-.189.18H273.4l-.143,2.038h2.477a.161.161,0,0,1,.161.184.189.189,0,0,1-.189.175h-2.67a.166.166,0,0,1-.152-.175Z" transform="translate(-215.532 -111.308)" fill="#263238"/>
    <path id="Tracé_4313" data-name="Tracé 4313" d="M285.115,145.44a2.587,2.587,0,0,1,1.628.567.18.18,0,0,1,0,.258.175.175,0,0,1-.254.037,2.2,2.2,0,0,0-1.411-.5,2.5,2.5,0,0,0-2.486,2.274,2.112,2.112,0,0,0,2.172,2.246,2.352,2.352,0,0,0,1.467-.5.171.171,0,0,1,.254.042.175.175,0,0,1-.042.258,2.869,2.869,0,0,1-1.706.563,2.435,2.435,0,0,1-2.5-2.606A2.892,2.892,0,0,1,285.115,145.44Z" transform="translate(-220.569 -111.211)" fill="#263238"/>
    <path id="Tracé_4314" data-name="Tracé 4314" d="M295.051,145.784a.194.194,0,0,1,.189-.184.171.171,0,0,1,.175.184l-.212,2.988,3.344-3.122a.185.185,0,0,1,.249,0,.18.18,0,0,1,0,.258l-2.117,1.978,1.845,2.569a.2.2,0,0,1-.051.258.184.184,0,0,1-.12.037.143.143,0,0,1-.129-.065l-1.845-2.541-1.218,1.139-.088,1.291a.2.2,0,0,1-.2.175.166.166,0,0,1-.166-.175Z" transform="translate(-227.295 -111.297)" fill="#263238"/>
    <path id="Tracé_4315" data-name="Tracé 4315" d="M306.356,150.765h0a.166.166,0,0,1-.166-.175l.337-4.815a.2.2,0,0,1,.194-.175.166.166,0,0,1,.171.175l-.323,4.612h2.472a.166.166,0,0,1,.171.184.2.2,0,0,1-.2.175Z" transform="translate(-233.48 -111.297)" fill="#263238"/>
    <path id="Tracé_4316" data-name="Tracé 4316" d="M315.7,145.795a.2.2,0,0,1,.189-.175.166.166,0,0,1,.175.175l-.337,4.815a.2.2,0,0,1-.2.175.166.166,0,0,1-.166-.175Z" transform="translate(-238.421 -111.308)" fill="#263238"/>
    <path id="Tracé_4317" data-name="Tracé 4317" d="M319.7,149.7a.157.157,0,0,1,.231,0,2.652,2.652,0,0,0,1.651.664,2.048,2.048,0,0,0,1.162-.341,1.038,1.038,0,0,0,.493-.766.756.756,0,0,0-.369-.71,3.131,3.131,0,0,0-1.167-.42h0a3.067,3.067,0,0,1-1.19-.438.992.992,0,0,1-.461-.922,1.31,1.31,0,0,1,.6-.968,2.251,2.251,0,0,1,1.273-.374,2.679,2.679,0,0,1,1.554.595.161.161,0,0,1,.028.231.166.166,0,0,1-.226.046,2.375,2.375,0,0,0-1.384-.549,1.946,1.946,0,0,0-1.075.309.983.983,0,0,0-.461.71.687.687,0,0,0,.341.627,2.8,2.8,0,0,0,1.079.392h0a3.352,3.352,0,0,1,1.282.461,1.07,1.07,0,0,1,.5.978,1.421,1.421,0,0,1-.655,1.033,2.416,2.416,0,0,1-1.356.406,3.016,3.016,0,0,1-1.845-.747A.175.175,0,0,1,319.7,149.7Z" transform="translate(-240.743 -111.206)" fill="#263238"/>
    <path id="Tracé_4318" data-name="Tracé 4318" d="M332.149,145.96h-1.554a.166.166,0,0,1-.166-.184.189.189,0,0,1,.189-.175h3.468a.161.161,0,0,1,.166.175.194.194,0,0,1-.189.184H332.5l-.323,4.612a.194.194,0,0,1-.189.175.166.166,0,0,1-.166-.175Z" transform="translate(-246.54 -111.297)" fill="#263238"/>
    <path id="Tracé_4319" data-name="Tracé 4319" d="M291.541,104.744h-50.3l1.07-15.334h50.3Z" transform="translate(-198.484 -81.021)" fill="#c7c7c7"/>
    <path id="Tracé_4320" data-name="Tracé 4320" d="M293.941,71.22H262.71L260.75,79.6H295.2Zm-15.8,6.032a1.693,1.693,0,0,1-1.711-1.845,2.006,2.006,0,0,1,1.969-1.845,1.693,1.693,0,0,1,1.711,1.845A2,2,0,0,1,278.136,77.252Z" transform="translate(-208.997 -71.22)" fill="#c7c7c7"/>
    <path id="Tracé_4321" data-name="Tracé 4321" d="M295.2,87.207H260.75l.443-1.877h33.721Z" transform="translate(-208.997 -78.823)" fill="#a6a6a6"/>
  </g>
  <g id="freepik--Plant--inject-3" transform="translate(127.948 114.751)">
    <path id="Tracé_4423" data-name="Tracé 4423" d="M416.92,354.235c3.311-6.807,9.1-10.3,15.629-8.37s7.54,11.036,2.666,13.333-9.745-4.414-12.318-5.792S416.92,354.235,416.92,354.235Z" transform="translate(-391.715 -317.692)" fill="#e34168"/>
    <path id="Tracé_4424" data-name="Tracé 4424" d="M409.954,374.285c0-.821.051-1.642.078-2.463.06-1.637.115-3.274.175-4.912a22.9,22.9,0,0,1,1.674-8.7,13.452,13.452,0,0,1,5.253-6.051,11.213,11.213,0,0,1,2.767-1.19,6.457,6.457,0,0,1,3.228-1.771,13.25,13.25,0,0,1,4.612-.115c.055,0,.055.1,0,.088a11.128,11.128,0,0,0-4.344.309,9.225,9.225,0,0,0-1.752.683,8.7,8.7,0,0,0-1.01.641,9.388,9.388,0,0,1,3.989.037,9.173,9.173,0,0,1,1.384.461,4.344,4.344,0,0,1,1.088-.092,6.633,6.633,0,0,1,1.411.2,10.883,10.883,0,0,1,2.689,1.171c.046.028,0,.1-.046.074a10.078,10.078,0,0,0-2.624-.987,8.765,8.765,0,0,0-1.347-.2,6.72,6.72,0,0,0-.747,0,8.642,8.642,0,0,1,4.22,4.206c.023.051-.055.092-.074.042a7.928,7.928,0,0,0-5.382-4.312c-.143-.037-.291-.055-.434-.088.051.212.042.461.069.66.041.332.1.659.166.987a15.653,15.653,0,0,0,.53,1.992,16.327,16.327,0,0,0,.789,1.932,9.369,9.369,0,0,0,1.107,1.845c.037.046-.037.1-.069.051-.392-.613-.849-1.181-1.208-1.845a13.624,13.624,0,0,1-.885-1.9,13.063,13.063,0,0,1-.581-2.043c-.074-.364-.129-.733-.171-1.107a2.357,2.357,0,0,1-.041-.673,8.874,8.874,0,0,0-2.306-.046,12.671,12.671,0,0,0,1.513,4.723c.028.046-.051.092-.078.042a18.841,18.841,0,0,1-1.121-2.306,8.9,8.9,0,0,1-.623-2.366,10.732,10.732,0,0,0-3.832,1.282,12.678,12.678,0,0,0-5.105,5.585,21.081,21.081,0,0,0-1.891,8c-.217,3.477-.263,6.973-.609,10.441-.023.226-.383.3-.424.046a12.228,12.228,0,0,1-.037-2.343Z" transform="translate(-387.94 -319.631)" fill="#263238"/>
    <path id="Tracé_4425" data-name="Tracé 4425" d="M426.538,352.173a3.854,3.854,0,0,1,.752-.7c.272-.221.549-.438.839-.636a6.3,6.3,0,0,1,1.882-.872.043.043,0,1,1,.023.083,4.966,4.966,0,0,0-1.845.922c-.277.2-.54.42-.8.646a5.037,5.037,0,0,1-.761.646.065.065,0,1,1-.092-.092Z" transform="translate(-396.887 -320.186)" fill="#263238"/>
    <path id="Tracé_4426" data-name="Tracé 4426" d="M449.382,360.08a20.073,20.073,0,0,1,1.517,2.006,12.3,12.3,0,0,1,1.13,2.241c0,.023-.028.037-.041,0a26.747,26.747,0,0,0-2.67-4.2C449.28,360.094,449.345,360.034,449.382,360.08Z" transform="translate(-409.165 -325.626)" fill="#263238"/>
    <path id="Tracé_4427" data-name="Tracé 4427" d="M433.9,358.6a4.81,4.81,0,0,0,.374,1.231,8.224,8.224,0,0,0,.627,1.088c0,.023,0,.046-.037.028a4.456,4.456,0,0,1-1.051-2.329C433.819,358.564,433.9,358.546,433.9,358.6Z" transform="translate(-400.816 -324.82)" fill="#263238"/>
    <path id="Tracé_4428" data-name="Tracé 4428" d="M384.741,360.033s-4.686-5.889-13.729-3.8c-8.6,1.988-12.567,17.751-3.879,19.637s7.158-12.7,10.321-15.177A7.484,7.484,0,0,1,384.741,360.033Z" transform="translate(-362.266 -323.319)" fill="#e34168"/>
    <path id="Tracé_4429" data-name="Tracé 4429" d="M384.741,360.033s-4.686-5.889-13.729-3.8c-8.6,1.988-12.567,17.751-3.879,19.637s7.158-12.7,10.321-15.177A7.484,7.484,0,0,1,384.741,360.033Z" transform="translate(-362.266 -323.319)" opacity="0.1"/>
    <path id="Tracé_4430" data-name="Tracé 4430" d="M366.042,366.273a17.935,17.935,0,0,1,1.845-1.425,8.016,8.016,0,0,1,1.988-.992,11.483,11.483,0,0,1,3.911-3.689,2.607,2.607,0,0,0-.267,0,13.616,13.616,0,0,0-1.439,0,7.89,7.89,0,0,0-2.79.7c-.051,0-.088-.06-.037-.078a12.531,12.531,0,0,1,2.767-.844,8.062,8.062,0,0,1,1.411-.12,4.192,4.192,0,0,1,.761.046h.148a12.345,12.345,0,0,1,2.606-.959l-.249-.065a11.144,11.144,0,0,0-1.342-.221,10.431,10.431,0,0,0-2.707.041.046.046,0,0,1,0-.088,17.463,17.463,0,0,1,2.735-.111,11.947,11.947,0,0,1,2.274.3,13.1,13.1,0,0,1,1.651-.189,10.186,10.186,0,0,1,8.532,3.639c1.942,2.592,2.306,6.06,2.666,9.187a69.645,69.645,0,0,1,.346,13.148c0,.258-.383.212-.392-.032-.115-3.717-.249-7.434-.6-11.142-.166-1.716-.346-3.436-.632-5.138A15.186,15.186,0,0,0,387.975,364a7.8,7.8,0,0,0-3.053-3.284,10.3,10.3,0,0,0-4.326-1.328,11.662,11.662,0,0,0-4.058.378,2.767,2.767,0,0,1,.023.8,4.46,4.46,0,0,1-.2.987,5.286,5.286,0,0,1-.378.876c-.171.314-.378.59-.567.885-.028.051-.106,0-.069-.046a4.091,4.091,0,0,0,.724-1.8,7.737,7.737,0,0,0,.111-.922v-.7a11.949,11.949,0,0,0-3.948,2.085c-.221.18-.434.364-.641.558a4.227,4.227,0,0,1,.766.922,9.47,9.47,0,0,1,.807,1.43,12.174,12.174,0,0,1,.835,3.15.042.042,0,1,1-.083,0,9.114,9.114,0,0,0-1.028-2.979,12.549,12.549,0,0,0-.8-1.328c-.152-.217-.314-.434-.461-.641-.088-.111-.189-.226-.272-.346a12.617,12.617,0,0,0-2.569,3.662h0a6.238,6.238,0,0,1,1.056,1.522,14.067,14.067,0,0,1,.849,1.812,29.934,29.934,0,0,1,1.079,3.689c0,.051-.074.069-.083,0a15.491,15.491,0,0,0-1.282-3.634q-.406-.853-.858-1.674a15.778,15.778,0,0,1-.849-1.582,11.528,11.528,0,0,0-1.033,4.192c0,.055-.092.046-.088,0a14.6,14.6,0,0,1,2.029-6.429c-.549.235-1.107.461-1.637.747a9.222,9.222,0,0,0-1.882,1.324C366.055,366.379,366.019,366.31,366.042,366.273Z" transform="translate(-364.297 -324.758)" fill="#263238"/>
    <path id="Tracé_4431" data-name="Tracé 4431" d="M380.333,376.1c.272.89.613,1.757.858,2.661a10.215,10.215,0,0,1,.4,2.661c0,.023-.041.023-.041,0a26.227,26.227,0,0,0-1.3-5.3.042.042,0,1,1,.078-.023Z" transform="translate(-371.957 -334.245)" fill="#263238"/>
    <path id="Tracé_4432" data-name="Tracé 4432" d="M367.992,369.757a5.015,5.015,0,0,1,1.2-.853,8.511,8.511,0,0,1,1.384-.493c.055,0,.074.074,0,.088a5.381,5.381,0,0,0-1.337.549,9.839,9.839,0,0,0-1.227.756.028.028,0,0,1-.018-.046Z" transform="translate(-365.347 -330.123)" fill="#263238"/>
    <path id="Tracé_4433" data-name="Tracé 4433" d="M382.062,330.81s-.867-10.579-8.735-14.011c-6.567-2.864-10.33,4.515-5.686,9.035C371.4,329.491,377.422,327.84,382.062,330.81Z" transform="translate(-364.051 -301.969)" fill="#e34168"/>
    <path id="Tracé_4434" data-name="Tracé 4434" d="M382.062,330.81s-.867-10.579-8.735-14.011c-6.567-2.864-10.33,4.515-5.686,9.035C371.4,329.491,377.422,327.84,382.062,330.81Z" transform="translate(-364.051 -301.969)" opacity="0.1"/>
    <path id="Tracé_4435" data-name="Tracé 4435" d="M373.135,321.052a33.617,33.617,0,0,1,3.5,1.656,26.17,26.17,0,0,1,2.716,1.8c-.129-.268-.244-.544-.374-.807-.208-.41-.424-.807-.669-1.194a11.255,11.255,0,0,0-1.734-2.2c-.041-.037,0-.1.065-.06a17.345,17.345,0,0,1,1.822,2.121,12.057,12.057,0,0,1,.747,1.2,4.76,4.76,0,0,1,.53,1.218l.088.065a26.219,26.219,0,0,1,3.759,3.689c-.023-.1-.046-.208-.074-.3-.148-.517-.3-1.024-.461-1.536a13.28,13.28,0,0,0-1.42-3.085c-.032-.046.046-.092.074-.042a24.66,24.66,0,0,1,1.646,3.007,11.673,11.673,0,0,1,.544,1.568,6.5,6.5,0,0,1,.254,1.061c.346.434.683.872,1,1.324a32.456,32.456,0,0,1,5.479,16.441,50.459,50.459,0,0,1,.088,5.216,32.559,32.559,0,0,1-.461,5.23c-.023.111-.194.078-.189-.028.037-1.531.2-3.053.226-4.584s-.023-3.067-.148-4.612a43,43,0,0,0-1.716-9,32.159,32.159,0,0,0-4.017-8.463c-.327-.065-.66-.157-.982-.24l-1.162-.314a11.991,11.991,0,0,1-2.191-.807c-.051-.023,0-.1.046-.074a7.154,7.154,0,0,0,2.223.77c.613.12,1.254.2,1.872.341a29.471,29.471,0,0,0-1.845-2.4,13.646,13.646,0,0,1-4.473-.332,18.829,18.829,0,0,1-2.306-.715c-.789-.3-1.536-.7-2.306-1.019-.06-.023,0-.111.032-.078a13.108,13.108,0,0,0,4.538,1.485,27.87,27.87,0,0,0,4.247.35c-.563-.641-1.139-1.264-1.753-1.845a20.73,20.73,0,0,0-7.245-4.718C373.038,321.112,373.085,321.052,373.135,321.052Z" transform="translate(-368.088 -304.169)" fill="#263238"/>
    <path id="Tracé_4436" data-name="Tracé 4436" d="M387.012,322.05a12.28,12.28,0,0,1,.964,1.411,7.561,7.561,0,0,1,.692,1.642s-.023.028-.028,0c-.263-.521-.484-1.061-.752-1.577a7.735,7.735,0,0,0-.922-1.43C386.916,322.068,386.971,322.022,387.012,322.05Z" transform="translate(-375.564 -305.139)" fill="#263238"/>
    <path id="Tracé_4437" data-name="Tracé 4437" d="M371.149,329.693a8.079,8.079,0,0,0,1.609.673,14.433,14.433,0,0,0,1.646.461v.046a7.958,7.958,0,0,1-1.7-.374,13.652,13.652,0,0,1-1.591-.715C371.043,329.744,371.1,329.666,371.149,329.693Z" transform="translate(-367.015 -309.259)" fill="#263238"/>
    <path id="Tracé_4438" data-name="Tracé 4438" d="M414.279,312.328a19.1,19.1,0,0,1,7.84-7.66c6.041-3.463,13.25-12.48,7.328-18.175C424.665,281.895,412.07,291.916,414.279,312.328Z" transform="translate(-390.153 -285.391)" fill="#e34168"/>
    <path id="Tracé_4439" data-name="Tracé 4439" d="M404.6,341.048a117.079,117.079,0,0,1,1.056-13.374,60.128,60.128,0,0,1,2.795-11.972c.493-1.384,1.061-2.767,1.674-4.151a9.5,9.5,0,0,1,.028-1.582c.032-.678.092-1.356.157-2.029s.129-1.351.212-2.025.221-1.347.249-2.02c0-.06.1-.046.083,0a14.529,14.529,0,0,0-.235,2.145c-.051.65-.088,1.305-.111,1.96s0,1.31,0,1.965c0,.235,0,.484.023.738.627-1.324,1.3-2.624,2.025-3.892-.461-2.767.134-5.64.7-8.338,0-.051.092-.028.083.028a23.3,23.3,0,0,0-.438,4.275c-.028,1.13.028,2.264.032,3.394.157-.272.318-.544.461-.812q1.3-2.108,2.767-4.128a6.527,6.527,0,0,1,.065-1.965,15.564,15.564,0,0,1,.484-2.149c.212-.706.461-1.384.738-2.075s.669-1.36.95-2.061a.042.042,0,1,1,.074.032,10.486,10.486,0,0,0-.83,2.089,18.718,18.718,0,0,0-.544,2.071c-.143.7-.258,1.384-.355,2.108-.065.461-.106.955-.184,1.425a51.188,51.188,0,0,1,4.653-5.419c.041-.042.1.023.06.06a61.4,61.4,0,0,0-6.761,9.2c-.074.125-.143.249-.212.374.364-.231.784-.415,1.13-.6q.968-.54,1.942-1.065l1.882-1.033c.323-.18.641-.364.969-.53a7.924,7.924,0,0,0,1.13-.627c.051-.037.1.042.051.069-.641.35-1.208.876-1.845,1.268s-1.227.812-1.877,1.181c-1.181.659-2.467,1.134-3.629,1.817q-1.208,2.121-2.237,4.34,1.056-.678,2.158-1.291c.461-.263.922-.526,1.425-.775a7.038,7.038,0,0,0,1.337-.812.046.046,0,0,1,.06.065,12.413,12.413,0,0,1-2.555,1.776c-.853.5-1.72.982-2.606,1.42-.715,1.554-1.356,3.145-1.928,4.759-2.8,7.928-3.828,16.344-4.321,24.7-.143,2.5-.221,4.981-.249,7.48s.1,4.981.092,7.471a.065.065,0,0,1-.129,0c-.3-2.209-.355-4.455-.461-6.683S404.549,343.313,404.6,341.048Z" transform="translate(-385.054 -289.461)" fill="#263238"/>
    <path id="Tracé_4440" data-name="Tracé 4440" d="M430.823,314.775a32.058,32.058,0,0,0,3.537-1.845,38.53,38.53,0,0,0,3.357-2.131s.037,0,.023.032a28.809,28.809,0,0,1-3.228,2.251,32.378,32.378,0,0,1-3.653,1.752A.036.036,0,1,1,430.823,314.775Z" transform="translate(-399.193 -299.082)" fill="#263238"/>
    <path id="Tracé_4441" data-name="Tracé 4441" d="M426.126,297.629c.1-.387.221-.766.355-1.144a.032.032,0,0,1,0-.046c.083-.212.171-.424.258-.636l.032-.078.051-.125c-.023.074-.041.148-.065.221a1.154,1.154,0,0,1-.032.12,30.834,30.834,0,0,0-.987,4.52c0,.046-.083.046-.078,0A15.163,15.163,0,0,1,426.126,297.629Z" transform="translate(-396.424 -290.892)" fill="#263238"/>
    <path id="Tracé_4442" data-name="Tracé 4442" d="M389.41,400.73l.475,5.626,1.453,17.161H406.9l1.453-17.161.475-5.626Z" transform="translate(-376.892 -347.538)" fill="#455a64"/>
    <path id="Tracé_4443" data-name="Tracé 4443" d="M389.41,400.73l.475,5.626h18.47l.475-5.626Z" transform="translate(-376.892 -347.538)" fill="#263238"/>
    <rect id="Rectangle_19234" data-name="Rectangle 19234" width="22.473" height="5.396" transform="translate(33.465 56.333) rotate(180)" fill="#455a64"/>
  </g>
</svg>
