<svg id="bar_chart-24px" xmlns="http://www.w3.org/2000/svg" width="28.653" height="28.653" viewBox="0 0 28.653 28.653">
  <path id="Tracé_2545" data-name="Tracé 2545" d="M0,0H28.653V28.653H0Z" fill="none"/>
  <g id="Groupe_12488" data-name="Groupe 12488" transform="translate(5.722 5.722)">
    <rect id="Rectangle_991" data-name="Rectangle 991" width="17" height="17" transform="translate(0.277 -0.07)" fill="none"/>
    <path id="ic_chat_bubble_24px" d="M17.488,2H3.721A1.726,1.726,0,0,0,2,3.721V19.209l3.442-3.442H17.488a1.726,1.726,0,0,0,1.721-1.721V3.721A1.726,1.726,0,0,0,17.488,2Z" transform="translate(-2 -2)" fill="#fff"/>
  </g>
</svg>
