<svg id="bar_chart-24px" xmlns="http://www.w3.org/2000/svg" width="28.653" height="28.653" viewBox="0 0 28.653 28.653">
  <path id="Tracé_2545" data-name="Tracé 2545" d="M0,0H28.653V28.653H0Z" fill="none"/>
  <path id="Soustraction_5" data-name="Soustraction 5" d="M10.745,21.49A10.745,10.745,0,1,1,21.49,10.745,10.757,10.757,0,0,1,10.745,21.49Zm-5.5-8.6a5.9,5.9,0,0,0,11,0H14.452a4.271,4.271,0,0,1-7.413,0Zm9.262-6.446a1.612,1.612,0,1,0,1.612,1.611A1.613,1.613,0,0,0,14.506,6.447Zm-7.522,0A1.612,1.612,0,1,0,8.6,8.058,1.613,1.613,0,0,0,6.984,6.447Z" transform="translate(3.582 4.179)" fill="#fff"/>
</svg>
