<svg id="add_box-24px" xmlns="http://www.w3.org/2000/svg" width="28.654" height="28.654" viewBox="0 0 28.654 28.654">
  <path id="Tracé_2791" data-name="Tracé 2791" d="M0,0H28.654V28.654H0Z" fill="none"/>
  <path id="Tracé_2792" data-name="Tracé 2792" d="M22.1,3H5.388A2.387,2.387,0,0,0,3,5.388V22.1A2.387,2.387,0,0,0,5.388,24.49H22.1A2.4,2.4,0,0,0,24.49,22.1V5.388A2.4,2.4,0,0,0,22.1,3ZM19.715,14.939H14.939v4.776H12.551V14.939H7.776V12.551h4.776V7.776h2.388v4.776h4.776Z" transform="translate(0.582 0.582)" fill="#fff"/>
</svg>
