{
  "routingKey": "actes",
  "index": "acte",
  "mappingProperties": {
    "id": {
      "type": "keyword"
    },
    "codeActe": {
      "type": "keyword"
    },
    "libelleActe": {
      "type": "keyword"
    },
    "codeMaj": {
      "type": "keyword"
    }
  },
  "instances": 1,
  "query": "query acte($id: ID!) { acte(id: $id) { id codeActe libelleActe codeMaj } }",
  "dataKey": "acte"
}
