{
  "routingKey": "produitcanals",
  "index": "produitcanal",
  "mappingProperties": {
    "id": {
      "type": "keyword"
    },
    "qteStock": {
      "type": "integer"
    },
    "qteMin": {
      "type": "integer"
    },
    "stv": {
      "type": "integer"
    },
    "unitePetitCond": {
      "type": "integer"
    },
    "uniteSupCond": {
      "type": "integer"
    },
    "prixPhv": {
      "type": "double"
    },
    "prixTtc": {
      "type": "double"
    },
    "prixFab": {
      "type": "double"
    },
    "isActive": {
      "type": "keyword"
    },
    "isShared": {
      "type": "keyword"
    },
    "groupementComments": {
      "properties": {
        "id": {
          "type": "keyword"
        },
        "nom": {
          "type": "keyword"
        }
      }
    },
    "groupementSmyleys": {
      "properties": {
        "id": {
          "type": "keyword"
        },
        "nom": {
          "type": "keyword"
        }
      }
    },
    "partage": {
      "properties": {
        "id": {
          "type": "keyword"
        },
        "groupeAmisCibles": {
          "properties": {
            "id": {
              "type": "keyword"
            }
          },
          "groupeAmis": {
            "properties": {
              "id": {
                "type": "keyword"
              }
            }
          }
        }
      }
    },
    "sousGammeCommercial": {
      "properties": {
        "id": {
          "type": "keyword"
        },
        "codeSousGamme": {
          "type": "keyword"
        },
        "libelle": {
          "type": "keyword"
        },
        "estDefaut": {
          "type": "integer"
        },
        "gammeCommercial": {
          "properties": {
            "id": {
              "type": "keyword"
            },
            "codeGamme": {
              "type": "keyword"
            },
            "libelle": {
              "type": "keyword"
            }
          }
        }
      }
    },
    "actions": {
      "properties": {
        "total": {
          "type": "long"
        },
        "data": {
          "properties": {
            "id": {
              "type": "keyword"
            },
            "description": {
              "type": "keyword"
            },
            "dateDebut": {
              "type": "keyword"
            },
            "priority": {
              "type": "keyword"
            },
            "status": {
              "type": "keyword"
            },
            "item": {
              "properties": {
                "id": {
                  "type": "keyword"
                },
                "code": {
                  "type": "keyword"
                },
                "name": {
                  "type": "keyword"
                }
              }
            }
          }
        }
      }
    },
    "commandeCanal": {
      "properties": {
        "id": {
          "type": "keyword"
        },
        "code": {
          "type": "keyword"
        },
        "libelle": {
          "type": "keyword"
        },
        "countOperationsCommercials": {
          "type": "integer"
        },
        "countCanalArticles": {
          "type": "integer"
        }
      }
    },
    "pharmacieRemisePaliers": {
      "properties": {
        "id": {
          "type": "keyword"
        }
      }
    },
    "pharmacieRemisePanachees": {
      "properties": {
        "id": {
          "type": "keyword"
        }
      }
    },
    "operations": {
      "properties": {
        "id": {
          "type": "keyword"
        }
      }
    },
    "sousGammeCatalogue": {
      "properties": {
        "id": {
          "type": "keyword"
        },
        "codeSousGamme": {
          "type": "keyword"
        },
        "libelle": {
          "type": "keyword"
        }
      }
    },
    "produit": {
      "properties": {
        "id": {
          "type": "keyword"
        },
        "qteStockPharmacie": {
          "type": "integer"
        },
        "pharmacieReferences": {
          "type": "keyword"
        },
        "libelle": {
          "type": "keyword"
        },
        "libelle2": {
          "type": "keyword"
        },
        "supprimer": {
          "type": "keyword"
        },
        "produitCode": {
          "properties": {
            "id": {
              "type": "keyword"
            },
            "code": {
              "type": "keyword"
            },
            "typeCode": {
              "type": "keyword"
            },
            "referent": {
              "type": "keyword"
            }
          }
        },
        "famille": {
          "properties": {
            "id": {
              "type": "keyword"
            },
            "codeFamille": {
              "type": "keyword"
            },
            "libelleFamille": {
              "type": "keyword"
            }
          }
        },
        "produitTechReg": {
          "properties": {
            "id": {
              "type": "keyword"
            },
            "laboTitulaire": {
              "properties": {
                "id": {
                  "type": "keyword"
                },
                "nomLabo": {
                  "type": "keyword"
                },
                "sortie": {
                  "type": "integer"
                }
              }
            },
            "laboExploitant": {
              "properties": {
                "id": {
                  "type": "keyword"
                },
                "nomLabo": {
                  "type": "keyword"
                },
                "sortie": {
                  "type": "integer"
                }
              }
            },
            "tva": {
              "properties": {
                "id": {
                  "type": "keyword"
                },
                "tauxTva": {
                  "type": "keyword"
                }
              }
            }
          }
        }
      }
    }
  },
  "instances": 1,
  "query": "query produitCanal($id: ID!) { produitCanal(id: $id) { id groupementSmyleys { id nom } groupementComments { id nom } qteStock qteMin isRemoved  stv unitePetitCond uniteSupCond prixPhv prixTtc prixFab isActive isShared partage { id groupeAmisCibles { id  groupeAmis { id } } } operations { id } sousGammeCommercial { id codeSousGamme libelle estDefaut gammeCommercial { id codeGamme libelle } } actions {total data { id description dateDebut priority status item { id code name } } } commandeCanal { id code libelle countOperationsCommercials countCanalArticles } pharmacieRemisePaliers { id } pharmacieRemisePanachees { id } sousGammeCatalogue { id codeSousGamme libelle } produit { id qteStockPharmacie pharmacieReferences libelle libelle2 supprimer surveillanceRenforcee dateCreation dateModification produitCode { id code typeCode referent } famille { id codeFamille libelleFamille } produitTechReg { id isTipsLpp isHomeo tva { id tauxTva } laboTitulaire { id  nomLabo sortie } laboExploitant { id  nomLabo sortie } } } } }",
  "dataKey": "produitCanal"
}
