[
  {
    "routingKey": "users",
    "index": "user",
    "mappingProperties": {
      "email": {
        "type": "keyword"
      },
      "idGroupement": {
        "type": "keyword"
      }
    },
    "instances": 1,
    "query": "query user($id: ID!) { user(id: $id) { email,emailConfirmed,phoneNumber,phoneNumberConfirmed,idGroupement }}",
    "dataKey": "user"
  },
  {
    "routingKey": "pharmacies",
    "index": "pharmacie",
    "mappingProperties": {
      "codeEnseigne": {
        "type": "keyword"
      },
      "qualifBi": {
        "type": "text"
      },
      "sortie": {
        "type": "long"
      },
      "numIvrylab": {
        "type": "text"
      },
      "cleIvrylab": {
        "type": "long"
      },
      "cip": {
        "type": "text"
      },
      "numFiness": {
        "type": "text"
      },
      "nom": {
        "type": "keyword"
      },
      "adresse1": {
        "type": "keyword"
      },
      "adresse2": {
        "type": "keyword"
      },
      "cp": {
        "type": "text"
      },
      "ville": {
        "type": "keyword"
      },
      "tele1": {
        "type": "text"
      },
      "tele2": {
        "type": "text"
      },
      "fax": {
        "type": "text"
      },
      "mail1": {
        "type": "keyword"
      },
      "mail2": {
        "type": "text"
      },
      "mail3": {
        "type": "text"
      },
      "web": {
        "type": "text"
      },
      "nbEmploye": {
        "type": "long"
      },
      "nbAssistant": {
        "type": "long"
      },
      "autreTravailleur": {
        "type": "long"
      },
      "adhesion": {
        "type": "date"
      },
      "gros1": {
        "type": "text"
      },
      "gros2": {
        "type": "text"
      },
      "dateSortie": {
        "type": "date"
      },
      "commentaire": {
        "type": "text"
      },
      "amba1": {
        "type": "text"
      },
      "amba2": {
        "type": "text"
      },
      "respPf1": {
        "type": "text"
      },
      "respPf2": {
        "type": "text"
      },
      "infoMail": {
        "type": "text"
      },
      "junior": {
        "type": "text"
      },
      "generique1": {
        "type": "text"
      },
      "generique2": {
        "type": "text"
      },
      "nbJourOuvre": {
        "type": "long"
      },
      "latitude": {
        "type": "text"
      },
      "longitude": {
        "type": "text"
      },
      "horaires1": {
        "type": "text"
      },
      "horaires2": {
        "type": "text"
      },
      "horaires3": {
        "type": "text"
      },
      "horaires4": {
        "type": "text"
      },
      "codeTeletrans": {
        "type": "long"
      },
      "qualifEnvoi": {
        "type": "text"
      },
      "idGroupement": {
        "type": "keyword"
      },
      "user": {
        "properties": {
          "id": {
            "type": "keyword"
          },
          "userName": {
            "type": "keyword"
          },
          "email": {
            "type": "keyword"
          },
          "status": {
            "type": "text"
          }
        }
      }
    },
    "instances": 1,
    "query": "query pharmacie($id: ID!) { pharmacie(id: $id) { codeEnseigne, qualifBi, sortie, numIvrylab, cleIvrylab, cip, numFiness, nom, adresse1, adresse2, cp, ville, tele1, tele2, fax, mail1, mail2, mail3, web, nbEmploye, nbAssistant, autreTravailleur, adhesion, gros1, gros2, dateSortie, commentaire, amba1, amba2, respPf1, respPf2, infoMail, junior, generique1, generique2, nbJourOuvre, latitude, longitude, horaires1, horaires2, horaires3, horaires4, codeTeletrans, qualifEnvoi,idGroupement, users { id userName email  status } }}",
    "dataKey": "pharmacie"
  },
  {
    "routingKey": "titulaires",
    "index": "titulaire",
    "mappingProperties": {
      "civilite": {
        "type": "keyword"
      },
      "nom": {
        "type": "keyword"
      },
      "prenom": {
        "type": "keyword"
      },
      "adresse1": {
        "type": "keyword"
      },
      "adresse2": {
        "type": "text"
      },
      "mail": {
        "type": "keyword"
      },
      "fax": {
        "type": "text"
      },
      "tele1": {
        "type": "keyword"
      },
      "tele2": {
        "type": "keyword"
      },
      "cp": {
        "type": "keyword"
      },
      "ville": {
        "type": "keyword"
      },
      "commentaire": {
        "type": "text"
      },
      "dateNaissance": {
        "type": "date"
      },
      "estPresidentRegion": {
        "type": "keyword"
      },
      "idGroupement": {
        "type": "keyword"
      },
      "user": {
        "properties": {
          "id": {
            "type": "keyword"
          },
          "email": {
            "type": "keyword"
          },
          "status": {
            "type": "text"
          }
        }
      },
      "pharmacieUser": {
        "properties": {
          "id": {
            "type": "keyword"
          },
          "cip": {
            "type": "keyword"
          }
        }
      }
    },
    "instances": 1,
    "query": "query titulaire($id: ID!) { titulaire(id: $id) { nom, prenom, adresse1, adresse2, mail, fax, tele1,tele2, cp ville, commentaire, dateNaissance,estPresidentRegion,idGroupement, user { id, email, status } pharmacieUser { id cip} }}",
    "dataKey": "titulaire"
  },
  {
    "routingKey": "groupements",
    "index": "groupement",
    "mappingProperties": {
      "nom": {
        "type": "keyword"
      },
      "addresse1": {
        "type": "keyword"
      },
      "addresse2": {
        "type": "text"
      },
      "cp": {
        "type": "keyword"
      },
      "ville": {
        "type": "keyword"
      },
      "pays": {
        "type": "keyword"
      },
      "telBureau": {
        "type": "keyword"
      },
      "telMobile": {
        "type": "keyword"
      },
      "mail": {
        "type": "keyword"
      },
      "site": {
        "type": "text"
      },
      "commentaire": {
        "type": "text"
      },
      "nomResponsable": {
        "type": "keyword"
      },
      "prenomResponsable": {
        "type": "keyword"
      },
      "dateSortie": {
        "type": "date"
      },
      "sortie": {
        "type": "long"
      },
      "dateCreation": {
        "type": "date"
      },
      "dateModification": {
        "type": "date"
      }
    },
    "instances": 1,
    "query": "query groupement($id: ID!) { groupement(id: $id) { nom adresse1 adresse2 cp ville pays telBureau telMobile mail site commentaire nomResponsable prenomResponsable dateSortie sortie dateCreation dateModification }}",
    "dataKey": "groupement"
  },
  {
    "routingKey": "laboratoires",
    "index": "laboratoire",
    "mappingProperties": {
      "code": {
        "type": "keyword"
      },
      "nom": {
        "type": "keyword"
      },
      "codeGroupLabo": {
        "type": "keyword"
      },
      "user": {
        "properties": {
          "id": {
            "type": "keyword"
          },
          "email": {
            "type": "keyword"
          },
          "status": {
            "type": "text"
          }
        }
      }
    },
    "instances": 1,
    "query": "query laboratoire($id: ID!) { laboratoire(id: $id) { id, code, nom, codeGroupLabo, user { id, email, status } } }",
    "dataKey": "laboratoire"
  },
  {
    "routingKey": "personnels",
    "index": "personnel",
    "mappingProperties": {
      "sortie": {
        "type": "long"
      },
      "civilite": {
        "type": "keyword"
      },
      "nom": {
        "type": "keyword"
      },
      "prenom": {
        "type": "keyword"
      },
      "login": {
        "type": "keyword"
      },
      "password": {
        "type": "keyword"
      },
      "adresse1": {
        "type": "keyword"
      },
      "adresse2": {
        "type": "text"
      },
      "telBureau": {
        "type": "text"
      },
      "telDomicile": {
        "type": "text"
      },
      "telMobProf": {
        "type": "text"
      },
      "telMobPerso": {
        "type": "text"
      },
      "faxBureau": {
        "type": "text"
      },
      "faxDomicile": {
        "type": "text"
      },
      "cp": {
        "type": "keyword"
      },
      "ville": {
        "type": "keyword"
      },
      "mailProf": {
        "type": "keyword"
      },
      "mailPerso": {
        "type": "keyword"
      },
      "commentaire": {
        "type": "text"
      },
      "photo": {
        "type": "text"
      },
      "identifiant": {
        "type": "keyword"
      },
      "dateSortie": {
        "type": "date"
      },
      "idGroupement": {
        "type": "keyword"
      },
      "role": {
        "properties": {
          "code": {
            "type": "keyword"
          },
          "nom": {
            "type": "keyword"
          }
        }
      },
      "user": {
        "properties": {
          "id": {
            "type": "keyword"
          },
          "email": {
            "type": "keyword"
          },
          "status": {
            "type": "text"
          }
        }
      }
    },
    "instances": 1,
    "query": "query personnel($id: ID!) { personnel(id: $id) { id, sortie, civilite, nom, prenom, login, password, adresse1, adresse2, telBureau, telDomicile, telMobProf, telMobPerso, faxBureau, faxDomicile, cp, ville, mailProf, mailPerso, commentaire, photo, identifiant, dateSortie, idGroupement, user { id, email, status }, role { code nom } } }",
    "dataKey": "personnel"
  },
  {
    "routingKey": "ppersonnels",
    "index": "ppersonnel",
    "mappingProperties": {
      "civilite": {
        "type": "keyword"
      },
      "nom": {
        "type": "keyword"
      },
      "prenom": {
        "type": "keyword"
      },
      "telBureau": {
        "type": "text"
      },
      "telMobile": {
        "type": "text"
      },
      "mail": {
        "type": "keyword"
      },
      "estAmbassadrice": {
        "type": "keyword"
      },
      "commentaire": {
        "type": "text"
      },
      "sortie": {
        "type": "keyword"
      },
      "dateSortie": {
        "type": "date"
      },
      "idGroupement": {
        "type": "keyword"
      },
      "idPharmacie": {
        "type": "keyword"
      },
      "user": {
        "properties": {
          "id": {
            "type": "keyword"
          },
          "userName": {
            "type": "keyword"
          },
          "email": {
            "type": "keyword"
          },
          "status": {
            "type": "text"
          }
        }
      },
      "role": {
        "properties": {
          "nom": {
            "type": "text"
          },
          "code": {
            "type": "keyword"
          }
        }
      }
    },
    "instances": 1,
    "query": "query ppersonnel($id: ID!) { ppersonnel(id: $id) { id, civilite, nom, prenom, telBureau, telMobile, mail, estAmbassadrice, commentaire, sortie, dateSortie, idGroupement, idPharmacie, user { id, email, status }, role { code, nom } } }",
    "dataKey": "ppersonnel"
  },
  {
    "routingKey": "partenaires",
    "index": "partenaire",
    "mappingProperties": {
      "nom": {
        "type": "keyword"
      },
      "adresse1": {
        "type": "keyword"
      },
      "adresse2": {
        "type": "text"
      },
      "cp": {
        "type": "keyword"
      },
      "ville": {
        "type": "keyword"
      },
      "pays": {
        "type": "keyword"
      },
      "telBureau": {
        "type": "text"
      },
      "telMobile": {
        "type": "text"
      },
      "mail": {
        "type": "keyword"
      },
      "commentaire": {
        "type": "text"
      },
      "site": {
        "type": "keyword"
      },
      "idGroupement": {
        "type": "keyword"
      },
      "user": {
        "properties": {
          "id": {
            "type": "keyword"
          },
          "userName": {
            "type": "keyword"
          },
          "email": {
            "type": "keyword"
          },
          "status": {
            "type": "text"
          }
        }
      },
      "role": {
        "properties": {
          "nom": {
            "type": "text"
          },
          "code": {
            "type": "keyword"
          }
        }
      }
    },
    "instances": 1,
    "query": "query partenaire($id: ID!) { partenaire(id: $id) { id, nom, adresse1, adresse2,cp, ville, pays, telBureau, telMobile,mail,commentaire,site,idGroupement, user { id, email, status }, role { code, nom } } }",
    "dataKey": "partenaire"
  },
  {
    "routingKey": "commandes",
    "index": "commande",
    "mappingProperties": {
      "dateCommande": {
        "type": "keyword"
      },
      "nbrRef": {
        "type": "integer"
      },
      "quantite": {
        "type": "integer"
      },
      "uniteGratuite": {
        "type": "keyword"
      },
      "prixBaseTotalHT": {
        "type": "double"
      },
      "valeurRemiseTotal": {
        "type": "double"
      },
      "prixNetTotalHT": {
        "type": "double"
      },
      "fraisPort": {
        "type": "double"
      },
      "valeurFrancoPort": {
        "type": "double"
      },
      "remiseGlobale": {
        "type": "double"
      },
      "commentaireInterne": {
        "type": "text"
      },
      "commentaireExterne": {
        "type": "text"
      },
      "pathFile": {
        "type": "text"
      },
      "dateCreation": {
        "type": "keyword"
      },
      "dateModification": {
        "type": "keyword"
      }
    },
    "instances": 1,
    "query": "query commande($id: ID!) { commande(id: $id) { dateCommande nbrRef quantite uniteGratuite prixBaseTotalHT valeurRemiseTotal prixNetTotalHT fraisPort valeurFrancoPort remiseGlobale commentaireInterne commentaireExterne pathFile dateCreation dateModification }}",
    "dataKey": "commande"
  },
  {
    "routingKey": "commandelignes",
    "index": "commandeligne",
    "mappingProperties": {
      "optimiser": {
        "type": "keyword"
      },
      "quantiteCdee": {
        "type": "integer"
      },
      "quantiteLivree": {
        "type": "integer"
      },
      "uniteGratuite": {
        "type": "text"
      },
      "prixBaseHT": {
        "type": "double"
      },
      "remiseLigne": {
        "type": "double"
      },
      "remiseGamme": {
        "type": "double"
      },
      "prixNetUnitaireHT": {
        "type": "double"
      },
      "prixTotalHT": {
        "type": "double"
      },
      "dateCreation": {
        "type": "keyword"
      },
      "dateModification": {
        "type": "keyword"
      }
    },
    "instances": 1,
    "query": "query commandeLigne($id: ID!) { commandeLigne(id: $id) { optimiser quantiteCdee quantiteLivree uniteGratuite prixBaseHT remiseLigne remiseGamme prixNetUnitaireHT prixTotalHT dateCreation dateModification }}",
    "dataKey": "commandeligne"
  },
  {
    "routingKey": "produits",
    "index": "produit",
    "mappingProperties": {
      "nomCanalArticle": {
        "type": "text"
      },
      "codeReference": {
        "type": "keyword"
      },
      "qteStock": {
        "type": "integer"
      },
      "qteMin": {
        "type": "integer"
      },
      "stv": {
        "type": "integer"
      },
      "unitePetitCond": {
        "type": "integer"
      },
      "uniteSupCond": {
        "type": "integer"
      },
      "codeBlocage": {
        "type": "text"
      },
      "prixPhv": {
        "type": "double"
      },
      "prixTtc": {
        "type": "double"
      },
      "prixFab": {
        "type": "double"
      },
      "isActive": {
        "type": "keyword"
      },
      "inMyPanier": {
        "type": "boolean"
      },
      "inOtherPanier": {
        "type": "boolean"
      },
      "qteTotalRemisePanachees": {
        "type": "integer"
      },
      "articleSamePanachees": {
        "properties": {
          "nomCanalArticle": {
            "type": "keyword"
          },
          "codeReference": {
            "type": "keyword"
          },
          "prixPhv": {
            "type": "double"
          }
        }
      },
      "remise": {
        "properties": {
          "quantiteMin": {
            "type": "integer"
          },
          "quantiteMax": {
            "type": "integer"
          },
          "pourcentageRemise": {
            "type": "double"
          },
          "nombreUg": {
            "type": "integer"
          },
          "codeCip13Ug": {
            "type": "text"
          }
        }
      },
      "laboratoire": {
        "properties": {
          "id": {
            "type": "keyword"
          },
          "code": {
            "type": "keyword"
          },
          "nom": {
            "type": "keyword"
          }
        }
      },
      "tva": {
        "properties": {
          "id": {
            "type": "keyword"
          },
          "codeTva": {
            "type": "keyword"
          },
          "valTva": {
            "type": "double"
          }
        }
      },
      "famille": {
        "properties": {
          "idFamille": {
            "type": "keyword"
          },
          "codeFamille": {
            "type": "keyword"
          },
          "nomFamille": {
            "type": "keyword"
          }
        }
      },
      "gammeCommercial": {
        "properties": {
          "idGammeCommercial": {
            "type": "keyword"
          },
          "codeGamme": {
            "type": "keyword"
          },
          "libelle": {
            "type": "keyword"
          },
          "estDefaut": {
            "type": "integer"
          }
        }
      }
    },
    "instances": 1,
    "query": "query canalArticle($id: ID!, $idPharmacie: ID) { canalArticle(id: $id) { nomCanalArticle codeReference qteStock qteMin stv unitePetitCond uniteSupCond codeBlocage prixPhv prixTtc prixFab laboratoire { id code nom } tva { id codeTva valTva } famille { idFamille codeFamille nomFamille } gammeCommercial { idGammeCommercial codeGamme libelle estDefaut } isActive inMyPanier inOtherPanier(idPharmacie: $idPharmacie) qteTotalRemisePanachees remises(idPharmacie: $idPharmacie) { quantiteMin quantiteMax pourcentageRemise nombreUg codeCip13Ug } articleSamePanachees { nomCanalArticle codeReference prixPhv stv laboratoire { nom } } } }",
    "dataKey": "canalArticle"
  }
]
