{
  "routingKey": "promotions",
  "index": "promotion",
  "mappingProperties": {
    "id": {
      "type": "keyword"
    },
    "nom": {
      "type": "keyword"
    },
    "dateDebut": {
      "type": "date",
      "format": "date_optional_time||strict_date_optional_time"
    },
    "dateFin": {
      "type": "date",
      "format": "date_optional_time||strict_date_optional_time"
    },
    "promotionType": {
      "type": "keyword"
    },
    "status": {
      "type": "keyword"
    },
    "commandeCanal": {
      "properties": {
        "id": {
          "type": "keyword"
        },
        "code": {
          "type": "keyword"
        },
        "libelle": {
          "type": "keyword"
        }
      }
    },
    "userCreated": {
      "properties": {
        "id": {
          "type": "keyword"
        },
        "userName": {
          "type": "keyword"
        },
        "login": {
          "type": "keyword"
        },
        "email": {
          "type": "keyword"
        }
      }
    },
    "userModified": {
      "properties": {
        "id": {
          "type": "keyword"
        },
        "userName": {
          "type": "keyword"
        },

        "email": {
          "type": "keyword"
        },
        "login": {
          "type": "keyword"
        }
      }
    },
    "canalArticles": {
      "properties": {
        "id": {
          "type": "keyword"
        },
        "produit": {
          "properties": {
            "id": {
              "type": "keyword"
            },
            "libelle": {
              "type": "keyword"
            },
            "produitCode": {
              "properties": {
                "id": {
                  "type": "keyword"
                },
                "code": {
                  "type": "keyword"
                }
              }
            }
          }
        }
      }
    },
    "groupeClients": {
      "properties": {
        "id": {
          "type": "keyword"
        },
        "groupeClient": {
          "properties": {
            "id": {
              "type": "keyword"
            },
            "codeGroupe": {
              "type": "keyword"
            },
            "nomGroupe": {
              "type": "keyword"
            }
          }
        },
        "remise": {
          "properties": {
            "id": {
              "type": "keyword"
            },
            "remiseDetails": {
              "properties": {
                "id": {
                  "type": "keyword"
                },
                "quantiteMin": {
                  "type": "keyword"
                },
                "quantiteMax": {
                  "type": "keyword"
                },
                "pourcentageRemise": {
                  "type": "keyword"
                },
                "remiseSupplementaire": {
                  "type": "keyword"
                }
              }
            }
          }
        }
      }
    }
  },
  "instances": 1,
  "query": "query promotion($id: ID!) { promotion(id: $id) { id nom dateDebut dateFin dateCreation dateModification promotionType status isRemoved commandeCanal { id code libelle } userCreated { id userName email login } userModified { id userName email login } canalArticles { id produit { id libelle produitCode { id code } } qteStock stv prixFab prixPhv isActive isRemoved } groupeClients { id groupeClient { id codeGroupe nomGroupe } remise { id remiseDetails { id quantiteMin quantiteMax pourcentageRemise remiseSupplementaire } } } } }",
  "dataKey": "promotion"
}
