<svg id="playlist_add-24px" xmlns="http://www.w3.org/2000/svg" width="24" height="24" viewBox="0 0 24 24">
  <path id="Tracé_2971" data-name="Tracé 2971" d="M0,0H24V24H0Z" fill="none"/>
  <path id="Tracé_2972" data-name="Tracé 2972" d="M14,10H2v2H14Zm0-4H2V8H14Zm4,8V10H16v4H12v2h4v4h2V16h4V14ZM2,16h8V14H2Z" fill="#424242"/>
</svg>
