<svg id="edit-24px" xmlns="http://www.w3.org/2000/svg" width="24" height="24" viewBox="0 0 24 24">
  <path id="Tracé_2567" data-name="Tracé 2567" d="M0,0H24V24H0Z" fill="none"/>
  <path id="Icon_awesome-exchange-alt" data-name="Icon awesome-exchange-alt" d="M0,5.906V5.344A.844.844,0,0,1,.844,4.5H13.5V2.813a.844.844,0,0,1,1.44-.6l2.813,2.813a.844.844,0,0,1,0,1.193L14.94,9.034a.844.844,0,0,1-1.44-.6V6.75H.844A.844.844,0,0,1,0,5.906ZM17.156,11.25H4.5V9.563a.844.844,0,0,0-1.44-.6L.247,11.778a.844.844,0,0,0,0,1.193L3.06,15.784a.844.844,0,0,0,1.44-.6V13.5H17.156A.844.844,0,0,0,18,12.656v-.562A.844.844,0,0,0,17.156,11.25Z" transform="translate(2.604 2.999)" fill="#424242"/>
</svg>
