<svg id="Groupe_13326" data-name="Groupe 13326" xmlns="http://www.w3.org/2000/svg" width="413.379" height="267.842" viewBox="0 0 413.379 267.842">
  <g id="Groupe_13325" data-name="Groupe 13325" transform="translate(0)">
    <g id="Groupe_13317" data-name="Groupe 13317" transform="translate(48.456 82.563)">
      <g id="Groupe_13316" data-name="Groupe 13316" transform="translate(84.274)">
        <path id="Tracé_2881" data-name="Tracé 2881" d="M171.411,320.515l-27.644,32.4a10.478,10.478,0,0,0,.881,14.517h0a10.47,10.47,0,0,0,11.64,1.723c14.08-6.8,46.411-22.548,45.767-23.62-.488-.81-7.75-13.351-13.6-23.466A10.477,10.477,0,0,0,171.411,320.515Z" transform="translate(-141.259 -192.514)" fill="#ececec"/>
        <path id="Tracé_2882" data-name="Tracé 2882" d="M221.774,353.9l-62.948,20.537a10.983,10.983,0,0,1-13.848-7.035h0a10.982,10.982,0,0,1,7.035-13.848l62.948-20.536a10.983,10.983,0,0,1,13.848,7.034h0A10.983,10.983,0,0,1,221.774,353.9Z" transform="translate(-141.816 -195.256)" fill="#fbc39d"/>
        <path id="Tracé_2883" data-name="Tracé 2883" d="M310.4,320.515l27.644,32.4a10.478,10.478,0,0,1-.881,14.517h0a10.47,10.47,0,0,1-11.64,1.723c-14.08-6.8-46.411-22.548-45.767-23.62.488-.81,7.75-13.351,13.6-23.466A10.477,10.477,0,0,1,310.4,320.515Z" transform="translate(-165.555 -192.514)" fill="#ececec"/>
        <path id="Tracé_2884" data-name="Tracé 2884" d="M254.905,353.9l62.948,20.537A10.983,10.983,0,0,0,331.7,367.4h0a10.982,10.982,0,0,0-7.035-13.848l-62.948-20.536a10.983,10.983,0,0,0-13.848,7.034h0A10.983,10.983,0,0,0,254.905,353.9Z" transform="translate(-159.867 -195.256)" fill="#fbc39d"/>
        <path id="Tracé_2885" data-name="Tracé 2885" d="M281.642,318l-80.11-1.632v-10.3c0-16.819,17.1-32.507,33.923-32.507h12.629c14.94,0,33.557,15.8,33.557,30.738Z" transform="translate(-151.833 -184.922)" fill="#ececec"/>
        <path id="Tracé_2886" data-name="Tracé 2886" d="M235.457,273.564s1.093,10.324,9.727,10.324,10.657-10.056,10.657-10.056l1.877.289,7.175,42.426-4.985,51.586s-15.6,4.517-28.55.2,1.814-93.994,1.814-93.994Z" transform="translate(-156.132 -184.922)" fill="#008e7a"/>
        <path id="Tracé_2887" data-name="Tracé 2887" d="M262.585,274.086l-7.883,37.28,15.954-20.042-4.5-4.625,6.945-3.083s-.563-4.905-1.69-6.307S262.585,274.086,262.585,274.086Z" transform="translate(-161.161 -185.014)" fill="#d0e4ee"/>
        <path id="Tracé_2888" data-name="Tracé 2888" d="M232.416,274.33l7.883,37.279-15.954-20.041,4.5-4.625-6.945-3.084s.563-4.9,1.69-6.306S232.416,274.33,232.416,274.33Z" transform="translate(-155.407 -185.057)" fill="#d0e4ee"/>
        <g id="Groupe_13314" data-name="Groupe 13314" transform="translate(53.17)">
          <path id="Tracé_2889" data-name="Tracé 2889" d="M253.538,250.564H241.767a4.306,4.306,0,0,0-4.306,4.306v18.456a10.191,10.191,0,1,0,20.382,0V254.87A4.306,4.306,0,0,0,253.538,250.564Z" transform="translate(-211.306 -180.887)" fill="#fbc39d"/>
          <path id="Tracé_2890" data-name="Tracé 2890" d="M237.461,273.564s.825,6,10.192,6,10.192-6,10.192-6Z" transform="translate(-211.306 -184.922)" fill="#f9ac7f"/>
          <path id="Tracé_2891" data-name="Tracé 2891" d="M213.366,215.006a7.933,7.933,0,1,0,7.624,7.927A7.78,7.78,0,0,0,213.366,215.006Z" transform="translate(-205.741 -174.649)" fill="#f9ac7f"/>
          <path id="Tracé_2892" data-name="Tracé 2892" d="M283.152,215.006a7.933,7.933,0,1,0,7.624,7.927A7.78,7.78,0,0,0,283.152,215.006Z" transform="translate(-217.984 -174.649)" fill="#f9ac7f"/>
          <path id="Tracé_2893" data-name="Tracé 2893" d="M241.367,259.251l-.049.052c.79.068,1.586.111,2.393.111h0a27.725,27.725,0,0,0,7.029-.9c.01-.021.018-.042.027-.063,12.451-3.27,21.665-14.991,21.665-28.95V194.508c0-16.492-12.859-13.865-28.722-13.865h0c-15.863,0-28.722-2.627-28.722,13.865V229.5C214.988,245.167,226.6,258.01,241.367,259.251Z" transform="translate(-207.363 -168.594)" fill="#fbc39d"/>
          <path id="Tracé_2894" data-name="Tracé 2894" d="M266.639,224.833v9.445H256.454s-2.526-6.815-12.744-6.815-12.744,6.815-12.744,6.815H220.781v-9.445c0-3.722-3.49-4.949-5.793-5.354v16.857c0,15.671,11.613,28.513,26.379,29.754l-.051.052c.791.068,1.586.111,2.394.111s1.6-.044,2.393-.111l-.049-.052c14.765-1.241,26.379-14.084,26.379-29.754V219.479C270.128,219.884,266.639,221.111,266.639,224.833Z" transform="translate(-207.363 -175.434)" fill="#1d1d1b"/>
          <g id="Groupe_13311" data-name="Groupe 13311" transform="translate(43.616 33.688)">
            <path id="Tracé_2895" data-name="Tracé 2895" d="M265.039,214.561a2.016,2.016,0,1,1-2.014-2.093A2.055,2.055,0,0,1,265.039,214.561Z" transform="translate(-259.053 -207.892)"/>
            <rect id="Rectangle_18543" data-name="Rectangle 18543" width="8.551" height="3.358" rx="0.925"/>
          </g>
          <path id="Tracé_2896" data-name="Tracé 2896" d="M237.045,243.386h19.883s-1.755,6.784-9.942,6.784S237.045,243.386,237.045,243.386Z" transform="translate(-211.233 -179.628)" fill="#e6e6e6"/>
          <g id="Groupe_13312" data-name="Groupe 13312" transform="translate(7.625 55.414)">
            <path id="Tracé_2897" data-name="Tracé 2897" d="M246.053,263.02l.049.052c-.789.068-1.586.111-2.393.111s-1.6-.044-2.394-.111l.051-.052c-14.766-1.241-26.379-14.084-26.379-29.754v5.489c0,15.671,11.613,28.513,26.379,29.754l-.051.052c.791.068,1.586.111,2.394.111s1.6-.044,2.393-.111l-.049-.052c14.765-1.241,26.379-14.084,26.379-29.754v-5.489C272.432,248.937,260.819,261.779,246.053,263.02Z" transform="translate(-214.988 -233.266)" fill="#111110"/>
          </g>
          <g id="Groupe_13313" data-name="Groupe 13313" transform="translate(19.993 33.688)">
            <path id="Tracé_2898" data-name="Tracé 2898" d="M236.39,214.561a2.016,2.016,0,1,1-2.014-2.093A2.055,2.055,0,0,1,236.39,214.561Z" transform="translate(-230.404 -207.892)"/>
            <rect id="Rectangle_18544" data-name="Rectangle 18544" width="8.551" height="3.358" rx="0.925"/>
          </g>
          <path id="Tracé_2899" data-name="Tracé 2899" d="M264.844,166.619c-7.856-1.1-20.095-1.231-29.028,6.108a6.679,6.679,0,0,0-.571.551h-7.067c-7.285,0-13.191,5.157-13.191,11.518v39.577a2.485,2.485,0,0,0,2.436-2.533V196.328s.45-8.1,7.792-8.1h35.929c7.823,0,8.774,7.091,8.864,8V221.84a2.486,2.486,0,0,0,2.437,2.533V185.53l.086-9.966A8.947,8.947,0,0,0,264.844,166.619Z" transform="translate(-207.363 -166.063)" fill="#1d1d1b"/>
          <path id="Tracé_2900" data-name="Tracé 2900" d="M251.219,223.012H244.47a2.531,2.531,0,1,0,0,5.062h6.749a2.531,2.531,0,1,0,0-5.062Z" transform="translate(-212.091 -176.053)" fill="#f9ac7f"/>
        </g>
        <g id="Groupe_13315" data-name="Groupe 13315" transform="translate(18.797 108.438)">
          <rect id="Rectangle_18545" data-name="Rectangle 18545" width="139.942" height="9.586" rx="4.793" transform="translate(0 61.965)" fill="#262626"/>
          <rect id="Rectangle_18546" data-name="Rectangle 18546" width="115.713" height="71.55" rx="9.174" transform="translate(12.88)" fill="#323232"/>
          <path id="Tracé_2901" data-name="Tracé 2901" d="M247.045,347.872a8.782,8.782,0,1,1,8.782-8.782A8.792,8.792,0,0,1,247.045,347.872Zm0-16.034a7.252,7.252,0,1,0,7.253,7.253A7.261,7.261,0,0,0,247.045,331.838Z" transform="translate(-177.074 -303.315)" fill="#dbdbdb"/>
        </g>
      </g>
      <path id="Tracé_2902" data-name="Tracé 2902" d="M340.6,385.568H120.2a1.552,1.552,0,0,1,0-3.1H340.6a1.552,1.552,0,1,1,0,3.1Z" transform="translate(-53.018 -204.027)" fill="#141414"/>
      <path id="Tracé_2903" data-name="Tracé 2903" d="M105.558,385.568H80.866a1.552,1.552,0,1,1,0-3.1h24.692a1.552,1.552,0,1,1,0,3.1Z" transform="translate(-46.117 -204.027)" fill="#141414"/>
      <path id="Tracé_2904" data-name="Tracé 2904" d="M422.43,385.568H397.738a1.552,1.552,0,1,1,0-3.1H422.43a1.552,1.552,0,1,1,0,3.1Z" transform="translate(-101.708 -204.027)" fill="#40bcdf"/>
      <path id="Tracé_2905" data-name="Tracé 2905" d="M443.281,385.568h-5.287a1.552,1.552,0,0,1,0-3.1h5.287a1.552,1.552,0,1,1,0,3.1Z" transform="translate(-108.77 -204.027)" fill="#40bcdf"/>
      <path id="Tracé_2906" data-name="Tracé 2906" d="M68.279,385.568H59.887a1.552,1.552,0,1,1,0-3.1h8.392a1.552,1.552,0,0,1,0,3.1Z" transform="translate(-42.436 -204.027)" fill="#40bcdf"/>
      <path id="Tracé_2907" data-name="Tracé 2907" d="M42.788,385.568H40.607a1.552,1.552,0,1,1,0-3.1h2.181a1.552,1.552,0,1,1,0,3.1Z" transform="translate(-39.054 -204.027)" fill="#40bcdf"/>
    </g>
    <g id="Groupe_13324" data-name="Groupe 13324" transform="translate(0 0)">
      <path id="Tracé_2908" data-name="Tracé 2908" d="M159.424,162.47H143.7a30.236,30.236,0,0,0-30.237,30.236h0a30.234,30.234,0,0,0,30.143,30.233h0c3.378,3.16,7.954,7.56,7.955,7.561h0l7.862-7.559h0a30.235,30.235,0,0,0,30.236-30.235h0A30.236,30.236,0,0,0,159.424,162.47Z" transform="translate(-113.465 -59.869)" fill="#ececec"/>
      <circle id="Ellipse_3397" data-name="Ellipse 3397" cx="19.388" cy="19.388" r="19.388" transform="matrix(0.232, -0.973, 0.973, 0.232, 211.385, 37.718)" fill="#ececec"/>
      <circle id="Ellipse_3398" data-name="Ellipse 3398" cx="4.972" cy="4.972" r="4.972" transform="translate(114.446 210.672)" fill="#e34168"/>
      <circle id="Ellipse_3399" data-name="Ellipse 3399" cx="5.133" cy="5.133" r="5.133" transform="translate(309.958 23.361)" fill="#ffd500"/>
      <path id="Tracé_2909" data-name="Tracé 2909" d="M347.408,166.281a.759.759,0,0,1-.549-.235l-2.726-2.863H322.983a17.131,17.131,0,1,1,0-34.261H352.5a17.131,17.131,0,1,1,0,34.261h-2.221L348,166a.759.759,0,0,1-.559.281Zm-24.424-35.843a15.614,15.614,0,1,0,0,31.229h21.473a.761.761,0,0,1,.55.235l2.354,2.473,1.964-2.427a.759.759,0,0,1,.59-.281H352.5a15.614,15.614,0,0,0,0-31.229Z" transform="translate(-37.404 -76.984)" fill="#9e9e9e"/>
      <path id="Tracé_2932" data-name="Tracé 2932" d="M319.731,152.258a.474.474,0,0,0,.343-.147l1.7-1.788h13.211a10.7,10.7,0,1,0,0-21.4H316.553a10.7,10.7,0,1,0,0,21.4h1.387l1.423,1.759a.474.474,0,0,0,.349.176Zm15.256-22.389a9.753,9.753,0,1,1,0,19.507H321.575a.475.475,0,0,0-.344.147l-1.47,1.545-1.227-1.516a.474.474,0,0,0-.368-.176h-1.613a9.753,9.753,0,0,1,0-19.507Z" transform="translate(-206.406 28.039)" fill="#ebf6fe"/>
      <g id="Groupe_13318" data-name="Groupe 13318" transform="translate(53.758 33.54)">
        <path id="Tracé_2910" data-name="Tracé 2910" d="M126.134,127.838H93.8a14.359,14.359,0,1,0,0,28.718h32.333a14.359,14.359,0,1,0,0-28.718Z" transform="translate(-79.442 -127.838)" fill="#8cc63f"/>
        <path id="Tracé_2911" data-name="Tracé 2911" d="M98.912,149.909l-3.881,5.264-3.3-5.264Z" transform="translate(-76.21 -122.034)" fill="#8cc63f"/>
      </g>
      <path id="Tracé_2912" data-name="Tracé 2912" d="M392.086,190.1h-28.84a24.475,24.475,0,0,0,0,48.95h3.008l6.2,8.7,5.678-8.7h13.958a24.475,24.475,0,0,0,0-48.95Z" transform="translate(-3.181 -100.717)" fill="#ffd500"/>
      <g id="Groupe_13319" data-name="Groupe 13319" transform="translate(135.163 82.261)">
        <path id="Tracé_2913" data-name="Tracé 2913" d="M227.974,161.731a2.8,2.8,0,0,1-1.987-.823l-15.466-15.466a2.809,2.809,0,0,1,3.974-3.972l15.466,15.466a2.809,2.809,0,0,1-1.987,4.8Z" transform="translate(-209.699 -140.646)" fill="#40bcdf"/>
        <path id="Tracé_2914" data-name="Tracé 2914" d="M212.508,161.731a2.809,2.809,0,0,1-1.987-4.8l15.466-15.466a2.809,2.809,0,0,1,3.974,3.972l-15.466,15.466A2.8,2.8,0,0,1,212.508,161.731Z" transform="translate(-209.699 -140.646)" fill="#40bcdf"/>
      </g>
      <path id="Tracé_2915" data-name="Tracé 2915" d="M118.03,142.124H101.265a2.414,2.414,0,1,1,0-4.828H118.03a2.414,2.414,0,1,1,0,4.828Z" transform="translate(-20.581 -91.811)" fill="#fff"/>
      <path id="Tracé_2916" data-name="Tracé 2916" d="M358.021,143.983H324.327a1.709,1.709,0,1,1,0-3.418h33.693a1.709,1.709,0,1,1,0,3.418Z" transform="translate(-40.346 -79.027)" fill="#424242"/>
      <path id="Tracé_2929" data-name="Tracé 2929" d="M344.733,142.7H323.686a1.068,1.068,0,1,1,0-2.135h21.048a1.068,1.068,0,1,1,0,2.135Z" transform="translate(-215.154 22.393)" fill="#40bcdf"/>
      <path id="Tracé_2917" data-name="Tracé 2917" d="M341.822,151.064H324.327a1.709,1.709,0,1,1,0-3.418h17.495a1.709,1.709,0,1,1,0,3.418Z" transform="translate(-40.346 -80.269)" fill="#424242"/>
      <path id="Tracé_2930" data-name="Tracé 2930" d="M334.615,149.781H323.686a1.068,1.068,0,1,1,0-2.135h10.929a1.068,1.068,0,1,1,0,2.135Z" transform="translate(-215.153 18.959)" fill="#40bcdf"/>
      <path id="Tracé_2918" data-name="Tracé 2918" d="M351.521,158.144H324.327a1.709,1.709,0,1,1,0-3.418h27.194a1.709,1.709,0,0,1,0,3.418Z" transform="translate(-40.346 -81.511)" fill="#424242"/>
      <path id="Tracé_2931" data-name="Tracé 2931" d="M340.674,156.861H323.686a1.068,1.068,0,1,1,0-2.135h16.988a1.068,1.068,0,0,1,0,2.135Z" transform="translate(-215.154 15.526)" fill="#40bcdf"/>
      <path id="Tracé_2919" data-name="Tracé 2919" d="M95.712,142.124H92.787a2.414,2.414,0,1,1,0-4.828h2.925a2.414,2.414,0,1,1,0,4.828Z" transform="translate(-22.812 -91.811)" fill="#fff"/>
      <path id="Tracé_2920" data-name="Tracé 2920" d="M161.808,188.768a.7.7,0,0,0,0-.083,3.179,3.179,0,0,0-2.817-3.117,5.992,5.992,0,0,0-.755-.021H157.7v-4.038a14.563,14.563,0,0,0-.174-2.75,8.221,8.221,0,0,0-2.881-4.778,8.891,8.891,0,0,0-2.8-1.542,8.186,8.186,0,0,0-2.893-.388,8.323,8.323,0,0,0-4.663,1.648,9.276,9.276,0,0,0-1.944,2,8.262,8.262,0,0,0-1.087,2.214,9.775,9.775,0,0,0-.391,3.062v4.568h-.13c-.265,0-.526,0-.79,0a3.194,3.194,0,0,0-2.715,1.481,5.759,5.759,0,0,0-.474,3.194v13.19a3.332,3.332,0,0,0,.85,2.316,3.211,3.211,0,0,0,2.391,1.007h18.355a3.975,3.975,0,0,0,1.273-.158,3.2,3.2,0,0,0,2.189-3.011v-14.8Zm-9.983,7.283a2.636,2.636,0,0,1-1.359,2.2v2.134a1.186,1.186,0,0,1-2.371,0v-2.15a2.531,2.531,0,0,1-1.007-.944,2.59,2.59,0,0,1,.268-2.972,2.536,2.536,0,0,1,2.755-.735,2.589,2.589,0,0,1,1.711,2.359v.047A.1.1,0,0,1,151.825,196.05Zm2.711-13.9v3.4H144.024v-4.674a11.246,11.246,0,0,1,.039-1.154,5.245,5.245,0,0,1,1.048-2.482c-.039.047-.076.1-.115.142l.25-.321c-.044.06-.091.119-.135.178a6.93,6.93,0,0,1,.948-.948c-.059.043-.118.086-.177.134l.32-.249c-.047.036-.094.076-.142.115a5.25,5.25,0,0,1,2.514-1.051,6.939,6.939,0,0,1,1.415,0,7.292,7.292,0,0,1,1.351.367,7.026,7.026,0,0,1,1.166.684c-.047-.039-.091-.076-.138-.111l.32.249c-.059-.044-.118-.091-.177-.135a7.316,7.316,0,0,1,.953.953c-.044-.059-.088-.118-.135-.177l.249.32c-.035-.047-.074-.1-.114-.142a7.1,7.1,0,0,1,.683,1.17,7.2,7.2,0,0,1,.36,1.3C154.584,180.517,154.536,181.347,154.536,182.148Z" transform="translate(-111.258 -58.962)" fill="#e34168"/>
      <g id="Groupe_13320" data-name="Groupe 13320" transform="translate(227.405 14.106)">
        <path id="Tracé_2921" data-name="Tracé 2921" d="M271.137,101.044a6.589,6.589,0,0,0-6.588-6.589h-1.883a6.589,6.589,0,0,0-6.589,6.589v1.882h15.06Z" transform="translate(-256.077 -85.043)" fill="#424242"/>
        <path id="Tracé_2922" data-name="Tracé 2922" d="M264.408,83.041a3.765,3.765,0,1,1-3.765,3.765A3.765,3.765,0,0,1,264.408,83.041Z" transform="translate(-256.878 -83.041)" fill="#424242"/>
      </g>
      <g id="Groupe_13321" data-name="Groupe 13321" transform="translate(354.126 103.73)">
        <path id="Tracé_2923" data-name="Tracé 2923" d="M364.041,202.058a9.824,9.824,0,0,1,8.636,5.144h19.891l4.676,4.208-6.079,5.144-2.806-2.806-2.806,2.806-2.806-2.806-2.806,2.806h-7.264a9.821,9.821,0,1,1-8.636-14.5Zm-3.274,7.014a2.806,2.806,0,1,0,2.806,2.806A2.806,2.806,0,0,0,360.767,209.072Z" transform="translate(-354.22 -202.058)" fill="#424242"/>
      </g>
      <path id="Tracé_2924" data-name="Tracé 2924" d="M367.9,302.6a18.885,18.885,0,0,0-18.885-18.884h-1.454a18.879,18.879,0,0,0-3.512,37.43L347.9,327.3l4.526-6.137A18.879,18.879,0,0,0,367.9,302.6Z" transform="translate(-22.41 -135.183)" fill="#e34168"/>
      <g id="Groupe_13322" data-name="Groupe 13322" transform="translate(323.174 156.961)">
        <path id="Tracé_2925" data-name="Tracé 2925" d="M344.349,304.239h1.8a.555.555,0,0,0,.556-.555l1.11-12.484a.555.555,0,0,0-.555-.556H343.24a.555.555,0,0,0-.555.556l1.109,12.484A.555.555,0,0,0,344.349,304.239Z" transform="translate(-342.546 -290.644)" fill="#ececec"/>
        <path id="Tracé_2926" data-name="Tracé 2926" d="M345.276,303.387a2.7,2.7,0,1,0,2.706,2.706A2.7,2.7,0,0,0,345.276,303.387Z" transform="translate(-342.571 -287.885)" fill="#ececec"/>
      </g>
      <g id="Groupe_13323" data-name="Groupe 13323" transform="translate(348.464 215.266)">
        <path id="Tracé_2927" data-name="Tracé 2927" d="M401.918,368.971a3,3,0,0,1-2.133-.885l-16.623-16.623a3.019,3.019,0,1,1,4.269-4.271l16.623,16.623a3.021,3.021,0,0,1-2.136,5.156Z" transform="translate(-382.276 -346.309)" fill="#ececec"/>
        <path id="Tracé_2928" data-name="Tracé 2928" d="M385.294,368.971a3.021,3.021,0,0,1-2.133-5.156l16.623-16.623a3.019,3.019,0,1,1,4.269,4.271L387.43,368.086A3.006,3.006,0,0,1,385.294,368.971Z" transform="translate(-382.276 -346.309)" fill="#ececec"/>
      </g>
    </g>
  </g>
</svg>
