<svg id="bar_chart-24px" xmlns="http://www.w3.org/2000/svg" width="28.654" height="28.654" viewBox="0 0 28.654 28.654">
  <path id="Tracé_2545" data-name="Tracé 2545" d="M0,0H28.654V28.654H0Z" fill="none"/>
  <path id="ic_local_grocery_store_24px" d="M7.447,19.192A2.149,2.149,0,1,0,9.6,21.341,2.146,2.146,0,0,0,7.447,19.192ZM1,2V4.149H3.149L7.017,12.3,5.567,14.937A2.078,2.078,0,0,0,5.3,15.969a2.155,2.155,0,0,0,2.149,2.149H20.341V15.969H7.9A.266.266,0,0,1,7.63,15.7l.032-.129.967-1.751h8.005a2.139,2.139,0,0,0,1.88-1.107l3.847-6.974a1.05,1.05,0,0,0,.129-.516,1.078,1.078,0,0,0-1.075-1.075H5.524L4.514,2H1ZM18.192,19.192a2.149,2.149,0,1,0,2.149,2.149A2.146,2.146,0,0,0,18.192,19.192Z" transform="translate(2.582 1.582)" fill="#fff"/>
</svg>
