<svg xmlns="http://www.w3.org/2000/svg" width="388.453" height="238.666" viewBox="0 0 388.453 238.666">
  <g id="Groupe_2548" data-name="Groupe 2548" transform="translate(-1114.001 -364.611)">
    <path id="Tracé_1913" data-name="Tracé 1913" d="M410.3,324.283c-2.934-7.537-5.125-15.536-7.519-23.984-1.613-5.694-4.214-12.065-9.852-13.859-5.485-1.746-11.392,1.872-14.765,6.536s-5.074,10.318-7.96,15.3c-5.23,9.026-14.494,12.81-22.15,4.874-10.936-11.336-15.859-26.787-22.794-40.614-5.035-10.038-9.248-21.789-15.592-31.04-9.673-14.107-22.936-26.136-40.574-26.136-11.18,1.694-21.031,11.6-27.7,23.972s-10.556,27.093-13.87,41.775c-6.027,26.7-10.444,54.021-14.853,81.306l222.534-2.6c-.884.01-6.341-7.282-7.386-8.294C419.272,343.254,414.145,334.165,410.3,324.283Z" transform="translate(1065.493 240.868)" fill="#e0e0e0"/>
    <path id="Tracé_1914" data-name="Tracé 1914" d="M399.036,354.131c-.436,8.65-9.849,23.774-18.5,23.338s-13.263-16.267-12.827-24.917,9.648-51.94,18.3-51.5S399.472,345.479,399.036,354.131Z" transform="translate(1034.514 223.743)" fill="#f5f5f5"/>
    <line id="Ligne_99" data-name="Ligne 99" x1="4.362" y2="70.103" transform="translate(1415.744 530.414)" fill="none" stroke="#263238" stroke-linecap="round" stroke-linejoin="round" stroke-width="0.867"/>
    <path id="Tracé_1915" data-name="Tracé 1915" d="M380.927,357.944a60.128,60.128,0,0,0-4.377,13.6c-.46,2.4-.749,5,.336,7.186,1.186,2.389,3.817,3.782,6.449,4.214,6.43,1.055,12.862-2.883,16.63-8.2s5.4-11.813,6.9-18.154c1.179-4.993,2.338-10.06,4.561-14.713.953-1.995,6.534-9.695,3.894-11.692-3.611-2.837-14.063.249-20.761,7.561A78.061,78.061,0,0,0,380.927,357.944Z" transform="translate(1032.823 218.128)" fill="#fff"/>
    <path id="Tracé_1916" data-name="Tracé 1916" d="M385.133,384.5s7.764-30.222,26.5-47.557" transform="translate(1031.026 216.568)" fill="none" stroke="#263238" stroke-linecap="round" stroke-linejoin="round" stroke-width="0.867"/>
    <path id="Tracé_1917" data-name="Tracé 1917" d="M434.895,355.207a7.6,7.6,0,0,1-3.041,2.64c-1.394.786-2.879,1.475-4.314,2.144a49.671,49.671,0,0,0-5.507,2.848,18.579,18.579,0,0,0-3.377,2.691,42.745,42.745,0,0,1,5.354-9.1c2.737-3.523,5.547-5.308,8.354-5.308.065,0,.13,0,.2,0a3.153,3.153,0,0,1,2.008.639A2.86,2.86,0,0,1,434.895,355.207Z" transform="translate(1024.326 213.736)" fill="#e8505b"/>
    <path id="Tracé_1918" data-name="Tracé 1918" d="M438.1,379.29a7.612,7.612,0,0,1-3.878,1.084c-1.6.114-3.233.1-4.815.092a49.4,49.4,0,0,0-6.2.218,18.53,18.53,0,0,0-4.2.986,42.789,42.789,0,0,1,8.734-5.938c3.982-2.013,7.285-2.424,9.822-1.223.059.028.117.057.174.086a3.156,3.156,0,0,1,1.543,1.437A2.864,2.864,0,0,1,438.1,379.29Z" transform="translate(1024.256 209.195)" fill="#e8505b"/>
    <path id="Tracé_1919" data-name="Tracé 1919" d="M430.971,390.73a5.207,5.207,0,0,1-2.437-1.279c-.847-.691-1.656-1.465-2.438-2.212a33.859,33.859,0,0,0-3.183-2.8,12.719,12.719,0,0,0-2.553-1.479,29.18,29.18,0,0,1,7.127,1.14c2.924.865,4.759,2.208,5.458,4,.016.042.032.082.046.125a2.153,2.153,0,0,1,.094,1.438A1.956,1.956,0,0,1,430.971,390.73Z" transform="translate(1023.986 207.371)" fill="#8b3036"/>
    <path id="Tracé_1920" data-name="Tracé 1920" d="M407.317,388.055s.089-18.493,22.671-34.194" transform="translate(1026.592 213.188)" fill="none" stroke="#2a294f" stroke-linecap="round" stroke-linejoin="round" stroke-width="0.78"/>
    <path id="Tracé_1921" data-name="Tracé 1921" d="M407.317,392.884s6.935-14.856,25.731-14.856" transform="translate(1026.592 208.358)" fill="none" stroke="#2a294f" stroke-linecap="round" stroke-linejoin="round" stroke-width="0.78"/>
    <path id="Tracé_1922" data-name="Tracé 1922" d="M420.1,383.194s3.64-.266,11.241,5.468" transform="translate(1024.037 207.326)" fill="none" stroke="#2a294f" stroke-linecap="round" stroke-linejoin="round" stroke-width="0.78"/>
    <path id="Tracé_1923" data-name="Tracé 1923" d="M133.367,370.908c-5.221-19.731-10.47-39.471-16.607-58.58-3.461-10.775-7.278-21.509-12.582-30.129s-12.331-14.98-19.385-14.936c-10.87,2.1-17.882,12.837-22.481,24.723-3.015,7.8-4.477,17.238-6.61,25.475-2.939,11.346-4.48,23.689-10.125,33.617-3.952,6.95-10.027,5.177-14.121-1.067-2.26-3.446-3.854-7.545-6.383-10.691s-6.52-5.195-9.731-3.213c-3.3,2.038-4.289,7.195-4.733,11.719-.659,6.714-1.237,13.061-2.318,19.145q-.353,1.986-.786,3.936Z" transform="translate(1106.496 230.495)" fill="#e0e0e0"/>
    <path id="Tracé_1924" data-name="Tracé 1924" d="M94.069,348.681c-3.261-3.762-7.389-7.008-8.691-11.754-.951-3.469-.2-7.139.17-10.716s.241-7.533-2.073-10.286c-1.907-2.268-4.919-3.253-7.816-3.877s-5.92-1.016-8.491-2.49c-4.175-2.393-3.343-6.465-5.584-10.037-2.515-4.007-8.366-9.118-13.382-6.457-5.311,2.818-4.47,11.376-.937,15.153,2.344,2.507,5.344,4.911,5.689,8.325.519,5.14-5.37,9.767-3.749,14.673,1.2,3.623,5.763,4.869,8.018,7.946,2.232,3.045,1.782,7.312.468,10.851s-3.383,6.811-4.2,10.5c-1.672,7.541,4.245,12.752,10.986,14.434,6.2,1.544,19.557.815,19.557.815a25.558,25.558,0,0,0,12.676-10.433,13.268,13.268,0,0,0,.72-11.519A19.216,19.216,0,0,0,94.069,348.681Z" transform="translate(1099.119 225.485)" fill="#f5f5f5"/>
    <path id="Tracé_1925" data-name="Tracé 1925" d="M56.568,303.413s22.813,35.238,25.3,74.366" transform="translate(1096.69 223.27)" fill="none" stroke="#263238" stroke-linecap="round" stroke-linejoin="round" stroke-width="1"/>
    <path id="Tracé_1926" data-name="Tracé 1926" d="M31.033,362.693a2.384,2.384,0,0,1,1.519-.483l.147,0c2.123,0,4.247,1.349,6.317,4.014a32.322,32.322,0,0,1,4.048,6.884,14.057,14.057,0,0,0-2.554-2.035,37.54,37.54,0,0,0-4.164-2.153c-1.085-.5-2.208-1.027-3.261-1.62a5.744,5.744,0,0,1-2.3-2A2.164,2.164,0,0,1,31.033,362.693Z" transform="translate(1101.906 211.52)" fill="#e8505b"/>
    <path id="Tracé_1927" data-name="Tracé 1927" d="M26.754,381.046a2.385,2.385,0,0,1,1.167-1.087q.065-.034.132-.065c1.919-.909,4.416-.6,7.426.924a32.364,32.364,0,0,1,6.605,4.49,14.054,14.054,0,0,0-3.179-.746,37.435,37.435,0,0,0-4.686-.165c-1.2.008-2.434.017-3.641-.069a5.752,5.752,0,0,1-2.933-.82A2.166,2.166,0,0,1,26.754,381.046Z" transform="translate(1102.674 208.086)" fill="#e8505b"/>
    <path id="Tracé_1928" data-name="Tracé 1928" d="M32.881,391.353a1.63,1.63,0,0,1,.071-1.087c.011-.032.022-.063.035-.094.528-1.351,1.916-2.367,4.126-3.021a22.082,22.082,0,0,1,5.39-.863,9.558,9.558,0,0,0-1.931,1.119,25.744,25.744,0,0,0-2.408,2.114c-.591.565-1.2,1.149-1.844,1.672a3.933,3.933,0,0,1-1.842.967A1.48,1.48,0,0,1,32.881,391.353Z" transform="translate(1101.437 206.707)" fill="#8b3036"/>
    <path id="Tracé_1929" data-name="Tracé 1929" d="M50.5,390.137s-.067-13.983-17.142-25.854" transform="translate(1101.328 211.105)" fill="none" stroke="#263238" stroke-linecap="round" stroke-linejoin="round" stroke-width="0.78"/>
    <path id="Tracé_1930" data-name="Tracé 1930" d="M49.924,393.789a21.512,21.512,0,0,0-19.456-11.233" transform="translate(1101.906 207.453)" fill="none" stroke="#263238" stroke-linecap="round" stroke-linejoin="round" stroke-width="0.78"/>
    <path id="Tracé_1931" data-name="Tracé 1931" d="M42.994,386.462s-2.753-.2-8.5,4.135" transform="translate(1101.102 206.673)" fill="none" stroke="#2a294f" stroke-linecap="round" stroke-linejoin="round" stroke-width="0.78"/>
    <rect id="Rectangle_833" data-name="Rectangle 833" width="165.677" height="219.279" rx="9.449" transform="translate(1176.913 381.964)" fill="#263238"/>
    <rect id="Rectangle_834" data-name="Rectangle 834" width="146.425" height="199.044" rx="3.862" transform="translate(1186.539 392.081)" fill="#fafafa"/>
    <path id="Tracé_1933" data-name="Tracé 1933" d="M194.459,114.072c.01-.206.031-.41.031-.62a12.591,12.591,0,1,0-25.181,0c0,.21.022.414.031.62H150.83v19.194h62.139V114.072Z" transform="translate(1077.852 263.75)" fill="#455a64"/>
    <circle id="Ellipse_115" data-name="Ellipse 115" cx="7.07" cy="7.07" r="7.07" transform="translate(1250.505 373.397) rotate(-22.628)" fill="#fff"/>
    <rect id="Rectangle_836" data-name="Rectangle 836" width="23.568" height="23.568" transform="translate(1203.459 423.598)" fill="none" stroke="#263238" stroke-miterlimit="10" stroke-width="1"/>
    <path id="Tracé_1937" data-name="Tracé 1937" d="M239.47,182.489h-76.8a.907.907,0,0,1-.907-.907h0a.906.906,0,0,1,.907-.907h76.8a.906.906,0,0,1,.907.907h0A.907.907,0,0,1,239.47,182.489Z" transform="translate(1075.666 247.799)"/>
    <path id="Tracé_1938" data-name="Tracé 1938" d="M239.47,187.489h-76.8a.907.907,0,0,1-.907-.907h0a.906.906,0,0,1,.907-.907h76.8a.906.906,0,0,1,.907.907h0A.907.907,0,0,1,239.47,187.489Z" transform="translate(1075.666 246.8)"/>
    <path id="Tracé_1939" data-name="Tracé 1939" d="M239.47,192.489h-76.8a.906.906,0,0,1-.907-.907h0a.906.906,0,0,1,.907-.907h76.8a.907.907,0,0,1,.907.907h0A.906.906,0,0,1,239.47,192.489Z" transform="translate(1075.666 245.801)"/>
    <path id="Tracé_1940" data-name="Tracé 1940" d="M239.47,197.49h-76.8a.907.907,0,0,1-.907-.907h0a.907.907,0,0,1,.907-.907h76.8a.907.907,0,0,1,.907.907h0A.907.907,0,0,1,239.47,197.49Z" transform="translate(1075.666 244.802)"/>
    <rect id="Rectangle_837" data-name="Rectangle 837" width="23.568" height="23.568" transform="translate(1203.459 461.54)" fill="none" stroke="#263238" stroke-miterlimit="10" stroke-width="1"/>
    <path id="Tracé_1942" data-name="Tracé 1942" d="M239.47,229.907h-76.8a.906.906,0,0,1-.907-.907h0a.907.907,0,0,1,.907-.907h76.8a.907.907,0,0,1,.907.907h0A.906.906,0,0,1,239.47,229.907Z" transform="translate(1075.666 238.323)"/>
    <path id="Tracé_1943" data-name="Tracé 1943" d="M239.47,234.908h-76.8a.907.907,0,0,1-.907-.907h0a.907.907,0,0,1,.907-.907h76.8a.907.907,0,0,1,.907.907h0A.907.907,0,0,1,239.47,234.908Z" transform="translate(1075.666 237.323)"/>
    <path id="Tracé_1944" data-name="Tracé 1944" d="M239.47,239.908h-76.8a.907.907,0,0,1-.907-.907h0a.907.907,0,0,1,.907-.907h76.8a.907.907,0,0,1,.907.907h0A.907.907,0,0,1,239.47,239.908Z" transform="translate(1075.666 236.324)"/>
    <path id="Tracé_1945" data-name="Tracé 1945" d="M239.47,244.908h-76.8a.906.906,0,0,1-.907-.907h0a.906.906,0,0,1,.907-.907h76.8a.906.906,0,0,1,.907.907h0A.907.907,0,0,1,239.47,244.908Z" transform="translate(1075.666 235.325)"/>
    <rect id="Rectangle_838" data-name="Rectangle 838" width="23.568" height="23.568" transform="translate(1203.459 499.482)" fill="none" stroke="#263238" stroke-miterlimit="10" stroke-width="1"/>
    <path id="Tracé_1947" data-name="Tracé 1947" d="M239.47,277.326h-76.8a.907.907,0,0,1-.907-.907h0a.907.907,0,0,1,.907-.907h76.8a.907.907,0,0,1,.907.907h0A.907.907,0,0,1,239.47,277.326Z" transform="translate(1075.666 228.846)"/>
    <path id="Tracé_1948" data-name="Tracé 1948" d="M239.47,282.326h-76.8a.907.907,0,0,1-.907-.907h0a.906.906,0,0,1,.907-.907h76.8a.906.906,0,0,1,.907.907h0A.907.907,0,0,1,239.47,282.326Z" transform="translate(1075.666 227.847)"/>
    <path id="Tracé_1949" data-name="Tracé 1949" d="M239.47,287.326h-76.8a.906.906,0,0,1-.907-.907h0a.907.907,0,0,1,.907-.907h76.8a.907.907,0,0,1,.907.907h0A.906.906,0,0,1,239.47,287.326Z" transform="translate(1075.666 226.847)"/>
    <path id="Tracé_1950" data-name="Tracé 1950" d="M239.47,292.326h-76.8a.906.906,0,0,1-.907-.907h0a.907.907,0,0,1,.907-.907h76.8a.907.907,0,0,1,.907.907h0A.906.906,0,0,1,239.47,292.326Z" transform="translate(1075.666 225.848)"/>
    <rect id="Rectangle_839" data-name="Rectangle 839" width="23.568" height="23.568" transform="translate(1203.459 537.424)" fill="none" stroke="#263238" stroke-miterlimit="10" stroke-width="1"/>
    <path id="Tracé_1952" data-name="Tracé 1952" d="M239.47,324.744h-76.8a.906.906,0,0,1-.907-.907h0a.907.907,0,0,1,.907-.907h76.8a.907.907,0,0,1,.907.907h0A.906.906,0,0,1,239.47,324.744Z" transform="translate(1075.666 219.369)"/>
    <path id="Tracé_1953" data-name="Tracé 1953" d="M239.47,329.745h-76.8a.907.907,0,0,1-.907-.907h0a.907.907,0,0,1,.907-.907h76.8a.907.907,0,0,1,.907.907h0A.907.907,0,0,1,239.47,329.745Z" transform="translate(1075.666 218.37)"/>
    <path id="Tracé_1954" data-name="Tracé 1954" d="M239.47,334.745h-76.8a.907.907,0,0,1-.907-.907h0a.907.907,0,0,1,.907-.907h76.8a.907.907,0,0,1,.907.907h0A.907.907,0,0,1,239.47,334.745Z" transform="translate(1075.666 217.371)"/>
    <path id="Tracé_1955" data-name="Tracé 1955" d="M239.47,339.745h-76.8a.907.907,0,0,1-.907-.907h0a.906.906,0,0,1,.907-.907h76.8a.906.906,0,0,1,.907.907h0A.907.907,0,0,1,239.47,339.745Z" transform="translate(1075.666 216.371)"/>
    <path id="Tracé_1956" data-name="Tracé 1956" d="M299.581,198.435c-.49.374-4.931,3-4.931,3L291.5,197.4l.938-4.6,6.784.423,1.187,3.435C300.689,197.469,300.187,197.973,299.581,198.435Z" transform="translate(1049.739 245.377)" fill="#fe9280"/>
    <path id="Tracé_1957" data-name="Tracé 1957" d="M299.62,193.233l1.023,3.01-3.129,1.26a2.871,2.871,0,0,1-3.993-2.981l.2-1.655Z" transform="translate(1049.339 245.363)" fill="#ffbe9d"/>
    <path id="Tracé_1958" data-name="Tracé 1958" d="M299.229,197.438l2.713.4,1.486-2.546a.984.984,0,0,0-.307-1.357h0a.984.984,0,0,0-1.358.307Z" transform="translate(1048.194 245.181)" fill="#ffbe9d"/>
    <path id="Tracé_1959" data-name="Tracé 1959" d="M294.766,211.954l-5.593,1.414-2,16.2,6.548.267Z" transform="translate(1050.603 241.548)" fill="#e8505b"/>
    <path id="Tracé_1960" data-name="Tracé 1960" d="M386.121,223.637l-9.777-1.231,2.238-17.774,9.777,1.231a8.958,8.958,0,0,1,7.769,10.006h0A8.958,8.958,0,0,1,386.121,223.637Z" transform="translate(1032.782 243.011)" fill="#8b3036"/>
    <path id="Tracé_1962" data-name="Tracé 1962" d="M348.948,218.877,245.222,205.5l2.238-17.775L351.186,201.1Z" transform="translate(1058.987 246.391)" fill="#455a64"/>
    <path id="Tracé_1963" data-name="Tracé 1963" d="M222.128,194.142,240.607,205.5l2.238-17.775Z" transform="translate(1063.603 246.391)" fill="#fff4dd"/>
    <path id="Tracé_1965" data-name="Tracé 1965" d="M228.3,193.357l-6.17,1.912,5.5,3.382Z" transform="translate(1063.603 245.265)" fill="#2a294f"/>
    <rect id="Rectangle_840" data-name="Rectangle 840" width="8.653" height="17.915" transform="translate(1410.173 447.493) rotate(7.175)" fill="#d3eaf5"/>
    <rect id="Rectangle_841" data-name="Rectangle 841" width="2.958" height="19.449" transform="translate(1415.919 447.444) rotate(7.175)" fill="#d3eaf5"/>
    <path id="Tracé_1968" data-name="Tracé 1968" d="M332.325,270.6l1.474-3.788,4.938-.386a1.55,1.55,0,0,1,1.8,1.231h0a1.55,1.55,0,0,1-1.493,1.586Z" transform="translate(1041.579 230.665)" fill="#ffbe9d"/>
    <path id="Tracé_1969" data-name="Tracé 1969" d="M329.009,265.612l2.544,3.769,4.844-.978-5.4-8.077-1.047.689A3.319,3.319,0,0,0,329.009,265.612Z" transform="translate(1042.352 231.881)" fill="#ffbe9d"/>
    <path id="Tracé_1970" data-name="Tracé 1970" d="M327.941,189.985c-5.03-7.333-17.7-5.376-17.371,6.372,0,.034,0,.071.006.106a17.953,17.953,0,0,1-.37,4.408,3.574,3.574,0,0,1-2.932,2.756c-.707.157-1.469.2-2.255.353a7.286,7.286,0,0,0-2.26.866,6.907,6.907,0,0,0-3.067,3.733,9.139,9.139,0,0,0,2.163,9.126,7.451,7.451,0,0,0,2.039,1.424,9.455,9.455,0,0,0,2.308.645c1.463.319,2.941.742,4.451,1.039l.042-.13a46.094,46.094,0,0,0-4.235-1.824,10.068,10.068,0,0,1-2.022-.795,6.586,6.586,0,0,1-1.606-1.3,9.292,9.292,0,0,1-1.994-3.668,7.728,7.728,0,0,1-.082-4.179,5.866,5.866,0,0,1,2.482-3.293,6.416,6.416,0,0,1,1.956-.85c.7-.176,1.47-.249,2.246-.454a4.122,4.122,0,0,0,3.179-3.341,9.548,9.548,0,0,0,.182-1.638c.137,2.19-.053,4.414-2.305,5.255-1.3.486-2.564.486-3.77,1.291a6.572,6.572,0,0,0-2.58,3.308c-1.412,4.156,2.268,9.531,6.6,9.991,1.79.19,3.581.623,5.352.941.5.089,7.46,1.516,7.517,1.349l8.057-23.85Z" transform="translate(1048.186 246.8)" fill="#263238"/>
    <path id="Tracé_1971" data-name="Tracé 1971" d="M334.025,260.374l16.338-11.4-2.281-6.312L331.635,256.8Z" transform="translate(1041.717 235.411)" fill="#e8505b"/>
    <path id="Tracé_1972" data-name="Tracé 1972" d="M349.51,247.431a3.276,3.276,0,1,0,1.561-4.362A3.276,3.276,0,0,0,349.51,247.431Z" transform="translate(1038.208 235.393)" fill="#e8505b"/>
    <path id="Tracé_1973" data-name="Tracé 1973" d="M346.514,244.72l4.658-4.609-13.453-15.128a4.214,4.214,0,0,0-6.35-.486h0c-1.824,1.8-1.626,6.82.418,8.37Z" transform="translate(1042.021 239.285)" fill="#e8505b"/>
    <rect id="Rectangle_843" data-name="Rectangle 843" width="5.527" height="11.581" transform="translate(1371.276 463.562) rotate(-175.159)" fill="#ffbe9d"/>
    <path id="Tracé_1974" data-name="Tracé 1974" d="M290.063,230.9a3.277,3.277,0,1,0,3.488,3.05A3.276,3.276,0,0,0,290.063,230.9Z" transform="translate(1050.637 237.764)" fill="#e8505b"/>
    <path id="Tracé_1975" data-name="Tracé 1975" d="M288.249,228.922l3.318,5.9,20.285-5.9c2.486-.634,3.834-5.337,2.855-7.708h0a4.214,4.214,0,0,0-6.04-2.02Z" transform="translate(1050.388 240.219)" fill="#e8505b"/>
    <path id="Tracé_1976" data-name="Tracé 1976" d="M322.912,251.7l10.267-25.19a3.565,3.565,0,0,0-2.978-4.4l-14.737-3.341a3.565,3.565,0,0,0-4.043,3.449l-5.045,27.47Z" transform="translate(1046.766 240.193)" fill="#e8505b"/>
    <path id="Tracé_1977" data-name="Tracé 1977" d="M323.423,192.745c-1.7,2.152-4.762,3.059-5.482,5.032l-.154.911c0,.042,0,.083,0,.126l-.018-.029-.466,2.764a6.422,6.422,0,0,0,12.665,2.139l.525-3.111C330.132,197.411,324.348,197.167,323.423,192.745Z" transform="translate(1044.599 245.387)" fill="#ffbe9d"/>
    <path id="Tracé_1978" data-name="Tracé 1978" d="M332.315,204.268a1.491,1.491,0,1,0,1.719-1.222A1.49,1.49,0,0,0,332.315,204.268Z" transform="translate(1041.586 243.333)" fill="#ffbe9d"/>
    <path id="Tracé_1979" data-name="Tracé 1979" d="M312.583,258.3l7.386,18.235-7.058,85.193h-5.42L301.105,276l4.217-18.589Z" transform="translate(1047.819 232.462)" fill="#263238"/>
    <path id="Tracé_1980" data-name="Tracé 1980" d="M315.45,258.521v18.235L348.7,361.949h4.077L334.986,273.54l-10.26-13.889Z" transform="translate(1044.952 232.242)" fill="#263238"/>
    <path id="Tracé_1981" data-name="Tracé 1981" d="M312.315,392.23h-2.266v-4.448h2.938Z" transform="translate(1046.031 206.408)" fill="#ff746f"/>
    <path id="Tracé_1982" data-name="Tracé 1982" d="M308.307,392.082l1.327.582,1.232-.582,1.106,3.609H301.72l3.854-1.8Z" transform="translate(1047.696 205.549)" fill="#2a294f"/>
    <path id="Tracé_1983" data-name="Tracé 1983" d="M359.854,392.23h2.266l-1.343-4.448h-2.938Z" transform="translate(1036.48 206.408)" fill="#ff746f"/>
    <path id="Tracé_1984" data-name="Tracé 1984" d="M362.371,392.082l-1.327.582-1.232-.582-1.106,3.609h10.251l-3.854-1.8Z" transform="translate(1036.307 205.549)" fill="#2a294f"/>
    <path id="Tracé_1985" data-name="Tracé 1985" d="M316.534,234.78a4.652,4.652,0,1,1-4.652-4.653A4.652,4.652,0,0,1,316.534,234.78Z" transform="translate(1046.595 237.916)" fill="#e8505b"/>
    <path id="Tracé_1986" data-name="Tracé 1986" d="M318.264,218.929l.589,9.991,8.633-8.8Z" transform="translate(1044.39 240.154)" fill="#ffbe9d"/>
    <path id="Tracé_1987" data-name="Tracé 1987" d="M338.028,192.643a8.3,8.3,0,0,0-2.64-2.228c-1.623-.854-3.457-.761-4.945-2.044l1.162,11.725c2.136-.611,2.009,3.99-.458,2.718,0,0-4.891,2.093-6.748,6.672a17.742,17.742,0,0,0-1.151,8.715,5.392,5.392,0,0,0,7.257,4.5,9.706,9.706,0,0,0,5.054-4.087c4.28-6.468,7.132-17.09,3.471-24.388A9.354,9.354,0,0,0,338.028,192.643Z" transform="translate(1043.422 246.261)" fill="#263238"/>
    <path id="Rectangle_844" data-name="Rectangle 844" d="M3.467,0h.139a0,0,0,0,1,0,0V6.935a0,0,0,0,1,0,0H3.467A3.467,3.467,0,0,1,0,3.467v0A3.467,3.467,0,0,1,3.467,0Z" transform="translate(1341.539 441.053) rotate(-80.853)" fill="#ffbe9d"/>
    <path id="Tracé_1988" data-name="Tracé 1988" d="M324.314,204.332a9.115,9.115,0,0,0-3.216-.542.9.9,0,0,0-.376.981,1.55,1.55,0,0,0,.668.878,2.525,2.525,0,0,0,2.442.2,1.349,1.349,0,0,0,.7-.646A.715.715,0,0,0,324.314,204.332Z" transform="translate(1043.903 243.187)" fill="#fff"/>
    <line id="Ligne_100" data-name="Ligne 100" x2="387.366" transform="translate(1114.698 601.24)" fill="none" stroke="#2a294f" stroke-linecap="round" stroke-linejoin="round" stroke-width="0.78"/>
  </g>
</svg>
