{
  "routingKey": "groupeclients",
  "index": "groupeclient",
  "mappingProperties": {
    "id": {
      "type": "keyword"
    },
    "codeGroupe": {
      "type": "keyword"
    },
    "nomGroupe": {
      "type": "keyword"
    },
    "nomCommercial": {
      "type": "keyword"
    },
    "dateValiditeDebut": {
      "type": "date",
      "format": "date_optional_time||strict_date_optional_time"
    },
    "dateValiditeFin": {
      "type": "date",
      "format": "date_optional_time||strict_date_optional_time"
    },
    "dateCreation": {
      "type": "date",
      "format": "date_optional_time||strict_date_optional_time"
    },
    "dateModification": {
      "type": "date",
      "format": "date_optional_time||strict_date_optional_time"
    }
  },
  "instances": 1,
  "query": "query groupeClient($id: ID!) { groupeClient(id: $id) { id codeGroupe nomGroupe nomCommercial sortie dateValiditeDebut dateValiditeFin dateCreation dateModification } }",
  "dataKey": "groupeClient"
}
