149;1;819;2008-01-01;2012-12-31
150;2;2040;2008-01-01;2011-07-17
151;3;1966;2008-01-01;2013-08-01
152;4;594;2008-01-01;2100-12-31
153;5;594;2008-01-01;2100-12-31
154;6;594;2008-01-01;2100-12-31
155;7;819;2008-01-01;2012-12-31
156;8;2040;2008-01-01;2011-07-17
157;9;1079;2008-01-01;2017-06-30
158;10;1462;2008-01-01;2013-10-31
159;11;1483;2008-01-01;2014-08-31
160;12;8;2008-01-01;2014-08-31
161;13;594;2008-01-01;2100-12-31
162;14;2001;2008-01-01;2100-12-31
163;15;1966;2008-01-01;2018-04-30
164;16;314;2008-01-01;2011-09-26
165;17;314;2008-01-01;2011-09-26
166;18;621;2008-01-01;2100-12-31
167;19;1966;2008-01-01;2018-04-30
168;20;594;2008-01-01;2100-12-31
169;21;1462;2008-01-01;2018-08-31
170;22;1527;2008-01-01;2011-09-30
171;23;1966;2008-01-01;2018-04-30
172;24;84;2008-01-01;2011-09-26
173;25;1462;2008-01-01;2018-08-31
174;26;819;2008-01-01;2012-12-31
175;27;2001;2008-01-01;2100-12-31
176;28;621;2008-01-01;2100-12-31
177;29;1527;2008-01-01;2011-09-30
178;30;1483;2008-01-01;2019-09-30
179;31;1079;2008-01-01;2017-06-30
180;32;1079;2008-01-01;2017-06-30
181;33;84;2008-01-01;2011-09-26
182;34;1483;2008-01-01;2014-08-31
183;35;1527;2008-01-01;2011-09-30
184;36;621;2008-01-01;2100-12-31
185;37;621;2008-01-01;2100-12-31
186;38;819;2008-01-01;2012-12-31
187;39;1462;2008-01-01;2018-08-31
188;40;84;2008-01-01;2011-09-26
189;41;621;2008-01-01;2100-12-31
190;42;819;2008-01-01;2012-12-31
191;43;1966;2008-01-01;2013-08-01
192;44;1527;2008-01-01;2011-09-30
193;45;621;2008-01-01;2100-12-31
194;46;1079;2008-01-01;2017-06-30
195;47;84;2008-01-01;2011-09-26
196;48;943;2008-01-01;2011-02-28
197;49;621;2008-01-01;2100-12-31
198;50;2001;2008-01-01;2100-12-31
199;51;2040;2008-01-01;2011-07-17
200;52;1462;2008-01-01;2013-10-31
201;53;1527;2008-01-01;2011-09-30
202;54;341;2008-01-01;2018-04-30
203;55;341;2008-01-01;2018-04-30
204;56;1527;2008-01-01;2011-09-30
205;57;341;2008-01-01;2018-04-30
206;58;1462;2008-01-01;2018-08-31
207;59;2040;2008-01-01;2011-07-17
208;60;2040;2008-01-01;2014-08-31
209;61;2001;2008-01-01;2100-12-31
210;62;2040;2008-01-01;2011-07-17
211;63;1966;2008-01-01;2013-08-01
212;64;84;2008-01-01;2011-09-26
213;65;84;2008-01-01;2011-09-26
214;66;1483;2008-01-01;2014-08-31
215;67;341;2008-01-01;2018-04-30
216;68;341;2008-01-01;2018-04-30
217;69;819;2008-01-01;2012-12-31
218;70;1462;2008-01-01;2018-08-31
219;71;1462;2008-01-01;2018-08-31
220;72;621;2008-01-01;2100-12-31
221;73;819;2008-01-01;2012-12-31
222;74;819;2008-01-01;2012-12-31
223;76;2001;2008-01-01;2100-12-31
224;77;1895;2008-01-01;2011-05-31
225;78;585;2008-01-01;2014-08-31
226;79;1527;2008-01-01;2011-09-26
227;80;2040;2008-01-01;2011-07-17
228;81;1079;2008-01-01;2017-06-30
229;82;1079;2008-01-01;2017-06-30
230;83;594;2008-01-01;2100-12-31
231;84;594;2008-01-01;2100-12-31
232;85;1527;2008-01-01;2011-09-30
233;86;621;2008-01-01;2011-09-26
234;87;314;2008-01-01;2011-09-26
235;88;341;2008-01-01;2018-04-30
236;89;1462;2008-01-01;2018-08-31
237;90;341;2008-01-01;2018-04-30
238;91;1895;2008-01-01;2011-05-31
239;92;585;2008-01-01;2014-08-31
240;93;585;2008-01-01;2014-08-31
241;94;1895;2008-01-01;2011-05-31
242;95;585;2008-01-01;2014-08-31
243;97;594;2008-01-01;2100-12-31
244;98;1895;2008-01-01;2011-05-31
245;99;1895;2008-01-01;2011-05-31
246;16;907;2011-09-27;2012-09-30
247;17;907;2011-09-27;2012-09-30
248;79;1527;2011-09-27;2012-09-30
249;86;621;2011-09-27;2012-09-30
250;87;907;2011-09-27;2012-09-30
251;24;23;2011-09-27;2100-12-31
252;33;23;2011-09-27;2100-12-31
253;40;23;2011-09-27;2100-12-31
254;47;23;2011-09-27;2100-12-31
255;64;23;2011-09-27;2100-12-31
256;65;23;2011-09-27;2100-12-31
257;22;1527;2011-10-01;2014-08-31
258;35;1527;2011-10-01;2014-08-31
259;29;1527;2011-10-01;2014-08-31
260;53;1527;2011-10-01;2014-08-31
261;44;1527;2011-10-01;2014-08-31
262;56;1527;2011-10-01;2014-08-31
263;85;1527;2011-10-01;2014-08-31
264;48;1079;2011-03-01;2017-06-30
265;98;1895;2011-06-01;2019-09-30
266;99;1895;2011-06-01;2019-09-30
267;77;1895;2011-06-01;2019-09-30
268;91;1895;2011-06-01;2019-09-30
269;94;1895;2011-06-01;2019-09-30
270;2;2040;2011-07-18;2017-08-31
271;8;2040;2011-07-18;2017-08-31
272;51;2040;2011-07-18;2017-08-31
273;59;2040;2011-07-18;2017-08-31
274;62;2040;2011-07-18;2017-08-31
275;80;2040;2011-07-18;2017-08-31
276;79;1527;2012-10-01;2014-08-31
277;86;621;2012-10-01;2100-12-31
278;16;23;2012-10-01;2100-12-31
279;17;23;2012-10-01;2100-12-31
280;87;23;2012-10-01;2100-12-31
281;1;819;2013-01-01;2100-12-31
282;7;819;2013-01-01;2100-12-31
283;26;819;2013-01-01;2100-12-31
284;38;819;2013-01-01;2100-12-31
285;42;819;2013-01-01;2100-12-31
286;69;819;2013-01-01;2100-12-31
287;73;819;2013-01-01;2100-12-31
288;74;819;2013-01-01;2100-12-31
289;3;1966;2013-09-01;2018-04-30
290;43;1966;2013-09-01;2018-04-30
291;63;1966;2013-09-01;2018-04-30
292;10;1462;2013-11-01;2018-08-31
293;52;1462;2013-11-01;2018-08-31
294;60;2040;2014-09-01;2017-08-31
295;78;585;2014-09-01;2100-12-31
296;92;585;2014-09-01;2100-12-31
297;93;585;2014-09-01;2100-12-31
298;95;585;2014-09-01;2100-12-31
299;22;1527;2014-09-01;2100-12-31
300;35;1527;2014-09-01;2100-12-31
301;29;1527;2014-09-01;2100-12-31
302;53;1527;2014-09-01;2100-12-31
303;44;1527;2014-09-01;2100-12-31
304;56;1527;2014-09-01;2100-12-31
305;85;1527;2014-09-01;2100-12-31
306;79;1527;2014-09-01;2100-12-31
307;11;1483;2014-09-01;2019-09-30
308;12;1079;2014-09-01;2017-06-30
309;34;1483;2014-09-01;2019-09-30
310;66;1483;2014-09-01;2019-09-30
311;9;1300;2017-07-01;2017-08-28
312;31;1300;2017-07-01;2017-08-28
313;32;1300;2017-07-01;2017-08-28
314;46;1300;2017-07-01;2017-08-28
315;81;1300;2017-07-01;2017-08-28
316;82;1300;2017-07-01;2017-08-28
317;48;1300;2017-07-01;2017-08-28
318;12;1300;2017-07-01;2017-08-28
319;9;2132;2017-08-29;2100-12-31
320;31;2132;2017-08-29;2100-12-31
321;32;2132;2017-08-29;2100-12-31
322;46;2132;2017-08-29;2100-12-31
323;81;2132;2017-08-29;2100-12-31
324;82;2132;2017-08-29;2100-12-31
325;48;2132;2017-08-29;2100-12-31
326;12;2132;2017-08-29;2100-12-31
327;2;1300;2017-09-01;2018-04-30
328;8;1300;2017-09-01;2018-04-30
329;51;1300;2017-09-01;2018-04-30
330;59;1300;2017-09-01;2018-04-30
331;62;1300;2017-09-01;2018-04-30
332;80;1300;2017-09-01;2018-04-30
333;60;1300;2017-09-01;2018-04-30
334;3;2585;2018-05-01;2100-12-31
335;15;2585;2018-05-01;2100-12-31
336;19;2585;2018-05-01;2100-12-31
337;23;2585;2018-05-01;2100-12-31
338;43;2585;2018-05-01;2100-12-31
339;63;2585;2018-05-01;2100-12-31
340;54;930;2018-05-01;2100-12-31
341;55;930;2018-05-01;2100-12-31
342;57;930;2018-05-01;2100-12-31
343;67;930;2018-05-01;2100-12-31
344;68;930;2018-05-01;2100-12-31
345;88;930;2018-05-01;2100-12-31
346;90;930;2018-05-01;2100-12-31
354;2;1504;2018-05-01;2100-12-31
355;8;1504;2018-05-01;2100-12-31
356;51;1504;2018-05-01;2100-12-31
357;59;1504;2018-05-01;2100-12-31
358;60;1504;2018-05-01;2100-12-31
359;62;1504;2018-05-01;2100-12-31
360;80;1504;2018-05-01;2100-12-31
361;10;2610;2018-09-01;2019-09-30
362;21;2610;2018-09-01;2019-09-30
363;25;2610;2018-09-01;2019-09-30
364;39;2610;2018-09-01;2019-09-30
365;52;2610;2018-09-01;2019-09-30
366;58;2610;2018-09-01;2019-09-30
367;70;2610;2018-09-01;2019-09-30
368;71;2610;2018-09-01;2019-09-30
369;89;2610;2018-09-01;2019-09-30
388;11;1521;2019-10-01;2100-12-31
389;30;1521;2019-10-01;2100-12-31
390;34;1521;2019-10-01;2100-12-31
391;66;1521;2019-10-01;2100-12-31
392;10;1706;2019-10-01;2100-12-31
393;21;1706;2019-10-01;2100-12-31
394;25;1706;2019-10-01;2100-12-31
395;39;1706;2019-10-01;2100-12-31
396;52;1706;2019-10-01;2100-12-31
397;58;1706;2019-10-01;2100-12-31
398;70;1706;2019-10-01;2100-12-31
399;71;1706;2019-10-01;2100-12-31
400;89;1706;2019-10-01;2100-12-31
401;77;585;2019-10-01;2100-12-31
402;91;585;2019-10-01;2100-12-31
403;94;585;2019-10-01;2100-12-31
404;98;585;2019-10-01;2100-12-31
405;99;585;2019-10-01;2100-12-31
