<svg id="Affiches" xmlns="http://www.w3.org/2000/svg" width="251.704" height="200.622" viewBox="0 0 251.704 200.622">
  <g id="freepik--Floor--inject-31" transform="translate(0 69.123)">
    <path id="Tracé_4444" data-name="Tracé 4444" d="M69.265,300.751c49.147,25.675,128.836,25.675,177.983,0s49.147-67.3,0-92.984-128.814-25.675-177.983,0S20.141,275.076,69.265,300.751Z" transform="translate(-32.405 -188.509)" fill="#f5f5f5"/>
  </g>
  <g id="freepik--filing-cabinets--inject-31" transform="translate(7.184 46.354)">
    <path id="Tracé_4445" data-name="Tracé 4445" d="M61.166,279.419,45.19,270.2V235.93l15.976,9.227Z" transform="translate(-45.19 -186.513)" fill="#e0e0e0"/>
    <path id="Tracé_4446" data-name="Tracé 4446" d="M73.62,242.077,96.446,228.9v34.261L73.62,276.339Z" transform="translate(-57.644 -183.433)" fill="#ebebeb"/>
    <path id="Tracé_4447" data-name="Tracé 4447" d="M83.992,221.707,61.166,234.885,45.19,225.657,68.016,212.48Z" transform="translate(-45.19 -176.24)" fill="#f5f5f5"/>
    <path id="Tracé_4448" data-name="Tracé 4448" d="M77.686,246.472,95.943,235.93l.421.242v12.694L78.1,259.408l-.421-.242Z" transform="translate(-59.423 -186.513)" fill="#e0e0e0"/>
    <path id="Tracé_4449" data-name="Tracé 4449" d="M78.43,246.908,96.693,236.36v12.694L78.43,259.6Z" transform="translate(-59.751 -186.701)" fill="#f5f5f5"/>
    <path id="Tracé_4450" data-name="Tracé 4450" d="M90.6,250.1l3.108-1.793c.4-.236.725-.129.725.236a1.455,1.455,0,0,1-.725,1.079L90.6,251.42c-.4.236-.731.129-.731-.236A1.45,1.45,0,0,1,90.6,250.1Z" transform="translate(-64.763 -191.882)" fill="#e0e0e0"/>
    <path id="Tracé_4451" data-name="Tracé 4451" d="M76.94,275.052,95.2,264.51V277.2l.421.242L77.356,287.988l-.416-.242Z" transform="translate(-59.098 -199.033)" fill="#e0e0e0"/>
    <path id="Tracé_4452" data-name="Tracé 4452" d="M77.68,275.482,95.943,264.94v12.694L77.68,288.176Z" transform="translate(-59.423 -199.221)" fill="#f5f5f5"/>
    <path id="Tracé_4453" data-name="Tracé 4453" d="M89.872,278.689l3.136-1.787c.4-.236.731-.129.731.236a1.45,1.45,0,0,1-.731,1.079L89.9,280.01c-.4.236-.731.129-.731-.236A1.45,1.45,0,0,1,89.872,278.689Z" transform="translate(-64.456 -204.406)" fill="#e0e0e0"/>
    <path id="Tracé_4454" data-name="Tracé 4454" d="M61.166,214.929,45.19,205.7V171.44l15.976,9.221Z" transform="translate(-45.19 -158.262)" fill="#e0e0e0"/>
    <path id="Tracé_4455" data-name="Tracé 4455" d="M73.62,177.577,96.446,164.4v34.267L73.62,211.845Z" transform="translate(-57.644 -155.179)" fill="#ebebeb"/>
    <path id="Tracé_4456" data-name="Tracé 4456" d="M83.992,157.211,61.166,170.389,45.19,161.167,68.016,147.99Z" transform="translate(-45.19 -147.99)" fill="#f5f5f5"/>
    <path id="Tracé_4457" data-name="Tracé 4457" d="M77.68,181.982,95.943,171.44l.421.242v12.694L78.1,194.918l-.421-.247Z" transform="translate(-59.423 -158.262)" fill="#e0e0e0"/>
    <path id="Tracé_4458" data-name="Tracé 4458" d="M90.6,185.608l3.1-1.793c.4-.23.731-.124.731.242a1.461,1.461,0,0,1-.731,1.079l-3.1,1.793c-.4.23-.731.129-.731-.236a1.467,1.467,0,0,1,.731-1.085Z" transform="translate(-64.763 -163.63)" fill="#e0e0e0"/>
    <path id="Tracé_4459" data-name="Tracé 4459" d="M76.94,210.562,95.2,200.02v12.689l.421.242L77.356,223.492l-.416-.242Z" transform="translate(-59.098 -170.782)" fill="#e0e0e0"/>
    <path id="Tracé_4460" data-name="Tracé 4460" d="M77.68,210.992,95.943,200.45v12.689L77.68,223.681Z" transform="translate(-59.423 -170.971)" fill="#f5f5f5"/>
    <path id="Tracé_4461" data-name="Tracé 4461" d="M89.851,214.188l3.136-1.793c.4-.23.731-.124.731.242a1.484,1.484,0,0,1-.731,1.079l-3.136,1.776c-.4.23-.731.124-.731-.236a1.467,1.467,0,0,1,.731-1.068Z" transform="translate(-64.434 -176.15)" fill="#e0e0e0"/>
    <path id="Tracé_4462" data-name="Tracé 4462" d="M77.68,181.982,95.943,171.44v12.689L77.68,194.671Z" transform="translate(-59.423 -158.262)" fill="#e0e0e0"/>
    <path id="Tracé_4463" data-name="Tracé 4463" d="M118.637,178.1l-10-5.771v11.183l10,5.765Z" transform="translate(-72.985 -158.652)" fill="#e0e0e0"/>
    <path id="Tracé_4464" data-name="Tracé 4464" d="M89.87,197.505V181.686l3.917-2.27.646.955,11.413-6.592v14.5Z" transform="translate(-64.763 -159.288)" fill="#ebebeb"/>
    <path id="Tracé_4465" data-name="Tracé 4465" d="M89.87,198.022l1.141-13.841,15.976-9.221-1.141,13.835Z" transform="translate(-64.763 -159.804)" fill="#f5f5f5"/>
    <path id="Tracé_4466" data-name="Tracé 4466" d="M87.14,197.439l-8.71-5.029v11.183l8.71,5.024Z" transform="translate(-59.751 -167.449)" fill="#ebebeb"/>
    <path id="Tracé_4467" data-name="Tracé 4467" d="M93.93,191.362l18.263-10.542v12.689L93.93,204.051Z" transform="translate(-66.541 -162.372)" fill="#f5f5f5"/>
    <path id="Tracé_4468" data-name="Tracé 4468" d="M106.1,194.558l3.1-1.793c.4-.23.731-.124.731.242a1.467,1.467,0,0,1-.731,1.079l-3.1,1.793c-.4.23-.731.124-.731-.236A1.467,1.467,0,0,1,106.1,194.558Z" transform="translate(-71.552 -167.551)" fill="#e0e0e0"/>
    <path id="Tracé_4469" data-name="Tracé 4469" d="M93.457,199.308l-.607-.348v12.689l.607.348Z" transform="translate(-66.068 -170.318)" fill="#e0e0e0"/>
    <path id="Tracé_4470" data-name="Tracé 4470" d="M92.85,190.738l18.257-10.548.613.354L93.457,191.086Z" transform="translate(-66.068 -162.096)" fill="#ebebeb"/>
    <path id="Tracé_4471" data-name="Tracé 4471" d="M397.042,242.479l-15.982-9.227V198.99l15.982,9.221Z" transform="translate(-192.321 -170.331)" fill="#e0e0e0"/>
    <path id="Tracé_4472" data-name="Tracé 4472" d="M409.5,205.127l22.826-13.177v34.267L409.5,239.395Z" transform="translate(-204.78 -167.247)" fill="#ebebeb"/>
    <path id="Tracé_4473" data-name="Tracé 4473" d="M419.868,184.757l-22.826,13.178-15.982-9.221,22.832-13.183Z" transform="translate(-192.321 -160.054)" fill="#f5f5f5"/>
    <path id="Tracé_4474" data-name="Tracé 4474" d="M413.56,209.532l18.263-10.542.421.242-.006,12.689-18.257,10.542-.421-.242Z" transform="translate(-206.558 -170.331)" fill="#e0e0e0"/>
    <path id="Tracé_4475" data-name="Tracé 4475" d="M414.31,209.962l18.263-10.542-.006,12.689L414.31,222.651Z" transform="translate(-206.887 -170.519)" fill="#f5f5f5"/>
    <path id="Tracé_4476" data-name="Tracé 4476" d="M426.48,213.158l3.1-1.793c.4-.23.731-.124.731.236a1.467,1.467,0,0,1-.731,1.085l-3.1,1.793c-.4.23-.73.124-.73-.236a1.467,1.467,0,0,1,.731-1.085Z" transform="translate(-211.898 -175.699)" fill="#e0e0e0"/>
    <path id="Tracé_4477" data-name="Tracé 4477" d="M412.81,238.108l18.263-10.548v12.694l.421.242-18.263,10.542-.421-.242Z" transform="translate(-206.229 -182.846)" fill="#e0e0e0"/>
    <path id="Tracé_4478" data-name="Tracé 4478" d="M413.56,238.542,431.823,228v12.689L413.56,251.231Z" transform="translate(-206.558 -183.039)" fill="#f5f5f5"/>
    <path id="Tracé_4479" data-name="Tracé 4479" d="M425.73,241.738l3.108-1.793c.4-.23.725-.124.725.236a1.478,1.478,0,0,1-.725,1.085l-3.108,1.793c-.4.23-.73.124-.73-.242a1.467,1.467,0,0,1,.731-1.079Z" transform="translate(-211.569 -188.219)" fill="#e0e0e0"/>
  </g>
  <g id="freepik--Plants--inject-31" transform="translate(40.464 116.653)">
    <path id="Tracé_4480" data-name="Tracé 4480" d="M129.6,318.132s.062-8.912-5.558-15.594c-4.973-5.917-7.62-9.671-6.052-11.4s4.939-2.147,9.486,2.641,4.9,18.05,4.271,21.05Z" transform="translate(-110.162 -280.47)" fill="#e34168"/>
    <path id="Tracé_4481" data-name="Tracé 4481" d="M129.6,318.132s.062-8.912-5.558-15.594c-4.973-5.917-7.62-9.671-6.052-11.4s4.939-2.147,9.486,2.641,4.9,18.05,4.271,21.05Z" transform="translate(-110.162 -280.47)" opacity="0.2"/>
    <path id="Tracé_4482" data-name="Tracé 4482" d="M132.7,309.636a.281.281,0,0,1-.275-.219,27.988,27.988,0,0,0-9.851-16.5.281.281,0,0,1-.051-.393.287.287,0,0,1,.4-.051A28.535,28.535,0,0,1,132.977,309.3a.275.275,0,0,1-.214.332Z" transform="translate(-112.321 -281.555)" fill="#fff"/>
    <path id="Tracé_4483" data-name="Tracé 4483" d="M123.635,329.922l-2.287,1.321a4.136,4.136,0,0,0-3.079-2.635c-2.5-.562-5.1-.466-6.85-2.635s.382-4.529,0-6.125-.629-2.057-3.765-3.653-4.372-4.243-2.012-6.035,6.181-.478,8.5,1.124a13.121,13.121,0,0,0,6.311,2.062c2.3.287,6.041,1.562,5.468,6.9A42.068,42.068,0,0,1,123.635,329.922Z" transform="translate(-104.411 -288.95)" fill="#e34168"/>
    <path id="Tracé_4484" data-name="Tracé 4484" d="M122.78,332.536a.282.282,0,0,1-.084-.551c.2-.062,5.057-1.6,7.12.051a.281.281,0,0,1-.348.438c-1.821-1.461-6.552.034-6.6.051Z" transform="translate(-112.335 -298.578)" fill="#fff"/>
    <path id="Tracé_4485" data-name="Tracé 4485" d="M126.513,330.977a.275.275,0,0,1-.275-.247c-1.253-11.834-15.51-17.448-15.65-17.5a.281.281,0,0,1-.163-.365.287.287,0,0,1,.36-.163c.152.062,14.723,5.794,16.01,17.982a.281.281,0,0,1-.247.309Z" transform="translate(-107.037 -290.433)" fill="#fff"/>
    <path id="Tracé_4486" data-name="Tracé 4486" d="M376.814,306.289c.062-.2,2.473-12.6,0-21.4-2.248-8.069-5.181-11.048-9.362-11.705s-6,2.355-3.776,6.434,7.564,9.491,8.873,18.606c.562,3.754.989,7.013.989,7.013Z" transform="translate(-217.567 -273.089)" fill="#e34168"/>
    <path id="Tracé_4487" data-name="Tracé 4487" d="M376.814,306.289c.062-.2,2.473-12.6,0-21.4-2.248-8.069-5.181-11.048-9.362-11.705s-6,2.355-3.776,6.434,7.564,9.491,8.873,18.606c.562,3.754.989,7.013.989,7.013Z" transform="translate(-217.567 -273.089)" opacity="0.2"/>
    <path id="Tracé_4488" data-name="Tracé 4488" d="M378.29,300.611h0a.281.281,0,0,1-.264-.3c.562-10.047-2.72-19.016-8.6-23.416a.281.281,0,0,1-.056-.393.287.287,0,0,1,.393-.056c6.03,4.5,9.413,13.666,8.822,23.9A.281.281,0,0,1,378.29,300.611Z" transform="translate(-220.453 -274.537)" fill="#fff"/>
    <path id="Tracé_4489" data-name="Tracé 4489" d="M392.349,316.92c-.32-2.31,1.006-5.771,4.158-6.592s4.557-2.63,3.422-4.608-.871-3.793,1.989-4.614,5.367-2.248,3.72-5.271c-1.2-2.186-1.461-3.6,1.472-7.907,2.433-3.574.444-5.67-2.6-5.277s-4.928,4.024-6.833,4.63-2.343-2.63-4.855-1.18-2.36,5.164-2.439,7.755-.247,3.175-2.518,2.86-4.5.056-4.445,5.546c.039,4.709,2.551,10.542,2.551,10.542Z" transform="translate(-226.633 -277.258)" fill="#e34168"/>
    <path id="Tracé_4490" data-name="Tracé 4490" d="M392,314.9h-.028a.287.287,0,0,1-.253-.315c1.585-14.155,13.734-26.1,16.9-28.518a.283.283,0,0,1,.343.45c-3.13,2.388-15.122,14.172-16.684,28.131a.287.287,0,0,1-.281.253Z" transform="translate(-230.269 -278.748)" fill="#fff"/>
    <path id="Tracé_4491" data-name="Tracé 4491" d="M401.862,309.229a.287.287,0,0,1-.264-.18.292.292,0,0,1,.169-.365,22.006,22.006,0,0,1,9.885-.854.281.281,0,0,1,.23.32.292.292,0,0,1-.32.236,21.935,21.935,0,0,0-9.6.826A.32.32,0,0,1,401.862,309.229Z" transform="translate(-234.59 -288.212)" fill="#fff"/>
    <path id="Tracé_4492" data-name="Tracé 4492" d="M391.849,319.315a.281.281,0,0,1-.208-.1,16.566,16.566,0,0,1-3.7-7.682.281.281,0,1,1,.556-.084,16.24,16.24,0,0,0,3.568,7.389.287.287,0,0,1-.214.472Z" transform="translate(-228.611 -289.79)" fill="#fff"/>
  </g>
  <g id="freepik--folder-2--inject-31" transform="translate(59.688 27.164)">
    <path id="Tracé_4493" data-name="Tracé 4493" d="M138.62,157.329v86.977l89.023-51.4-.006-79.071-66.191,38.218-2.287-6.592Z" transform="translate(-138.62 -113.84)" fill="#e34168"/>
    <path id="Tracé_4494" data-name="Tracé 4494" d="M138.62,157.329v86.977l89.023-51.4-.006-79.071-66.191,38.218-2.287-6.592Z" transform="translate(-138.62 -113.84)" opacity="0.7"/>
    <path id="Tracé_4495" data-name="Tracé 4495" d="M138.62,244.306l4.563-79.071,89.023-51.4-4.563,79.071Z" transform="translate(-138.62 -113.84)" fill="#e0e0e0"/>
    <path id="Tracé_4496" data-name="Tracé 4496" d="M138.62,245.331l6.844-77.75,89.023-51.4-6.844,77.756Z" transform="translate(-138.62 -114.865)" fill="#e34168"/>
    <path id="Tracé_4497" data-name="Tracé 4497" d="M138.62,245.331l6.844-77.75,89.023-51.4-6.844,77.756Z" transform="translate(-138.62 -114.865)" opacity="0.7"/>
  </g>
  <g id="freepik--folder-1--inject-31" transform="translate(73.382 35.071)">
    <path id="Tracé_4498" data-name="Tracé 4498" d="M162.99,171.4v86.983l89.023-51.4V127.91l-66.2,38.218-2.281-6.592Z" transform="translate(-162.99 -127.91)" fill="#e34168"/>
    <path id="Tracé_4499" data-name="Tracé 4499" d="M162.99,171.4v86.983l89.023-51.4V127.91l-66.2,38.218-2.281-6.592Z" transform="translate(-162.99 -127.91)" opacity="0.5"/>
    <path id="Tracé_4500" data-name="Tracé 4500" d="M162.99,258.381l4.563-79.076,89.023-51.4-4.563,79.071Z" transform="translate(-162.99 -127.91)" fill="#e0e0e0"/>
    <path id="Tracé_4501" data-name="Tracé 4501" d="M162.99,259.406l6.844-77.756,89.023-51.4-6.844,77.756Z" transform="translate(-162.99 -128.935)" fill="#e34168"/>
    <path id="Tracé_4502" data-name="Tracé 4502" d="M162.99,259.406l6.844-77.756,89.023-51.4-6.844,77.756Z" transform="translate(-162.99 -128.935)" opacity="0.5"/>
  </g>
  <g id="freepik--Documents--inject-31" transform="translate(89.357)">
    <path id="Tracé_4503" data-name="Tracé 4503" d="M267.711,375.9c-15.982-9.227-30.806-19.258-37.571-31.025L250.707,333Z" transform="translate(-208.382 -182.681)" fill="#e0e0e0"/>
    <path id="Tracé_4504" data-name="Tracé 4504" d="M191.42,187.819V274.8l89.023-51.4V144.33l-66.2,38.218-2.281-6.592Z" transform="translate(-191.42 -100.032)" fill="#e34168"/>
    <path id="Tracé_4505" data-name="Tracé 4505" d="M191.42,187.819V274.8l89.023-51.4V144.33l-66.2,38.218-2.281-6.592Z" transform="translate(-191.42 -100.032)" opacity="0.2"/>
    <path id="Tracé_4506" data-name="Tracé 4506" d="M236.858,179.233c-.225,0-.259-.258-.259-.41V104.647a1.866,1.866,0,0,1,.832-1.439L301.684,66.12a.6.6,0,0,1,.292-.09c.225,0,.259.258.259.41v74.176a1.872,1.872,0,0,1-.832,1.444l-64.252,37.088A.612.612,0,0,1,236.858,179.233Z" transform="translate(-211.212 -65.732)" fill="#fff"/>
    <path id="Tracé_4507" data-name="Tracé 4507" d="M301.728,66.056a.562.562,0,0,1,0,.124v74.176a1.613,1.613,0,0,1-.691,1.2l-64.252,37.088-.112.051a.342.342,0,0,1,0-.124V104.4a1.613,1.613,0,0,1,.691-1.2l64.252-37.088a.315.315,0,0,1,.118-.051m.034-.562a.876.876,0,0,0-.433.129l-64.252,37.088a2.163,2.163,0,0,0-.972,1.686v74.176c0,.438.219.691.562.691a.865.865,0,0,0,.433-.129l64.252-37.088a2.141,2.141,0,0,0,.972-1.686V66.191c0-.438-.219-.7-.562-.691Z" transform="translate(-210.997 -65.5)" fill="#e34168"/>
    <path id="Tracé_4508" data-name="Tracé 4508" d="M301.728,66.056a.562.562,0,0,1,0,.124v74.176a1.613,1.613,0,0,1-.691,1.2l-64.252,37.088-.112.051a.342.342,0,0,1,0-.124V104.4a1.613,1.613,0,0,1,.691-1.2l64.252-37.088a.315.315,0,0,1,.118-.051m.034-.562a.876.876,0,0,0-.433.129l-64.252,37.088a2.163,2.163,0,0,0-.972,1.686v74.176c0,.438.219.691.562.691a.865.865,0,0,0,.433-.129l64.252-37.088a2.141,2.141,0,0,0,.972-1.686V66.191c0-.438-.219-.7-.562-.691Z" transform="translate(-210.997 -65.5)" fill="#fff" opacity="0.7"/>
    <path id="Tracé_4509" data-name="Tracé 4509" d="M248.29,129.487l22.826-13.177v26.355L248.29,155.842Z" transform="translate(-216.332 -87.758)" fill="#e34168"/>
    <path id="Tracé_4510" data-name="Tracé 4510" d="M248.29,129.487l22.826-13.177v26.355L248.29,155.842Z" transform="translate(-216.332 -87.758)" fill="#fff" opacity="0.8"/>
    <path id="Tracé_4513" data-name="Tracé 4513" d="M297,102.115c0,.731.657.938,1.461.478l22.208-12.84a2.933,2.933,0,0,0,1.461-2.163c0-.725-.657-.938-1.461-.472L298.478,99.93A2.922,2.922,0,0,0,297,102.115Z" transform="translate(-237.67 -74.861)" fill="#455a64"/>
    <path id="Tracé_4514" data-name="Tracé 4514" d="M297,116.137c0,.731.657.944,1.461.478L320.652,103.8a2.934,2.934,0,0,0,1.461-2.163c0-.725-.658-.938-1.461-.472l-22.191,12.812A2.933,2.933,0,0,0,297,116.137Z" transform="translate(-237.67 -81.016)" fill="#455a64"/>
    <path id="Tracé_4515" data-name="Tracé 4515" d="M297,130.238c0,.731.657.944,1.461.478L320.652,117.9a2.933,2.933,0,0,0,1.461-2.158c0-.731-.657-.944-1.461-.478L298.461,128.08A2.933,2.933,0,0,0,297,130.238Z" transform="translate(-237.67 -87.193)" fill="#455a64"/>
    <path id="Tracé_4516" data-name="Tracé 4516" d="M297,144.308c0,.731.657.944,1.461.478l22.191-12.812a2.933,2.933,0,0,0,1.461-2.158c0-.731-.657-.944-1.461-.478L298.461,142.15A2.933,2.933,0,0,0,297,144.308Z" transform="translate(-237.67 -93.356)" fill="#455a64"/>
    <path id="Tracé_4517" data-name="Tracé 4517" d="M248.29,174.176c0,.731.652.944,1.461.478l49.58-28.659a2.922,2.922,0,0,0,1.461-2.158c0-.731-.658-.938-1.461-.478l-49.58,28.659A2.916,2.916,0,0,0,248.29,174.176Z" transform="translate(-216.332 -99.5)" fill="#455a64"/>
    <path id="Tracé_4518" data-name="Tracé 4518" d="M248.29,188.27c0,.731.652.944,1.461.478l49.58-28.625a2.933,2.933,0,0,0,1.461-2.163c0-.725-.658-.938-1.461-.472l-49.58,28.625A2.917,2.917,0,0,0,248.29,188.27Z" transform="translate(-216.332 -105.688)" fill="#455a64"/>
    <path id="Tracé_4519" data-name="Tracé 4519" d="M248.29,202.346c0,.725.652.938,1.461.472l49.58-28.625a2.933,2.933,0,0,0,1.461-2.163c0-.725-.658-.938-1.461-.472l-49.58,28.625A2.917,2.917,0,0,0,248.29,202.346Z" transform="translate(-216.332 -111.851)" fill="#455a64"/>
    <path id="Tracé_4520" data-name="Tracé 4520" d="M191.42,281.984,207.4,212.141l89.023-51.4-15.976,69.849Z" transform="translate(-191.42 -107.221)" fill="#e34168"/>
    <path id="Tracé_4521" data-name="Tracé 4521" d="M230.18,252.7V304.5l20.545-11.863v-51.8Z" transform="translate(-208.399 -142.309)" fill="#e34168"/>
    <path id="Tracé_4522" data-name="Tracé 4522" d="M230.18,252.7V304.5l20.545-11.863v-51.8Z" transform="translate(-208.399 -142.309)" opacity="0.2"/>
    <path id="Tracé_4523" data-name="Tracé 4523" d="M268.8,315.876c-1.748-1.3-18.595-14.178-27.159-32.593-9.115-19.578-9.1-42.415-9.1-51.007v-.27l61.072-35.256c0,8.671,0,31.542,9.154,51.187,8.367,17.982,24.568,30.693,27.136,32.637Z" transform="translate(-209.433 -122.995)" fill="#fff"/>
    <path id="Tracé_4524" data-name="Tracé 4524" d="M293.094,196.883c0,9.036.174,31.469,9.182,50.822,8.086,17.364,23.461,29.85,26.883,32.486l-60.577,34.975c-2.366-1.781-18.578-14.442-26.917-32.351-9.1-19.522-9.1-42.314-9.1-50.895v-.107l60.51-34.936m.562-.972L232,231.493c0,8.086-.169,31.581,9.132,51.558,9.154,19.606,27.395,32.789,27.395,32.789l61.65-35.593s-18.263-13.183-27.389-32.789c-9.306-19.977-9.132-43.472-9.132-51.558Z" transform="translate(-209.196 -122.623)" fill="#e34168"/>
    <path id="Tracé_4525" data-name="Tracé 4525" d="M293.094,196.883c0,9.036.174,31.469,9.182,50.822,8.086,17.364,23.461,29.85,26.883,32.486l-60.577,34.975c-2.366-1.781-18.578-14.442-26.917-32.351-9.1-19.522-9.1-42.314-9.1-50.895v-.107l60.51-34.936m.562-.972L232,231.493c0,8.086-.169,31.581,9.132,51.558,9.154,19.606,27.395,32.789,27.395,32.789l61.65-35.593s-18.263-13.183-27.389-32.789c-9.306-19.977-9.132-43.472-9.132-51.558Z" transform="translate(-209.196 -122.623)" fill="#fff" opacity="0.7"/>
    <path id="Tracé_4526" data-name="Tracé 4526" d="M313.014,216.955l-19.488,11.239a2.765,2.765,0,0,0-1.416,2.13c.028.714.708.916,1.512.45l19.494-11.239a2.765,2.765,0,0,0,1.41-2.1C314.492,216.691,313.823,216.489,313.014,216.955Z" transform="translate(-235.528 -131.737)" fill="#455a64"/>
    <path id="Tracé_4527" data-name="Tracé 4527" d="M313.8,230.605,294.31,241.844a2.6,2.6,0,0,0-1.36,2.1c.062.691.77.877,1.573.41l19.494-11.239a2.563,2.563,0,0,0,1.343-2.1C315.3,230.324,314.607,230.156,313.8,230.605Z" transform="translate(-235.896 -137.717)" fill="#455a64"/>
    <path id="Tracé_4528" data-name="Tracé 4528" d="M315.228,243.867l-19.494,11.239a2.417,2.417,0,0,0-1.292,2.062c.1.669.832.843,1.641.376l19.494-11.239a2.377,2.377,0,0,0,1.276-2.057C316.751,243.58,316.032,243.4,315.228,243.867Z" transform="translate(-236.545 -143.521)" fill="#455a64"/>
    <path id="Tracé_4529" data-name="Tracé 4529" d="M317.353,256.729l-19.494,11.239A2.232,2.232,0,0,0,296.634,270c.135.652.9.8,1.686.332l19.488-11.239a2.2,2.2,0,0,0,1.214-2.023C318.887,256.414,318.185,256.263,317.353,256.729Z" transform="translate(-237.501 -149.151)" fill="#455a64"/>
    <path id="Tracé_4530" data-name="Tracé 4530" d="M320.234,269.163,300.74,280.4a1.969,1.969,0,0,0-1.124,1.978c.2.624.972.764,1.776.3l19.494-11.239a1.974,1.974,0,0,0,1.124-1.978C321.818,268.832,321.037,268.7,320.234,269.163Z" transform="translate(-238.797 -154.595)" fill="#455a64"/>
    <path id="Tracé_4531" data-name="Tracé 4531" d="M302.089,281.144l-47.506,27.428c-.8.466-1.292,1.332-1.073,1.933s1.056.714,1.86.247l47.506-27.428a1.829,1.829,0,0,0,1.056-1.933C303.713,280.784,302.864,280.678,302.089,281.144Z" transform="translate(-218.596 -159.838)" fill="#455a64"/>
    <path id="Tracé_4532" data-name="Tracé 4532" d="M306.593,292.589l-47.5,27.428c-.809.466-1.253,1.309-.983,1.882s1.124.663,1.944.2l47.506-27.428c.809-.466,1.242-1.309.972-1.883S307.4,292.128,306.593,292.589Z" transform="translate(-220.599 -164.848)" fill="#455a64"/>
    <path id="Tracé_4533" data-name="Tracé 4533" d="M312.188,303.488l-47.506,27.428c-.809.466-1.208,1.287-.888,1.832s1.236.6,2.046.135l47.473-27.428c.8-.461,1.191-1.276.871-1.821S312.975,303.022,312.188,303.488Z" transform="translate(-223.076 -169.617)" fill="#455a64"/>
    <path id="Tracé_4534" data-name="Tracé 4534" d="M318.7,313.8l-47.5,27.423c-.809.466-1.169,1.27-.8,1.781a1.685,1.685,0,0,0,2.135.09l47.5-27.428c.809-.466,1.158-1.259.792-1.776A1.669,1.669,0,0,0,318.7,313.8Z" transform="translate(-225.955 -174.126)" fill="#455a64"/>
    <path id="Tracé_4535" data-name="Tracé 4535" d="M326.119,323.591l-47.506,27.423c-.8.466-1.124,1.247-.719,1.736a1.846,1.846,0,0,0,2.208.045l47.506-27.44c.8-.466,1.124-1.236.708-1.725A1.806,1.806,0,0,0,326.119,323.591Z" transform="translate(-229.224 -178.408)" fill="#455a64"/>
    <path id="Tracé_4536" data-name="Tracé 4536" d="M334.3,332.927l-47.49,27.423c-.809.466-1.124,1.231-.652,1.686a2.028,2.028,0,0,0,2.276,0l47.506-27.428c.809-.466,1.09-1.219.641-1.686A2.023,2.023,0,0,0,334.3,332.927Z" transform="translate(-232.824 -182.495)" fill="#455a64"/>
    <path id="Tracé_4537" data-name="Tracé 4537" d="M343.327,341.849l-47.506,27.423c-.8.466-1.068,1.214-.562,1.658a2.184,2.184,0,0,0,2.349-.039l47.467-27.428c.8-.466,1.056-1.2.562-1.646A2.106,2.106,0,0,0,343.327,341.849Z" transform="translate(-236.795 -186.399)" fill="#455a64"/>
    <path id="Tracé_4538" data-name="Tracé 4538" d="M264.59,244.44l-22.41,12.925a130.743,130.743,0,0,0,4.569,31.626l22.416-12.925A130.542,130.542,0,0,1,264.59,244.44Z" transform="translate(-213.656 -143.886)" fill="#e34168"/>
    <path id="Tracé_4539" data-name="Tracé 4539" d="M264.59,244.44l-22.41,12.925a130.743,130.743,0,0,0,4.569,31.626l22.416-12.925A130.542,130.542,0,0,1,264.59,244.44Z" transform="translate(-213.656 -143.886)" fill="#fff" opacity="0.8"/>
  </g>
</svg>
