[
  {
    "url": "TODO_APP_URL",
    "name": "todo"
  },
  {
    "url": "COMMUNICATION_APP_URL",
    "name": "communication"
  },
  {
    "url": "DEMARCHE_QUALITE_APP_URL",
    "name": "demarche_qualite"
  },
  {
    "url": "GED_APP_URL",
    "name": "ged"
  },
  {
    "url": "TOOLS_APP_URL",
    "name": "tools"
  },
  {
    "url": "PARTENAIRE_APP_URL",
    "name": "partenaire"
  },
  {
    "url": "BASIS_APP_URL",
    "name": "basis"
  }
]
