<svg xmlns="http://www.w3.org/2000/svg" xmlns:xlink="http://www.w3.org/1999/xlink" width="44.873" height="38" viewBox="0 0 44.873 38">
  <defs>
    <filter id="Polygone_2" x="0" y="0" width="44.873" height="38" filterUnits="userSpaceOnUse">
      <feOffset dy="3" input="SourceAlpha"/>
      <feGaussianBlur stdDeviation="3" result="blur"/>
      <feFlood flood-opacity="0.251"/>
      <feComposite operator="in" in2="blur"/>
      <feComposite in="SourceGraphic"/>
    </filter>
  </defs>
  <g transform="matrix(1, 0, 0, 1, 0, 0)" filter="url(#Polygone_2)">
    <path id="Polygone_2-2" data-name="Polygone 2" d="M11.776,2.471a2,2,0,0,1,3.32,0l9.683,14.414A2,2,0,0,1,23.119,20H3.753a2,2,0,0,1-1.66-3.115Z" transform="translate(9 6)" fill="#fff"/>
  </g>
</svg>
