<svg xmlns="http://www.w3.org/2000/svg" width="239.031" height="249.097" viewBox="0 0 239.031 249.097">
  <g id="Groupe_2072" data-name="Groupe 2072" transform="translate(-1189.646 -355)">
    <rect id="Rectangle_821" data-name="Rectangle 821" width="95.96" height="120.576" transform="translate(1211.599 361.161)" fill="#e0e0e0"/>
    <rect id="Rectangle_822" data-name="Rectangle 822" width="89.554" height="113.684" transform="translate(1215.112 364.611)" fill="#fafafa"/>
    <path id="Tracé_1826" data-name="Tracé 1826" d="M85.7,168.388h18.017l2.316,10.6h7.817l6.659-30.149H142.8V128.285h16.213v34.347h16.24v35.756H85.7Z" transform="translate(1129.412 279.906)" fill="#f5f5f5"/>
    <rect id="Rectangle_823" data-name="Rectangle 823" width="2.895" height="112.746" transform="translate(1258.421 364.611)" fill="#e0e0e0"/>
    <rect id="Rectangle_824" data-name="Rectangle 824" width="89.554" height="2.964" transform="translate(1215.112 419.685)" fill="#e0e0e0"/>
    <path id="Tracé_1827" data-name="Tracé 1827" d="M391.182,103.478l5.76,14.735-3.581-.016-2.87-9.055Z" transform="translate(1007.523 289.827)" fill="#e0e0e0"/>
    <g id="Groupe_2014" data-name="Groupe 2014" transform="translate(1377.056 379.69)">
      <path id="Tracé_1828" data-name="Tracé 1828" d="M357.546,80.79l-1.98,28.233,20.441.427,2.3-28.66Z" transform="translate(-355.566 -80.79)" fill="#ebebeb"/>
      <path id="Tracé_1829" data-name="Tracé 1829" d="M361.175,84.486l-1.648,23.5,15.2.712,2.123-24.351Z" transform="translate(-357.15 -82.212)" fill="#fafafa"/>
    </g>
    <path id="Tracé_1830" data-name="Tracé 1830" d="M367.008,90.116l-1.233,16.519h8.383l1.479-16.519Z" transform="translate(1017.407 295.171)" fill="#e0e0e0"/>
    <path id="Tracé_1831" data-name="Tracé 1831" d="M308.284,112.737V89.523h17v23.2Z" transform="translate(1040.399 295.408)" fill="#ebebeb"/>
    <path id="Tracé_1832" data-name="Tracé 1832" d="M320.734,69.577s4.1-29.973,2.952-29.931-4.034,27.326-4.034,27.326-.121-22.6-1.2-22.477,0,23.92,0,23.92S316.6,49.1,315.6,49.562s.429,20.014.429,20.014h4.7" transform="translate(1037.614 315.354)" fill="#e0e0e0"/>
    <path id="Tracé_1833" data-name="Tracé 1833" d="M319.24,73.736s1.421-14.939,1.89-13.917,0,8.893,0,8.893,3.936-19.3,4.967-18.649-4.03,20.953-4.03,20.953,3.842-11.588,4.686-10.367-3.186,12.091-3.186,12.091,4.124-7.684,4.405-6.653S326,73.736,326,73.736Z" transform="translate(1036.017 311.195)" fill="#ebebeb"/>
    <path id="Tracé_1834" data-name="Tracé 1834" d="M309.831,78.143s-9.09-17.844-7.965-17.291S308.8,72.931,308.8,72.931s-3.845-11.126-3-11.467,5.062,12.5,5.062,12.5l.946,4.181Z" transform="translate(1043.004 306.879)" fill="#ebebeb"/>
    <path id="Tracé_1835" data-name="Tracé 1835" d="M316.193,89.536l.43,23.214h-8.083l-.156-23.292Z" transform="translate(1040.359 295.434)" fill="#e0e0e0"/>
    <path id="Tracé_1836" data-name="Tracé 1836" d="M308.167,91.459,316,91.59l9.152-.131.287-2.218h-17.49Z" transform="translate(1040.534 295.521)" fill="#f5f5f5"/>
    <rect id="Rectangle_825" data-name="Rectangle 825" width="85.007" height="3.733" transform="translate(1334.054 407.766)" fill="#e0e0e0"/>
    <path id="Tracé_1837" data-name="Tracé 1837" d="M310.362,347.841c-.72-.794.977-5.457,9.037-5.788s11.285,2.605,11.3,5.788C330.706,349.253,310.362,347.841,310.362,347.841Z" transform="translate(1039.628 194.429)" fill="#455a64"/>
    <path id="Tracé_1838" data-name="Tracé 1838" d="M297.866,148.041l-8.952,55.374h81.768l9.85-55.965Z" transform="translate(1048.145 272.242)" fill="#f5f5f5"/>
    <path id="Tracé_1839" data-name="Tracé 1839" d="M302.475,153.08c.031-.2,82.544-.313,82.544-.313l.936-5.317-82.666.59-.814,5.039" transform="translate(1042.722 272.242)" fill="#e0e0e0"/>
    <path id="Tracé_1840" data-name="Tracé 1840" d="M308.575,152.085a.758.758,0,1,1-.757-.757A.757.757,0,0,1,308.575,152.085Z" transform="translate(1040.888 270.691)" fill="#263238"/>
    <path id="Tracé_1841" data-name="Tracé 1841" d="M314.78,152.085a.758.758,0,1,1-.757-.757A.757.757,0,0,1,314.78,152.085Z" transform="translate(1038.407 270.691)" fill="#263238"/>
    <path id="Tracé_1842" data-name="Tracé 1842" d="M320.986,152.085a.757.757,0,1,1-.757-.757A.757.757,0,0,1,320.986,152.085Z" transform="translate(1035.925 270.691)" fill="#263238"/>
    <path id="Tracé_1843" data-name="Tracé 1843" d="M326.333,188.286,316.1,200.093a14.534,14.534,0,0,1-6.362-11.806c0-8.227,7.493-15,16.6-15s16.6,6.77,16.6,15Z" transform="translate(1039.818 261.909)" fill="#e8505b"/>
    <path id="Tracé_1844" data-name="Tracé 1844" d="M332.708,201.4a1.9,1.9,0,0,1-.176.232l-.53.64-2.028,2.394-7.283,8.49-.024-.194a16.616,16.616,0,0,0,7.621,2.835,17.594,17.594,0,0,0,9.066-1.368,16.419,16.419,0,0,0,6.824-5.5,15.52,15.52,0,0,0,1.852-3.631,14.631,14.631,0,0,0,.711-3.719l.133.139-11.7-.2-3.289-.075-.871-.029a2.045,2.045,0,0,1-.3-.022,1.533,1.533,0,0,1,.287-.016l.857-.008h3.273l11.749.077h.142l-.009.139a14.846,14.846,0,0,1-.706,3.8,15.733,15.733,0,0,1-1.879,3.712,16.647,16.647,0,0,1-6.944,5.608,17.816,17.816,0,0,1-9.226,1.38,16.788,16.788,0,0,1-7.738-2.917l-.12-.085.1-.11,7.4-8.448,2.072-2.335.548-.6A1.434,1.434,0,0,1,332.708,201.4Z" transform="translate(1034.756 250.678)" fill="#263238"/>
    <circle id="Ellipse_112" data-name="Ellipse 112" cx="0.931" cy="0.931" r="0.931" transform="translate(1372.277 440.356)" fill="#263238"/>
    <path id="Tracé_1845" data-name="Tracé 1845" d="M368.556,171.983a4.7,4.7,0,0,1-.873.061l-2.382.05c-2.011.028-4.789.046-7.856.046h-1.482l.109-.046c-1.929,1.921-3.644,3.611-4.885,4.812l-1.472,1.405a3.7,3.7,0,0,1-.562.483,3.615,3.615,0,0,1,.483-.562l1.4-1.472c1.2-1.24,2.891-2.957,4.812-4.885l.046-.045h.064l1.482,0c3.068,0,5.845.017,7.856.046l2.382.049A4.655,4.655,0,0,1,368.556,171.983Z" transform="translate(1024.055 262.494)" fill="#263238"/>
    <path id="Tracé_1846" data-name="Tracé 1846" d="M401,180.419a2.8,2.8,0,0,1,.043-.314l.149-.889c.139-.792.337-1.923.589-3.359l2.167-12.033.125.151L380.836,164c-.035.028.289-.241.151-.125v0l0,.008,0,.017-.007.035-.013.07-.026.139-.052.278-.1.554-.2,1.1q-.2,1.1-.405,2.181-.4,2.162-.791,4.247c-.518,2.775-1.015,5.432-1.482,7.93l-.139-.167,16.738.067,4.781.038,1.276.019.332.009a.623.623,0,0,1,.117.008.365.365,0,0,1-.1.009l-.317.009-1.251.018-4.753.038-16.82.068h-.17l.031-.169c.46-2.5.949-5.157,1.46-7.934q.385-2.082.786-4.248.2-1.081.4-2.181l.2-1.1.1-.555.052-.278.026-.139.013-.07.007-.035,0-.017,0-.008v0c-.137.112.187-.159.156-.13l23.242.029h.154l-.029.151-2.3,12.079c-.278,1.42-.5,2.538-.65,3.322-.074.365-.132.65-.175.863A2.062,2.062,0,0,1,401,180.419Z" transform="translate(1012.683 265.748)" fill="#263238"/>
    <circle id="Ellipse_113" data-name="Ellipse 113" cx="0.931" cy="0.931" r="0.931" transform="translate(1373.733 459.064)" fill="#263238"/>
    <g id="Groupe_2022" data-name="Groupe 2022" transform="translate(1374.664 459.839)">
      <path id="Tracé_1847" data-name="Tracé 1847" d="M368.464,214.507c0,.086-3.78.157-8.442.157s-8.442-.07-8.442-.157,3.779-.156,8.442-.156S368.464,214.421,368.464,214.507Z" transform="translate(-351.58 -214.351)" fill="#263238"/>
    </g>
    <path id="Tracé_1848" data-name="Tracé 1848" d="M400.509,218.456a1.638,1.638,0,0,1,.044-.229l.148-.645c.139-.58.335-1.4.586-2.445.522-2.123,1.266-5.155,2.181-8.884l.114.146-23.966.038c-.137.106.182-.143.149-.116v0l0,.007,0,.013-.007.025-.013.05-.025.1-.051.2-.1.4-.2.8q-.2.8-.4,1.584l-.785,3.1-1.493,5.884-.142-.182,17.2.067,4.969.04,1.332.02.347.01a.662.662,0,0,1,.123.01.392.392,0,0,1-.107.01l-.332.01-1.306.02-4.941.041-17.281.066h-.188l.046-.184,1.479-5.887.781-3.1.4-1.584.2-.8.1-.4.051-.2.025-.1.013-.05.007-.025,0-.013,0-.006v0c-.033.024.288-.225.154-.119l23.966.038h.152l-.038.146-2.312,8.914c-.273,1.029-.488,1.837-.639,2.409l-.171.62A1.113,1.113,0,0,1,400.509,218.456Z" transform="translate(1013.178 248.788)" fill="#263238"/>
    <path id="Tracé_1849" data-name="Tracé 1849" d="M402.866,172.339c0,.086-3.56.157-7.951.157s-7.951-.07-7.951-.157,3.559-.156,7.951-.156S402.866,172.253,402.866,172.339Z" transform="translate(1008.934 262.351)" fill="#263238"/>
    <path id="Tracé_1850" data-name="Tracé 1850" d="M402.494,176.678c0,.086-3.581.157-8,.157s-8-.07-8-.157,3.58-.156,8-.156S402.494,176.592,402.494,176.678Z" transform="translate(1009.12 260.616)" fill="#263238"/>
    <path id="Tracé_1851" data-name="Tracé 1851" d="M402.091,180.862c0,.086-3.456.157-7.718.157s-7.718-.07-7.718-.157,3.455-.156,7.718-.156S402.091,180.776,402.091,180.862Z" transform="translate(1009.058 258.943)" fill="#263238"/>
    <path id="Tracé_1852" data-name="Tracé 1852" d="M402.742,214.025c0,.086-3.394.156-7.579.156s-7.579-.07-7.579-.156,3.392-.157,7.579-.157S402.742,213.938,402.742,214.025Z" transform="translate(1008.686 245.681)" fill="#263238"/>
    <path id="Tracé_1853" data-name="Tracé 1853" d="M402.679,218.829c0,.086-2.894.156-6.462.156s-6.464-.07-6.464-.156,2.893-.157,6.464-.157S402.679,218.742,402.679,218.829Z" transform="translate(1007.819 243.76)" fill="#263238"/>
    <path id="Tracé_1854" data-name="Tracé 1854" d="M247.1,319.4c-.292,1.689-8.3,19.405-3.127,19.405h25.967s-2.682-2.525,5.438-19.405Z" transform="translate(1066.809 203.479)" fill="#455a64"/>
    <path id="Tracé_1855" data-name="Tracé 1855" d="M215.266,219.42l-10.614,62.038h89.537l10.984-64.215Z" transform="translate(1081.842 244.331)" fill="#455a64"/>
    <path id="Tracé_1856" data-name="Tracé 1856" d="M221.449,225.518,212.5,280.893h81.767l9.85-55.965Z" transform="translate(1078.705 241.258)" fill="#fafafa"/>
    <path id="Tracé_1857" data-name="Tracé 1857" d="M305.172,217.244l1.692,1.136-11.4,64.765H207.012l-2.36-1.687h89.537Z" transform="translate(1081.842 244.331)" fill="#263238"/>
    <path id="Tracé_1858" data-name="Tracé 1858" d="M226.057,230.557c.032-.2,82.544-.312,82.544-.312l.936-5.317-82.665.59-.815,5.039" transform="translate(1073.282 241.258)" fill="#ebebeb"/>
    <path id="Tracé_1859" data-name="Tracé 1859" d="M327.281,288.358a.887.887,0,0,1,.017-.152c.019-.12.044-.274.074-.466.073-.434.175-1.042.305-1.819.277-1.614.674-3.925,1.169-6.8,1.021-5.824,2.441-13.925,4.054-23.12l.022-.127h.13l6.392,0h.236l-.034.184c-2.5,13.558-4.692,25.467-5.955,32.318l-.013.07h-.071l-4.7-.049-1.221-.02-.308-.008a.44.44,0,0,1-.1-.007.743.743,0,0,1,.115-.008l.324-.008,1.243-.02,4.645-.049-.083.07c1.233-6.857,3.375-18.774,5.814-32.343l.154.184h-.048l-6.392,0,.152-.127c-1.66,9.138-3.123,17.188-4.175,22.976-.534,2.885-.963,5.2-1.263,6.824-.149.79-.266,1.408-.349,1.849l-.1.484A1.511,1.511,0,0,1,327.281,288.358Z" transform="translate(1032.802 228.884)" fill="#263238"/>
    <path id="Tracé_1860" data-name="Tracé 1860" d="M309.964,294.528a3.818,3.818,0,0,1,.066-.433q.085-.473.23-1.285l.894-4.826c.789-4.16,1.885-9.945,3.14-16.558l.023-.124h.127l6.393,0h.238l-.038.187c-1.9,9.4-3.583,17.763-4.652,23.062l-.016.077h-.078l-4.7-.055-1.225-.023a3.519,3.519,0,0,1-.406-.017c.007-.006.159-.011.445-.018l1.249-.023,4.633-.055-.094.077c1.041-5.3,2.684-13.671,4.533-23.086l.153.187h-.047l-6.393,0,.149-.124c-1.3,6.556-2.442,12.29-3.262,16.414-.415,2.045-.75,3.689-.985,4.849q-.174.83-.274,1.313c-.03.137-.055.25-.076.344A.76.76,0,0,1,309.964,294.528Z" transform="translate(1039.727 222.714)" fill="#263238"/>
    <path id="Tracé_1861" data-name="Tracé 1861" d="M292.647,283.33a1.374,1.374,0,0,1,.025-.191l.094-.58c.091-.531.22-1.287.386-2.256.347-1.991.847-4.852,1.467-8.41l5.047-28.467.023-.127h6.757l-.034.184c-3.134,17.152-5.9,32.1-7.362,39.862l-.012.064h-.064l-4.723-.046-1.206-.018c-.269,0-.4-.014-.4-.014s.151-.009.429-.014l1.225-.018,4.673-.045-.076.063c1.372-7.774,4.073-22.737,7.207-39.89l.154.184h-6.44l.152-.127c-2.05,11.238-3.863,21.175-5.166,28.321-.661,3.568-1.192,6.438-1.563,8.434-.185.982-.329,1.748-.431,2.286-.049.251-.088.449-.117.6A1.961,1.961,0,0,1,292.647,283.33Z" transform="translate(1046.652 233.912)" fill="#263238"/>
    <path id="Tracé_1862" data-name="Tracé 1862" d="M275.331,298.943a1.771,1.771,0,0,1,.037-.3c.037-.232.086-.53.146-.9.14-.828.335-1.979.579-3.411.521-2.97,1.245-7.095,2.082-11.861l.022-.123h.126l6.393-.006h.236l-.036.185-3.152,16.438-.017.088h-.088l-4.676-.061-1.239-.026a3.045,3.045,0,0,1-.412-.02c.008-.007.165-.013.457-.021l1.265-.026,4.605-.061-.105.088c.766-4.126,1.851-9.969,3.056-16.456l.153.185h-.047l-6.393-.006.148-.124c-.888,4.712-1.655,8.788-2.208,11.724-.28,1.441-.5,2.6-.667,3.434-.077.383-.139.691-.187.929A3.075,3.075,0,0,1,275.331,298.943Z" transform="translate(1053.578 218.299)" fill="#263238"/>
    <path id="Tracé_1863" data-name="Tracé 1863" d="M258.014,291.843a.587.587,0,0,1,.012-.126c.015-.1.034-.23.057-.388q.086-.551.239-1.518c.22-1.354.535-3.284.925-5.685.814-4.884,1.946-11.675,3.236-19.411l.021-.127h.13l6.392,0h.235l-.032.183-4.8,27.091-.013.076h-.076l-4.694-.052-1.225-.022a3.689,3.689,0,0,1-.407-.017.716.716,0,0,1,.117-.008l.326-.009,1.248-.021,4.636-.052-.089.075,4.669-27.113.154.183h-.049l-6.392,0,.151-.128c-1.339,7.679-2.514,14.423-3.359,19.271-.43,2.411-.775,4.349-1.017,5.709q-.181.985-.283,1.547l-.079.405A1.016,1.016,0,0,1,258.014,291.843Z" transform="translate(1060.503 225.399)" fill="#263238"/>
    <path id="Tracé_1864" data-name="Tracé 1864" d="M240.7,285.584a1.163,1.163,0,0,1,.021-.173c.022-.134.049-.308.084-.529.081-.487.2-1.177.344-2.06l1.311-7.688c1.142-6.573,2.73-15.716,4.528-26.071l.022-.128h6.757l-.033.184c-2.792,15.551-5.265,29.15-6.627,36.48l-.013.067h-.067l-4.715-.047L241.1,285.6l-.3-.007a.5.5,0,0,1-.1-.007.772.772,0,0,1,.113-.007l.319-.008,1.232-.019,4.663-.047-.079.066c1.273-7.346,3.686-20.956,6.479-36.507l.154.184h-.049l-6.392,0,.152-.127c-1.846,10.3-3.476,19.389-4.648,25.926l-1.406,7.712-.389,2.09c-.044.228-.079.409-.106.547A1.634,1.634,0,0,1,240.7,285.584Z" transform="translate(1067.427 231.658)" fill="#263238"/>
    <path id="Tracé_1865" data-name="Tracé 1865" d="M232.158,229.563a.757.757,0,1,1-.757-.758A.757.757,0,0,1,232.158,229.563Z" transform="translate(1071.448 239.708)" fill="#263238"/>
    <circle id="Ellipse_114" data-name="Ellipse 114" cx="0.758" cy="0.758" r="0.758" transform="translate(1305.814 468.513)" fill="#263238"/>
    <path id="Tracé_1866" data-name="Tracé 1866" d="M244.568,229.563a.758.758,0,1,1-.758-.758A.758.758,0,0,1,244.568,229.563Z" transform="translate(1066.485 239.708)" fill="#263238"/>
    <path id="Tracé_1867" data-name="Tracé 1867" d="M223.381,293.63a4.124,4.124,0,0,1,.064-.46q.082-.5.224-1.363l.869-5.114,3.05-17.51.022-.126h.129l6.392,0h.236l-.035.185c-1.856,10-3.5,18.865-4.531,24.409l-.014.078h-.078l-4.7-.054-1.225-.022a3.7,3.7,0,0,1-.406-.017.638.638,0,0,1,.117-.008l.327-.01,1.248-.022,4.635-.054-.092.077c1-5.548,2.6-14.424,4.409-24.431l.154.184h-.048l-6.392,0,.15-.126c-1.266,6.93-2.375,13-3.173,17.368-.405,2.168-.731,3.91-.96,5.138q-.169.882-.268,1.392l-.074.365A.838.838,0,0,1,223.381,293.63Z" transform="translate(1074.353 223.612)" fill="#263238"/>
    <g id="Groupe_2038" data-name="Groupe 2038" transform="translate(1333.624 481.321)">
      <path id="Tracé_1868" data-name="Tracé 1868" d="M317.443,261.65H283.19l1.954-11.5h34.5Z" transform="translate(-283.19 -250.149)" fill="#e8505b"/>
    </g>
    <path id="Tracé_1869" data-name="Tracé 1869" d="M282.747,269.208l-.665,4.012s4.5-4.171,4.427-4.171h-3.735" transform="translate(1050.877 223.614)" fill="#e8505b"/>
    <g id="Groupe_2039" data-name="Groupe 2039" transform="translate(1339.422 485.163)">
      <path id="Tracé_1870" data-name="Tracé 1870" d="M318.335,256.707c0,.086-5.7.157-12.741.157s-12.742-.07-12.742-.157,5.7-.156,12.742-.156S318.335,256.621,318.335,256.707Z" transform="translate(-292.852 -256.551)" fill="#fafafa"/>
    </g>
    <g id="Groupe_2040" data-name="Groupe 2040" transform="translate(1339.086 487.938)">
      <path id="Tracé_1871" data-name="Tracé 1871" d="M317.775,261.332c0,.086-5.705.156-12.741.156s-12.742-.07-12.742-.156,5.7-.156,12.742-.156S317.775,261.246,317.775,261.332Z" transform="translate(-292.292 -261.176)" fill="#fafafa"/>
    </g>
    <rect id="Rectangle_826" data-name="Rectangle 826" width="97.585" height="56.942" transform="translate(1323.006 546.253)" fill="#263238"/>
    <rect id="Rectangle_827" data-name="Rectangle 827" width="44.456" height="56.942" transform="translate(1323.006 546.253)" fill="#455a64"/>
    <g id="Groupe_2044" data-name="Groupe 2044" transform="translate(1327.012 549.585)">
      <path id="Tracé_1872" data-name="Tracé 1872" d="M308.093,379.914s-.008-.1-.012-.29-.007-.476-.012-.829c-.007-.738-.016-1.8-.028-3.16-.014-2.74-.035-6.678-.06-11.539l.112.112-35.76.044c-.141.139.187-.191.154-.155v2.07q0,1.032,0,2.052,0,2.04,0,4.026c0,2.646,0,5.212-.005,7.669l-.149-.148,25.631.07,7.435.041,1.995.019.519.009a1.527,1.527,0,0,1,.182.009.973.973,0,0,1-.164.01l-.5.009-1.964.019-7.4.041-25.731.071h-.148v-.149c0-2.457,0-5.023-.006-7.669q0-1.985,0-4.026V364.1c-.035.032.3-.3.158-.158l35.76.044h.113v.113c-.025,4.89-.046,8.851-.061,11.608-.012,1.349-.021,2.4-.028,3.135-.005.344-.01.612-.013.808A2.211,2.211,0,0,1,308.093,379.914Z" transform="translate(-272.172 -363.905)" fill="#263238"/>
    </g>
    <g id="Groupe_2045" data-name="Groupe 2045" transform="translate(1343.375 556.03)">
      <path id="Tracé_1873" data-name="Tracé 1873" d="M302.637,376.3c-.026,0-.034-.135-.106-.356a1.525,1.525,0,0,0-.561-.765,1.42,1.42,0,0,0-1.323-.172,1.381,1.381,0,0,0,0,2.586,1.42,1.42,0,0,0,1.323-.172,1.523,1.523,0,0,0,.561-.765c.072-.221.08-.357.106-.356s.052.137.011.386a1.512,1.512,0,0,1-.545.91,1.623,1.623,0,0,1-1.555.267,1.657,1.657,0,0,1,0-3.128A1.623,1.623,0,0,1,302.1,375a1.513,1.513,0,0,1,.545.911C302.688,376.164,302.654,376.3,302.637,376.3Z" transform="translate(-299.439 -374.645)" fill="#263238"/>
    </g>
    <g id="Groupe_2047" data-name="Groupe 2047" transform="translate(1327.012 566.997)">
      <path id="Tracé_1874" data-name="Tracé 1874" d="M308.093,408.93s-.008-.1-.012-.29-.007-.476-.012-.829c-.007-.738-.016-1.8-.028-3.159-.014-2.74-.035-6.679-.06-11.54l.112.112-35.76.044c-.141.14.187-.19.154-.154v2.069q0,1.032,0,2.052,0,2.04,0,4.027c0,2.646,0,5.212-.005,7.669l-.149-.149,25.631.071,7.435.041,1.995.019.519.01a1.532,1.532,0,0,1,.182.009,1.043,1.043,0,0,1-.164.009l-.5.009-1.964.019-7.4.041-25.731.071h-.148v-.149c0-2.457,0-5.023-.006-7.669q0-1.985,0-4.027v-4.121c-.035.032.3-.3.158-.158l35.76.044h.113v.112c-.025,4.89-.046,8.851-.061,11.608-.012,1.349-.021,2.4-.028,3.134-.005.344-.01.612-.013.808A2.241,2.241,0,0,1,308.093,408.93Z" transform="translate(-272.172 -392.921)" fill="#263238"/>
    </g>
    <g id="Groupe_2048" data-name="Groupe 2048" transform="translate(1343.375 573.442)">
      <path id="Tracé_1875" data-name="Tracé 1875" d="M302.637,405.316c-.026,0-.034-.135-.106-.356a1.522,1.522,0,0,0-.561-.765,1.418,1.418,0,0,0-1.323-.172,1.381,1.381,0,0,0,0,2.586,1.42,1.42,0,0,0,1.323-.172,1.524,1.524,0,0,0,.561-.765c.072-.221.08-.357.106-.356s.052.136.011.386a1.513,1.513,0,0,1-.545.911,1.623,1.623,0,0,1-1.555.267,1.657,1.657,0,0,1,0-3.128,1.623,1.623,0,0,1,1.555.267,1.512,1.512,0,0,1,.545.91C302.688,405.18,302.654,405.317,302.637,405.316Z" transform="translate(-299.439 -403.661)" fill="#263238"/>
    </g>
    <g id="Groupe_2050" data-name="Groupe 2050" transform="translate(1327.012 584.409)">
      <path id="Tracé_1876" data-name="Tracé 1876" d="M308.093,437.945s-.008-.1-.012-.29-.007-.477-.012-.829c-.007-.738-.016-1.8-.028-3.159-.014-2.741-.035-6.68-.06-11.54l.112.112-35.76.044c-.141.139.187-.191.154-.155v2.07q0,1.032,0,2.052,0,2.04,0,4.026c0,2.646,0,5.212-.005,7.669l-.149-.148,25.631.07,7.435.041,1.995.019.519.009a1.53,1.53,0,0,1,.182.009,1.074,1.074,0,0,1-.164.01l-.5.009-1.964.019-7.4.041-25.731.071h-.148v-.149c0-2.457,0-5.023-.006-7.669q0-1.985,0-4.026v-4.121c-.035.032.3-.3.158-.158l35.76.044h.113v.113c-.025,4.889-.046,8.851-.061,11.608-.012,1.349-.021,2.4-.028,3.135-.005.344-.01.612-.013.808A2.21,2.21,0,0,1,308.093,437.945Z" transform="translate(-272.172 -421.936)" fill="#263238"/>
    </g>
    <g id="Groupe_2051" data-name="Groupe 2051" transform="translate(1343.375 590.854)">
      <path id="Tracé_1877" data-name="Tracé 1877" d="M302.637,434.331c-.026,0-.034-.135-.106-.356a1.524,1.524,0,0,0-.561-.765,1.421,1.421,0,0,0-1.323-.172,1.381,1.381,0,0,0,0,2.586,1.418,1.418,0,0,0,1.323-.172,1.519,1.519,0,0,0,.561-.765c.072-.221.08-.357.106-.356s.052.137.011.386a1.511,1.511,0,0,1-.545.91,1.623,1.623,0,0,1-1.555.267,1.657,1.657,0,0,1,0-3.128,1.623,1.623,0,0,1,1.555.267,1.513,1.513,0,0,1,.545.911C302.688,434.195,302.654,434.332,302.637,434.331Z" transform="translate(-299.439 -432.676)" fill="#263238"/>
    </g>
    <rect id="Rectangle_828" data-name="Rectangle 828" width="82.087" height="56.942" transform="translate(1192.793 546.253)" fill="#263238"/>
    <rect id="Rectangle_829" data-name="Rectangle 829" width="234.489" height="5.411" transform="translate(1189.646 542.281)" fill="#263238"/>
    <rect id="Rectangle_830" data-name="Rectangle 830" width="7.271" height="55.503" transform="translate(1192.793 547.692)" fill="#455a64"/>
    <path id="Tracé_1878" data-name="Tracé 1878" d="M197.624,206.524a4.832,4.832,0,0,1-.1-.688,4.986,4.986,0,0,0-.6-1.753,2.055,2.055,0,0,0-.878-.841,1.137,1.137,0,0,0-1.251.237,4.852,4.852,0,0,0,0,6.089,1.138,1.138,0,0,0,1.252.237,2.058,2.058,0,0,0,.877-.841,4.988,4.988,0,0,0,.6-1.752,4.874,4.874,0,0,1,.1-.688,2.188,2.188,0,0,1,.02.7,4.627,4.627,0,0,1-.526,1.85,2.255,2.255,0,0,1-.963.967,1.366,1.366,0,0,1-.789.114,1.6,1.6,0,0,1-.754-.368,5.038,5.038,0,0,1,0-6.529,1.607,1.607,0,0,1,.754-.368,1.361,1.361,0,0,1,.789.114,2.252,2.252,0,0,1,.963.967,4.625,4.625,0,0,1,.526,1.85A2.181,2.181,0,0,1,197.624,206.524Z" transform="translate(1086.337 250.077)" fill="#263238"/>
    <g id="Groupe_2058" data-name="Groupe 2058" transform="translate(1252.173 436.017)">
      <g id="Groupe_2056" data-name="Groupe 2056" transform="translate(4.104 5.534)">
        <path id="Tracé_1879" data-name="Tracé 1879" d="M156.073,187.221,154.3,223.177l15.395,1.45.85-8.727s5.43,1.342,7.079-3.682c1.054-3.209,1.991-28.344,1.991-28.344Z" transform="translate(-154.298 -183.875)" fill="#ffbe9d"/>
      </g>
      <g id="Groupe_2057" data-name="Groupe 2057">
        <path id="Tracé_1880" data-name="Tracé 1880" d="M180.2,183.895c-1.313,3.128-6.27,5.8-6.27,5.8l-.822,7.96a15.65,15.65,0,0,0-2.211-.02c.4-3.735-4.414-3.006-4.9-.459-.471,2.45,2.319,4.084,2.319,4.084-1.926,2.955-2.706,4.513-5.439,7.281-2.957,3-4.547,3.239-7.6,3.148l-3.364-.155s-1.2-2.873-2.075-9.661c-.422-3.264-2.971-7.543-2.246-12.85,2.061-15.085,18.752-12.406,18.752-12.406C172.606,171.768,183.285,176.539,180.2,183.895Z" transform="translate(-147.459 -174.653)" fill="#263238"/>
      </g>
    </g>
    <path id="Tracé_1881" data-name="Tracé 1881" d="M195.815,209.035a38.622,38.622,0,0,1-6.927.35,38.487,38.487,0,0,1,6.927-.35Z" transform="translate(1088.146 247.638)" fill="#263238"/>
    <path id="Tracé_1882" data-name="Tracé 1882" d="M248.948,278.322l-5.612,3.474-2.058,4.81v-4.187s1.524-1.782,2.771-3.117a1.726,1.726,0,0,0,0-2.673c-.356-.445-5.727,5.79-5.727,5.79V286c-2.5-3.078-3.659-2.02-4.044-1.46s4.044,4.731,4.044,4.731v1.276l-22,11.831-5.791-14.406-11.831,6.2,7.061,17.1a8.927,8.927,0,0,0,12.792,4.277l25.891-15.3,1.727-2.873a7.282,7.282,0,0,0,1.024-3.268l.863-12.94A2.39,2.39,0,0,0,248.948,278.322Z" transform="translate(1084.223 220.592)" fill="#ffbe9d"/>
    <path id="Tracé_1883" data-name="Tracé 1883" d="M226.789,319.568a31.382,31.382,0,0,1-2.174,5.869,31.494,31.494,0,0,1,2.174-5.869Z" transform="translate(1073.863 203.411)" fill="#eb996e"/>
    <path id="Tracé_1884" data-name="Tracé 1884" d="M278.054,284.208a10.2,10.2,0,0,1-1.023.461,3.807,3.807,0,0,0-.954.691,3.767,3.767,0,0,0-.732,1.23,23.983,23.983,0,0,1-1.63,3.5,23.836,23.836,0,0,1,1.343-3.619,3.726,3.726,0,0,1,.82-1.315,3.565,3.565,0,0,1,1.062-.685A2.605,2.605,0,0,1,278.054,284.208Z" transform="translate(1054.226 217.555)" fill="#eb996e"/>
    <path id="Tracé_1885" data-name="Tracé 1885" d="M279.583,287.577a.653.653,0,0,0-.471.316c-.174.334-.4.865-.627,1.429a21.072,21.072,0,0,1-.791,2.1,5.157,5.157,0,0,1,.5-2.211,7.23,7.23,0,0,1,.738-1.443.626.626,0,0,1,.467-.262C279.534,287.5,279.591,287.56,279.583,287.577Z" transform="translate(1052.642 216.234)" fill="#eb996e"/>
    <g id="Groupe_2068" data-name="Groupe 2068" transform="translate(1238.366 476.708)">
      <g id="Groupe_2067" data-name="Groupe 2067">
        <g id="Groupe_2066" data-name="Groupe 2066">
          <path id="Tracé_1886" data-name="Tracé 1886" d="M165.471,278.331l2.514,8.517,15.956-7.224c-.573-1.782-3.212-9.726-8.264-22.33a21.669,21.669,0,0,0-16.54-13.332,94.684,94.684,0,0,0-15.278-1.5,18.976,18.976,0,0,0-18.413,15.182c-1.351,6.7,1.015,11.114-.51,25.761l-.485,36.824,42.6,1.566Z" transform="translate(-124.45 -242.461)" fill="#e8505b"/>
        </g>
      </g>
    </g>
    <path id="Tracé_1887" data-name="Tracé 1887" d="M123.059,289.76s-5.918.347-8.25-4.136c0,0,6.381-23.586,8.607-26.364Z" transform="translate(1117.771 227.529)" fill="#e8505b"/>
    <path id="Tracé_1891" data-name="Tracé 1891" d="M116.983,310.432c5.58,1.141,11.309-.01,16.994-.347,3.447-.2,7.271-.577,10,1.542,2.162,1.68,3.032,4.5,3.656,7.171,2.378,10.161,2.811,19.243,3.346,29.665l-27.6-.6Z" transform="translate(1116.902 207.268)"/>
    <path id="Tracé_1892" data-name="Tracé 1892" d="M127.521,278.875l1.2,17.211h-3.641Z" transform="translate(1113.665 219.684)" opacity="0.3"/>
    <path id="Tracé_1893" data-name="Tracé 1893" d="M142.074,372.057,196.859,374a16.341,16.341,0,0,1,15.761,16.585l-.484,31.095H192.046l-1.293-26.81-48.679-1.28Z" transform="translate(1106.868 182.42)" fill="#263238"/>
    <rect id="Rectangle_831" data-name="Rectangle 831" width="5.388" height="19.725" transform="translate(1261.923 582.904)" fill="#455a64"/>
    <path id="Tracé_1894" data-name="Tracé 1894" d="M88.359,311.642v47.528a11.286,11.286,0,0,0,11.286,11.287h31.649V311.642a5.03,5.03,0,0,0-5.03-5.031H93.389A5.03,5.03,0,0,0,88.359,311.642Z" transform="translate(1128.349 208.592)" fill="#455a64"/>
    <path id="Tracé_1895" data-name="Tracé 1895" d="M179.527,413.853H102.454a8.366,8.366,0,0,1,8.366-8.366h60.341a8.365,8.365,0,0,1,8.366,8.366Z" transform="translate(1122.712 169.051)" fill="#455a64"/>
    <path id="Tracé_1896" data-name="Tracé 1896" d="M138.327,403.638a4.27,4.27,0,0,1-.12,1.4,5.673,5.673,0,0,1-4.5,4.261,7.829,7.829,0,0,1-1.484.1l-1.555.008-6.925.019-12.583-.032-3.813-.046-1.037-.028a1.551,1.551,0,0,1-.361-.031,1.612,1.612,0,0,1,.361-.032l1.037-.03,3.813-.054,12.583-.059,6.925,0,1.555,0a7.67,7.67,0,0,0,1.439-.082,5.42,5.42,0,0,0,2.348-1,5.6,5.6,0,0,0,2.082-3.036A13.438,13.438,0,0,0,138.327,403.638Z" transform="translate(1121.315 169.791)" fill="#263238"/>
    <path id="Tracé_1897" data-name="Tracé 1897" d="M169.773,419.6a35.915,35.915,0,0,1-4.728.156,35.908,35.908,0,0,1-4.728-.156,35.9,35.9,0,0,1,4.728-.156A35.905,35.905,0,0,1,169.773,419.6Z" transform="translate(1099.572 163.47)" fill="#263238"/>
    <path id="Tracé_1899" data-name="Tracé 1899" d="M52.9,317.858a4.884,4.884,0,0,0,.893,4.689H57.68S57.318,318.151,52.9,317.858Z" transform="translate(1142.63 204.095)" fill="#e8505b"/>
    <path id="Tracé_1900" data-name="Tracé 1900" d="M52.9,317.858a4.884,4.884,0,0,0,.893,4.689H57.68S57.318,318.151,52.9,317.858Z" transform="translate(1142.63 204.095)" opacity="0.4"/>
    <path id="Tracé_1901" data-name="Tracé 1901" d="M62.607,308.53c-.16-.191-3.47,4.991-1.611,10.284h3.646S66.069,312.658,62.607,308.53Z" transform="translate(1139.517 207.827)" fill="#e8505b"/>
    <path id="Tracé_1902" data-name="Tracé 1902" d="M71.879,317.858a4.749,4.749,0,0,0-4.43,4.689h3.646A5.747,5.747,0,0,0,71.879,317.858Z" transform="translate(1136.711 204.095)" fill="#e8505b"/>
    <path id="Tracé_1903" data-name="Tracé 1903" d="M51.778,325.326a8.183,8.183,0,0,0-3.278,8.119c.937,5.386,6.635,7.729,6.635,7.729h6.323s6.431-2.827,6.275-8.682-3.988-7.077-3.988-7.077Z" transform="translate(1144.343 201.108)" fill="#455a64"/>
    <path id="Tracé_1904" data-name="Tracé 1904" d="M67.708,335.188a3.176,3.176,0,0,0-.523-.651,2.828,2.828,0,0,0-2.11-.6,7.66,7.66,0,0,0-3.089,1.342,10.578,10.578,0,0,1-1.835.945,4.267,4.267,0,0,1-2.229.222A14.341,14.341,0,0,1,54,334.8a5.745,5.745,0,0,0-3.236-.779,3.075,3.075,0,0,0-1.971,1,3.708,3.708,0,0,0-.43.719c-.01,0,0-.077.039-.221a1.91,1.91,0,0,1,.295-.573A3.106,3.106,0,0,1,50.73,333.8a5.843,5.843,0,0,1,3.394.739,14.75,14.75,0,0,0,3.848,1.594,3.991,3.991,0,0,0,2.076-.2,10.646,10.646,0,0,0,1.791-.9,7.613,7.613,0,0,1,3.216-1.316,2.877,2.877,0,0,1,2.213.736,1.842,1.842,0,0,1,.375.525A.561.561,0,0,1,67.708,335.188Z" transform="translate(1144.346 197.758)" fill="#263238"/>
    <path id="Tracé_1905" data-name="Tracé 1905" d="M67.993,337.54a3.2,3.2,0,0,0-.515-.648,2.774,2.774,0,0,0-2.087-.608,7.518,7.518,0,0,0-3.054,1.342,10.467,10.467,0,0,1-1.815.945,4.185,4.185,0,0,1-2.211.223,14.114,14.114,0,0,1-3.883-1.645,5.625,5.625,0,0,0-3.2-.777,3.029,3.029,0,0,0-1.946,1,3.788,3.788,0,0,0-.422.715c-.01,0,0-.077.038-.219a1.915,1.915,0,0,1,.288-.57,3.059,3.059,0,0,1,2.01-1.148,5.712,5.712,0,0,1,3.362.737,14.551,14.551,0,0,0,3.806,1.594,3.908,3.908,0,0,0,2.055-.2,10.506,10.506,0,0,0,1.771-.9,7.478,7.478,0,0,1,3.184-1.316,2.827,2.827,0,0,1,2.19.739,1.819,1.819,0,0,1,.368.524C67.984,337.463,68,337.536,67.993,337.54Z" transform="translate(1144.147 196.817)" fill="#263238"/>
    <path id="Tracé_1906" data-name="Tracé 1906" d="M53.11,338.39c-.025-.034.166-.146.392.039a.432.432,0,0,1,.121.476.513.513,0,0,1-.5.337.525.525,0,0,1-.458-.392.465.465,0,0,1,.14-.463c.216-.181.4-.1.388-.064s-.134.071-.223.212a.249.249,0,0,0-.029.232.259.259,0,0,0,.2.164.248.248,0,0,0,.217-.134.209.209,0,0,0-.017-.218C53.252,338.442,53.117,338.432,53.11,338.39Z" transform="translate(1142.631 195.931)" fill="#263238"/>
    <path id="Tracé_1907" data-name="Tracé 1907" d="M65.042,334.589c-.025-.034.166-.145.392.039a.433.433,0,0,1,.121.477.514.514,0,0,1-.5.337.524.524,0,0,1-.458-.393.464.464,0,0,1,.14-.463c.216-.181.4-.1.387-.064s-.134.07-.223.211a.252.252,0,0,0-.028.233.259.259,0,0,0,.2.163.246.246,0,0,0,.217-.134.208.208,0,0,0-.017-.218C65.184,334.641,65.05,334.632,65.042,334.589Z" transform="translate(1137.859 197.45)" fill="#263238"/>
    <path id="Tracé_1908" data-name="Tracé 1908" d="M76.613,338.561c-.025-.034.166-.145.392.039a.433.433,0,0,1,.121.476.513.513,0,0,1-.5.337.524.524,0,0,1-.458-.393.464.464,0,0,1,.14-.463c.216-.181.4-.1.387-.064,0,.044-.134.07-.223.211a.25.25,0,0,0-.029.233.26.26,0,0,0,.2.163.246.246,0,0,0,.216-.134.207.207,0,0,0-.017-.218C76.754,338.613,76.62,338.6,76.613,338.561Z" transform="translate(1133.232 195.862)" fill="#263238"/>
    <path id="Tracé_1909" data-name="Tracé 1909" d="M381.318,316.152l2.059,21.352h10.405l2.493-21.352Z" transform="translate(1011.192 204.777)" fill="#455a64"/>
    <path id="Tracé_1910" data-name="Tracé 1910" d="M380.668,311.553a4.455,4.455,0,0,0-.976,2.818H396.6a3.15,3.15,0,0,0-.975-2.818Z" transform="translate(1011.842 206.616)" fill="#263238"/>
    <path id="Tracé_1911" data-name="Tracé 1911" d="M384.15,308.277l-.572,2.113,12.763.1-.842-2.233Z" transform="translate(1010.288 207.936)" fill="#263238"/>
    <path id="Tracé_1912" data-name="Tracé 1912" d="M380.962,325.059c0,.2,1.238,10.746,1.238,10.746h12.721l1.212-10.746Z" transform="translate(1011.334 201.215)" fill="#e8505b"/>
  </g>
</svg>
