<svg id="bar_chart-24px" xmlns="http://www.w3.org/2000/svg" width="28.653" height="28.653" viewBox="0 0 28.653 28.653">
  <path id="Tracé_2545" data-name="Tracé 2545" d="M0,0H28.653V28.653H0Z" fill="none"/>
  <path id="Icon_material-remove-red-eye" data-name="Icon material-remove-red-eye" d="M12.245,6.75A11.553,11.553,0,0,0,1.5,14.076a11.543,11.543,0,0,0,21.49,0A11.553,11.553,0,0,0,12.245,6.75Zm0,12.21a4.884,4.884,0,1,1,4.884-4.884A4.886,4.886,0,0,1,12.245,18.96Zm0-7.815a2.93,2.93,0,1,0,2.93,2.93A2.927,2.927,0,0,0,12.245,11.146Z" transform="translate(2.082 0.523)" fill="#fff"/>
</svg>
