{
  "routingKey": "tickets",
  "index": "ticket",
  "mappingProperties": {
    "id": {
      "type": "keyword"
    },
    "typeTicket": {
      "type": "keyword"
    },
    "typeAppel": {
      "type": "keyword"
    },
    "origineType": {
      "type": "keyword"
    },
    "visibilite": {
      "type": "keyword"
    },
    "idOrganisation": {
      "type": "keyword"
    },
    "nomOrganisation": {
      "type": "keyword"
    },
    "nomInterlocuteur": {
      "type": "keyword"
    },
    "telephoneInterlocuteur": {
      "type": "keyword"
    },
    "declarant": {
      "properties": {
        "id": {
          "type": "keyword"
        },
        "userName": {
          "type": "keyword"
        },
        "role": {
          "properties": {
            "id": {
              "type": "keyword"
            },
            "code": {
              "type": "keyword"
            },
            "nom": {
              "type": "keyword"
            }
          }
        },
        "pharmacie": {
          "properties": {
            "id": {
              "type": "keyword"
            },
            "nom": {
              "type": "keyword"
            }
          }
        }
      }
    },

    "usersConcernees": {
      "properties": {
        "id": {
          "type": "keyword"
        },
        "userName": {
          "type": "keyword"
        },
        "role": {
          "properties": {
            "id": {
              "type": "keyword"
            },
            "code": {
              "type": "keyword"
            },
            "nom": {
              "type": "keyword"
            }
          }
        },
        "pharmacie": {
          "properties": {
            "id": {
              "type": "keyword"
            },
            "nom": {
              "type": "keyword"
            }
          }
        }
      }
    },
    "smyley": {
      "properties": {
        "id": {
          "type": "keyword"
        },
        "photo": {
          "type": "keyword"
        },
        "nom": {
          "type": "keyword"
        }
      }
    },
    "dateHeureSaisie": {
      "type": "date",
      "format": "date_optional_time||strict_date_optional_time"
    },
    "commentaire": {
      "type": "keyword"
    },
    "priority": {
      "type": "keyword"
    },
    "statusTicket": {
      "type": "keyword"
    },
    "motif": {
      "properties": {
        "id": {
          "type": "keyword"
        },
        "code": {
          "type": "keyword"
        },
        "nom": {
          "type": "keyword"
        }
      }
    },
    "fichiers": {
      "properties": {
        "id": {
          "type": "keyword"
        },
        "chemin": {
          "type": "keyword"
        },
        "nomOriginal": {
          "type": "keyword"
        },
        "publicUrl": {
          "type": "keyword"
        }
      }
    },
    "groupement": {
      "properties": {
        "id": {
          "type": "keyword"
        },
        "nom": {
          "type": "keyword"
        }
      }
    },
    "userCreation": {
      "properties": {
        "id": {
          "type": "keyword"
        },
        "userName": {
          "type": "keyword"
        },
        "role": {
          "properties": {
            "id": {
              "type": "keyword"
            },
            "code": {
              "type": "keyword"
            },
            "nom": {
              "type": "keyword"
            }
          }
        },
        "pharmacie": {
          "properties": {
            "id": {
              "type": "keyword"
            },
            "nom": {
              "type": "keyword"
            }
          }
        }
      }
    }
  },
  "instances": 1,
  "query": "query ticket($id: ID!) { ticket(id: $id) { id typeTicket typeAppel origineType visibilite idOrganisation nomOrganisation nomInterlocuteur telephoneInterlocuteur declarant { id userName role { id code nom } pharmacie { id nom } } usersConcernees { id userName role { id code nom } pharmacie { id nom } } smyley { id photo nom } dateHeureSaisie commentaire  priority statusTicket motif { id code nom }  fichiers { id chemin nomOriginal publicUrl }  groupement { id nom }  userCreation { id userName role { id code nom } pharmacie { id nom } } } }",
  "dataKey": "ticket"
}
