<svg xmlns="http://www.w3.org/2000/svg" width="269.593" height="200.879" viewBox="0 0 269.593 200.879">
  <g id="Fiche_d_amélioration" data-name="Fiche d&apos;amélioration" transform="translate(18831 13424)">
    <g id="Businesswoman-rafiki" transform="translate(-18831 -13424)">
      <g id="freepik--background-complete--inject-294" transform="translate(0 0)">
        <rect id="Rectangle_19464" data-name="Rectangle 19464" width="269.593" height="0.135" transform="translate(0 176.529)" fill="#ebebeb"/>
        <rect id="Rectangle_19465" data-name="Rectangle 19465" width="17.858" height="0.135" transform="translate(224.722 185.205)" fill="#ebebeb"/>
        <rect id="Rectangle_19466" data-name="Rectangle 19466" width="4.686" height="0.135" transform="translate(173.904 186.672)" fill="#ebebeb"/>
        <rect id="Rectangle_19467" data-name="Rectangle 19467" width="10.347" height="0.135" transform="translate(213.836 180.201)" fill="#ebebeb"/>
        <rect id="Rectangle_19468" data-name="Rectangle 19468" width="23.287" height="0.135" transform="translate(28.286 181.107)" fill="#ebebeb"/>
        <rect id="Rectangle_19469" data-name="Rectangle 19469" width="3.413" height="0.135" transform="translate(56.377 181.107)" fill="#ebebeb"/>
        <rect id="Rectangle_19470" data-name="Rectangle 19470" width="50.511" height="0.135" transform="translate(70.887 183.383)" fill="#ebebeb"/>
        <path id="Tracé_5438" data-name="Tracé 5438" d="M145.395,207.482H41.283A3.079,3.079,0,0,1,38.21,204.4V58.052A3.079,3.079,0,0,1,41.283,55H145.395a3.079,3.079,0,0,1,3.079,3.079V204.4A3.079,3.079,0,0,1,145.395,207.482ZM41.283,55.108a2.944,2.944,0,0,0-2.939,2.944V204.4a2.944,2.944,0,0,0,2.939,2.944H145.395a2.949,2.949,0,0,0,2.944-2.944V58.052a2.949,2.949,0,0,0-2.944-2.944Z" transform="translate(-17.608 -55)" fill="#ebebeb"/>
        <path id="Tracé_5439" data-name="Tracé 5439" d="M361.7,207.482H257.579A3.084,3.084,0,0,1,254.5,204.4V58.052A3.084,3.084,0,0,1,257.579,55H361.7a3.079,3.079,0,0,1,3.068,3.052V204.4A3.079,3.079,0,0,1,361.7,207.482ZM257.579,55.108a2.949,2.949,0,0,0-2.944,2.944V204.4a2.949,2.949,0,0,0,2.944,2.944H361.7a2.949,2.949,0,0,0,2.944-2.944V58.052a2.949,2.949,0,0,0-2.944-2.944Z" transform="translate(-117.277 -55)" fill="#ebebeb"/>
        <path id="Tracé_5440" data-name="Tracé 5440" d="M418.973,265.685h-1.418V134.56h-1.742V265.685H414.4l-.766,2.507h6.109Z" transform="translate(-190.606 -91.662)" fill="#f0f0f0"/>
        <path id="Tracé_5441" data-name="Tracé 5441" d="M405.532,125.367l15.313-11.614a2.7,2.7,0,0,0-1.618-4.853H388.586a2.7,2.7,0,0,0-1.618,4.853l15.318,11.614a2.7,2.7,0,0,0,3.246,0Z" transform="translate(-177.823 -79.838)" fill="#ebebeb"/>
        <path id="Tracé_5442" data-name="Tracé 5442" d="M242.558,284.093H207.641l-3.332-33.37a2.534,2.534,0,0,1,2.448-2.793h29.731a2.885,2.885,0,0,1,2.744,2.793Z" transform="translate(-94.142 -143.905)" fill="#e6e6e6"/>
        <path id="Tracé_5443" data-name="Tracé 5443" d="M249.08,284.093H214.141l-3.332-33.37a2.534,2.534,0,0,1,2.448-2.793h29.731a2.879,2.879,0,0,1,2.739,2.793Z" transform="translate(-97.137 -143.905)" fill="#f5f5f5"/>
        <path id="Tracé_5444" data-name="Tracé 5444" d="M216.211,300.55h24.215v7.764H213.52v-5.068a2.7,2.7,0,0,1,2.691-2.7Z" transform="translate(-98.393 -168.153)" fill="#e6e6e6"/>
        <path id="Tracé_5445" data-name="Tracé 5445" d="M251.356,300.55H282.09a2.7,2.7,0,0,1,2.7,2.7v5.068H248.66v-5.068A2.7,2.7,0,0,1,251.356,300.55Z" transform="translate(-114.586 -168.153)" fill="#f5f5f5"/>
        <rect id="Rectangle_19471" data-name="Rectangle 19471" width="2.394" height="36.368" transform="translate(113.499 140.161)" fill="#e6e6e6"/>
        <rect id="Rectangle_19472" data-name="Rectangle 19472" width="2.394" height="36.368" transform="translate(131.071 140.161)" fill="#e6e6e6"/>
        <rect id="Rectangle_19473" data-name="Rectangle 19473" width="2.394" height="36.368" transform="translate(149.694 140.161)" fill="#e6e6e6"/>
        <rect id="Rectangle_19474" data-name="Rectangle 19474" width="2.394" height="36.368" transform="translate(167.266 140.161)" fill="#e6e6e6"/>
        <path id="Tracé_5446" data-name="Tracé 5446" d="M375.3,284.093H340.375l-3.327-33.37a2.534,2.534,0,0,1,2.448-2.793h29.731a2.879,2.879,0,0,1,2.739,2.793Z" transform="translate(-155.311 -143.905)" fill="#e6e6e6"/>
        <path id="Tracé_5447" data-name="Tracé 5447" d="M381.833,284.093H346.915l-3.327-33.37a2.534,2.534,0,0,1,2.442-2.793h29.731a2.879,2.879,0,0,1,2.744,2.793Z" transform="translate(-158.324 -143.905)" fill="#f5f5f5"/>
        <path id="Tracé_5448" data-name="Tracé 5448" d="M348.951,300.55h24.215v7.764H346.26v-5.068a2.7,2.7,0,0,1,2.691-2.7Z" transform="translate(-159.561 -168.153)" fill="#e6e6e6"/>
        <path id="Tracé_5449" data-name="Tracé 5449" d="M384.1,300.55H414.83a2.7,2.7,0,0,1,2.7,2.7v5.068H381.4v-5.068A2.7,2.7,0,0,1,384.1,300.55Z" transform="translate(-175.754 -168.153)" fill="#f5f5f5"/>
        <rect id="Rectangle_19475" data-name="Rectangle 19475" width="2.394" height="36.368" transform="translate(185.065 140.161)" fill="#e6e6e6"/>
        <rect id="Rectangle_19476" data-name="Rectangle 19476" width="2.394" height="36.368" transform="translate(202.637 140.161)" fill="#e6e6e6"/>
        <rect id="Rectangle_19477" data-name="Rectangle 19477" width="2.394" height="36.368" transform="translate(221.266 140.161)" fill="#e6e6e6"/>
        <rect id="Rectangle_19478" data-name="Rectangle 19478" width="2.394" height="36.368" transform="translate(238.838 140.161)" fill="#e6e6e6"/>
        <path id="Tracé_5450" data-name="Tracé 5450" d="M109.823,284.093H74.9l-3.327-33.37a2.529,2.529,0,0,1,2.443-2.793h29.731a2.879,2.879,0,0,1,2.744,2.793Z" transform="translate(-32.978 -143.905)" fill="#e6e6e6"/>
        <path id="Tracé_5451" data-name="Tracé 5451" d="M116.363,284.093H81.445l-3.327-33.37a2.529,2.529,0,0,1,2.443-2.793h29.731a2.885,2.885,0,0,1,2.744,2.793Z" transform="translate(-35.991 -143.905)" fill="#f5f5f5"/>
        <path id="Tracé_5452" data-name="Tracé 5452" d="M83.471,300.55h24.215v7.764H80.78v-5.068a2.7,2.7,0,0,1,2.691-2.7Z" transform="translate(-37.225 -168.153)" fill="#e6e6e6"/>
        <path id="Tracé_5453" data-name="Tracé 5453" d="M118.616,300.55H149.35a2.7,2.7,0,0,1,2.7,2.7v5.068H115.92v-5.068A2.7,2.7,0,0,1,118.616,300.55Z" transform="translate(-53.418 -168.153)" fill="#f5f5f5"/>
        <rect id="Rectangle_19479" data-name="Rectangle 19479" width="2.394" height="36.368" transform="translate(41.927 140.161)" fill="#e6e6e6"/>
        <rect id="Rectangle_19480" data-name="Rectangle 19480" width="2.394" height="36.368" transform="translate(59.499 140.161)" fill="#e6e6e6"/>
        <rect id="Rectangle_19481" data-name="Rectangle 19481" width="2.394" height="36.368" transform="translate(78.128 140.161)" fill="#e6e6e6"/>
        <rect id="Rectangle_19482" data-name="Rectangle 19482" width="2.394" height="36.368" transform="translate(95.7 140.161)" fill="#e6e6e6"/>
        <path id="Tracé_5454" data-name="Tracé 5454" d="M110.7,138.4H55.61V71.48H110.7Zm-54.555-.539h54.016V72.019H56.149Z" transform="translate(-25.626 -62.594)" fill="#f0f0f0"/>
        <rect id="Rectangle_19483" data-name="Rectangle 19483" width="55.595" height="43.771" transform="translate(79.417 14.547) rotate(90)" fill="#f0f0f0"/>
      </g>
      <g id="freepik--Shadow--inject-294" transform="translate(30.254 188.672)">
        <ellipse id="freepik--path--inject-294" cx="104.543" cy="6.104" rx="104.543" ry="6.104" fill="#f5f5f5"/>
      </g>
      <g id="freepik--Chart--inject-294" transform="translate(50.721 18.661)">
        <rect id="Rectangle_19484" data-name="Rectangle 19484" width="159.497" height="94.18" rx="12" transform="translate(0.27 0.27)" fill="#fff"/>
        <path id="Tracé_5455" data-name="Tracé 5455" d="M247.361,184.329H100.81a6.745,6.745,0,0,1-6.74-6.74V96.35a6.745,6.745,0,0,1,6.74-6.74H247.361a6.745,6.745,0,0,1,6.74,6.74v81.239a6.745,6.745,0,0,1-6.74,6.74ZM100.81,90.149a6.206,6.206,0,0,0-6.2,6.2v81.239a6.206,6.206,0,0,0,6.2,6.2H247.361a6.206,6.206,0,0,0,6.2-6.2V96.35a6.206,6.206,0,0,0-6.2-6.2Z" transform="translate(-94.07 -89.61)" fill="#e34168"/>
        <rect id="Rectangle_19485" data-name="Rectangle 19485" width="85.553" height="150.87" rx="13.24" transform="translate(155.447 4.583) rotate(90)" fill="#f5f5f5"/>
        <rect id="Rectangle_19486" data-name="Rectangle 19486" width="151.544" height="0.539" transform="translate(4.243 14.38)" fill="#fff"/>
        <rect id="Rectangle_19487" data-name="Rectangle 19487" width="151.544" height="0.539" transform="translate(4.243 27.461)" fill="#fff"/>
        <rect id="Rectangle_19488" data-name="Rectangle 19488" width="151.544" height="0.539" transform="translate(4.243 40.547)" fill="#fff"/>
        <rect id="Rectangle_19489" data-name="Rectangle 19489" width="151.544" height="0.539" transform="translate(4.243 53.633)" fill="#fff"/>
        <rect id="Rectangle_19490" data-name="Rectangle 19490" width="151.544" height="0.539" transform="translate(4.243 66.713)" fill="#fff"/>
        <rect id="Rectangle_19491" data-name="Rectangle 19491" width="151.544" height="0.539" transform="translate(4.243 79.8)" fill="#fff"/>
        <path id="Tracé_5456" data-name="Tracé 5456" d="M94.59,192.629l-.34-.426,17.157-13.647,15.151,8,9.813-15.814,14.078,6.443,5.575-18.219,14.229,19.076,16.634-25.574.453.291-17.06,26.226-14.051-18.845-5.446,17.788-14.2-6.5-9.835,15.836L111.466,179.2Z" transform="translate(-94.153 -118.577)" fill="#e34168"/>
        <path id="Tracé_5457" data-name="Tracé 5457" d="M126.351,200.085a1.591,1.591,0,1,1-1.591-1.585,1.591,1.591,0,0,1,1.591,1.585Z" transform="translate(-107.48 -139.788)" fill="#fff"/>
        <path id="Tracé_5458" data-name="Tracé 5458" d="M124.53,201.71a1.86,1.86,0,1,1,1.86-1.86A1.86,1.86,0,0,1,124.53,201.71Zm0-3.176a1.316,1.316,0,1,0,.934.383A1.321,1.321,0,0,0,124.53,198.535Z" transform="translate(-107.249 -139.553)" fill="#e34168"/>
        <path id="Tracé_5459" data-name="Tracé 5459" d="M172.791,185.645a1.591,1.591,0,1,1-1.585-1.585A1.591,1.591,0,0,1,172.791,185.645Z" transform="translate(-128.88 -133.134)" fill="#fff"/>
        <path id="Tracé_5460" data-name="Tracé 5460" d="M170.98,187.27a1.855,1.855,0,1,1,1.849-1.855A1.855,1.855,0,0,1,170.98,187.27Zm0-3.17a1.316,1.316,0,1,0,1.31,1.316A1.316,1.316,0,0,0,170.98,184.1Z" transform="translate(-128.654 -132.903)" fill="#e34168"/>
        <path id="Tracé_5461" data-name="Tracé 5461" d="M199.011,197.645a1.58,1.58,0,1,1-.463-1.122,1.591,1.591,0,0,1,.463,1.122Z" transform="translate(-140.962 -138.664)" fill="#fff"/>
        <path id="Tracé_5462" data-name="Tracé 5462" d="M197.2,199.27a1.855,1.855,0,1,1,1.855-1.855,1.855,1.855,0,0,1-1.855,1.855Zm0-3.17a1.316,1.316,0,1,0,1.316,1.316A1.316,1.316,0,0,0,197.2,196.1Z" transform="translate(-140.741 -138.433)" fill="#e34168"/>
        <path id="Tracé_5463" data-name="Tracé 5463" d="M209.281,164.255a1.591,1.591,0,1,1-.477-1.131A1.591,1.591,0,0,1,209.281,164.255Z" transform="translate(-145.695 -123.277)" fill="#fff"/>
        <path id="Tracé_5464" data-name="Tracé 5464" d="M207.41,165.88a1.86,1.86,0,1,1,1.86-1.86A1.86,1.86,0,0,1,207.41,165.88Zm0-3.176a1.316,1.316,0,1,0,.934.383,1.321,1.321,0,0,0-.934-.383Z" transform="translate(-145.442 -123.042)" fill="#e34168"/>
        <path id="Tracé_5465" data-name="Tracé 5465" d="M235.461,199.42a1.591,1.591,0,1,1-.475-1.134A1.591,1.591,0,0,1,235.461,199.42Z" transform="translate(-157.759 -139.479)" fill="#fff"/>
        <path id="Tracé_5466" data-name="Tracé 5466" d="M233.64,201.04a1.855,1.855,0,1,1,1.315-.541A1.86,1.86,0,0,1,233.64,201.04Zm0-3.176a1.321,1.321,0,1,0,1.321,1.321,1.321,1.321,0,0,0-1.321-1.321Z" transform="translate(-157.529 -139.244)" fill="#e34168"/>
        <circle id="Ellipse_3484" data-name="Ellipse 3484" cx="6.082" cy="6.082" r="6.082" transform="translate(84.357 34.041) rotate(-45)" fill="#fff"/>
        <path id="Tracé_5467" data-name="Tracé 5467" d="M261.052,153.663a6.352,6.352,0,1,1,6.352-6.352,6.352,6.352,0,0,1-6.352,6.352Zm0-12.164a5.8,5.8,0,1,1,0,.022Z" transform="translate(-168.091 -113.273)" fill="#e34168"/>
        <path id="Tracé_5468" data-name="Tracé 5468" d="M267.007,149.639a3.629,3.629,0,1,1-3.629-3.629A3.629,3.629,0,0,1,267.007,149.639Z" transform="translate(-170.418 -115.6)" fill="#e34168"/>
        <path id="Tracé_5469" data-name="Tracé 5469" d="M154.571,215a1.591,1.591,0,1,1-1.591-1.585A1.591,1.591,0,0,1,154.571,215Z" transform="translate(-120.484 -146.659)" fill="#fff"/>
        <path id="Tracé_5470" data-name="Tracé 5470" d="M152.75,216.62a1.86,1.86,0,1,1,1.86-1.86A1.86,1.86,0,0,1,152.75,216.62Zm0-3.176a1.316,1.316,0,1,0,.934.383A1.321,1.321,0,0,0,152.75,213.445Z" transform="translate(-120.253 -146.424)" fill="#e34168"/>
      </g>
      <g id="freepik--Character--inject-294" transform="translate(140.506 36.265)">
        <circle id="Ellipse_3485" data-name="Ellipse 3485" cx="3.323" cy="3.323" r="3.323" transform="translate(39.374 9.62)" fill="#263238"/>
        <circle id="Ellipse_3486" data-name="Ellipse 3486" cx="3.323" cy="3.323" r="3.323" transform="translate(37.605 13.482)" fill="#263238"/>
        <path id="Tracé_5471" data-name="Tracé 5471" d="M349.827,136.008a2.468,2.468,0,1,1-2.468-2.468A2.468,2.468,0,0,1,349.827,136.008Z" transform="translate(-302.768 -120.058)" fill="#263238"/>
        <path id="Tracé_5472" data-name="Tracé 5472" d="M347.437,141.748a2.473,2.473,0,1,1-2.468-2.468A2.473,2.473,0,0,1,347.437,141.748Z" transform="translate(-301.567 -122.93)" fill="#263238"/>
        <path id="Tracé_5473" data-name="Tracé 5473" d="M341.427,145.3a2.468,2.468,0,1,1-.712-1.765A2.468,2.468,0,0,1,341.427,145.3Z" transform="translate(-298.565 -124.691)" fill="#263238"/>
        <circle id="Ellipse_3487" data-name="Ellipse 3487" cx="3.323" cy="3.323" r="3.323" transform="translate(34.283 15.781)" fill="#263238"/>
        <path id="Tracé_5474" data-name="Tracé 5474" d="M296.408,163.789c-.555,1.339-1.154,2.523-1.8,3.752s-1.359,2.393-2.119,3.558a33.348,33.348,0,0,1-2.5,3.383,22.443,22.443,0,0,1-3.053,3.073l-.22.175-.11.085-.15.12a3.114,3.114,0,0,1-1.1.5,3.968,3.968,0,0,1-1.814,0,8.644,8.644,0,0,1-2.343-.934,24.135,24.135,0,0,1-3.5-2.5A52.661,52.661,0,0,1,272,169.31l1.5-1.5c1,.809,2.039,1.634,3.078,2.418s2.079,1.559,3.143,2.263a23.343,23.343,0,0,0,3.173,1.859,4.922,4.922,0,0,0,1.374.45h.155a.62.62,0,0,0-.21.09l.28-.255a28.573,28.573,0,0,0,4.5-5.791c.67-1.069,1.279-2.189,1.884-3.313s1.169-2.3,1.669-3.393Z" transform="translate(-266.298 -134.367)" fill="#b55b52"/>
        <path id="Tracé_5475" data-name="Tracé 5475" d="M301.7,161.538c-.57,1.134-1.124,2.139-1.719,3.183s-1.2,2.049-1.839,3.058a52.961,52.961,0,0,1-4.247,5.891,26.831,26.831,0,0,1-2.648,2.758l-.4.345c-.13.1-.265.21-.4.3a4.589,4.589,0,0,1-.46.265,4.377,4.377,0,0,1-2.024.475,5.961,5.961,0,0,1-2.8-.794,12.954,12.954,0,0,1-1.749-1.169c-.5-.4-.974-.8-1.419-1.189-.884-.779-1.709-1.549-2.5-2.184l2.443-3.5c1.079.685,2,1.384,2.928,2,.455.32.9.615,1.324.874a8.425,8.425,0,0,0,1.184.61c.335.14.61.13.475.085a.665.665,0,0,0-.375.06.3.3,0,0,0-.09.045.185.185,0,0,0-.07.035l.235-.235a21.582,21.582,0,0,0,1.959-2.313,48.411,48.411,0,0,0,3.448-5.461c.525-.959,1.034-1.939,1.5-2.923s.969-2,1.369-2.948Z" transform="translate(-270.046 -132.701)" fill="#e34168"/>
        <path id="Tracé_5476" data-name="Tracé 5476" d="M265.171,170.181l-2.5-.974a.844.844,0,0,0-1.034.45l-.974,2.139a.839.839,0,0,0,.295,1.044l.854.575a2.813,2.813,0,0,0,1.9.46l3.678-.435,1.609-.914C268.719,170.681,265.171,170.181,265.171,170.181Z" transform="translate(-260.589 -137.881)" fill="#b55b52"/>
        <path id="Tracé_5477" data-name="Tracé 5477" d="M314.211,405.434a6.026,6.026,0,0,1,1.779-.914h0s3.153-1.814,4.647-7.265l3.348-.844a2.413,2.413,0,0,1,1.309,1.389,13.11,13.11,0,0,1,.055,1.769c.03,1.844-.04,6-.04,6h-.435a31.642,31.642,0,0,0-.35-3.757c-.255-1.214-1.064.22-1.5,1.594s-2.318,2.838-5.127,2.908C314.615,406.378,313.281,406.233,314.211,405.434Z" transform="translate(-287.273 -251.582)" fill="#263238"/>
        <path id="Tracé_5478" data-name="Tracé 5478" d="M322.707,398.1c-1.5,5.451-4.647,7.265-4.647,7.265a4.527,4.527,0,0,0,3.892-.095c1.539-.754,1.659-2.953,2.308-3.5a6.5,6.5,0,0,0,1.789-2.813C326.209,398.105,322.707,398.1,322.707,398.1Z" transform="translate(-289.344 -252.427)" fill="#b55b52"/>
        <path id="Tracé_5479" data-name="Tracé 5479" d="M366.947,401.9a6,6,0,0,1,1-1.734h0s1.679-3.228,0-8.624l2.363-2.5a2.433,2.433,0,0,1,1.849.465,13.508,13.508,0,0,1,1,1.459c1,1.539,3.193,5.067,3.193,5.067l-.365.23a31.631,31.631,0,0,0-2.323-3c-.869-.884-.774.764-.4,2.154s-.425,3.643-2.748,5.211C367.821,402.466,366.617,403.071,366.947,401.9Z" transform="translate(-313.777 -247.879)" fill="#263238"/>
        <path id="Tracé_5480" data-name="Tracé 5480" d="M369,392.792c1.684,5.4,0,8.624,0,8.624a4.5,4.5,0,0,0,3.228-2.179c.889-1.464-.195-3.383.055-4.187a6.441,6.441,0,0,0,0-3.333C372,390.908,369,392.792,369,392.792Z" transform="translate(-314.831 -249.133)" fill="#b55b52"/>
        <path id="Tracé_5481" data-name="Tracé 5481" d="M317,211.09s2.633,33.747,3.373,47.418c.764,14.215,1.664,46.553,1.664,46.553l3.5.335s5.241-27.067,2.9-46.888c2.069-15.225,2.753-47.418,2.753-47.418Z" transform="translate(-288.813 -158.859)" fill="#b55b52"/>
        <path id="Tracé_5482" data-name="Tracé 5482" d="M331.18,211.09H317s.929,11.842,1.834,24.344c.555,7.61,1.1,15.46,1.429,21.021l8.649,19.342a111.578,111.578,0,0,0-.5-17.288c.819-6,1.419-14.68,1.849-22.954C330.931,222.872,331.18,211.09,331.18,211.09Z" transform="translate(-288.813 -158.859)" opacity="0.2"/>
        <path id="Tracé_5483" data-name="Tracé 5483" d="M325.36,211.09s2.373,42.471,4.777,50.4c2.653,8.769,17.028,39.993,17.028,41.027l3.333-.929s-5.461-30.669-12.556-42.381c3.957-15.7.844-48.117.844-48.117Z" transform="translate(-292.996 -158.859)" fill="#b55b52"/>
        <path id="Tracé_5484" data-name="Tracé 5484" d="M311.629,158.7c-.07,3.248.13,12.432,2.413,26.482h19.027c-.28-6.805-1.084-13.316,1.524-26.107a3.5,3.5,0,0,0-3-4.2c-1.079-.135-2.313-.26-3.6-.32a57.684,57.684,0,0,0-8.264,0c-1.779.16-3.678.45-5.132.695A3.583,3.583,0,0,0,311.629,158.7Z" transform="translate(-286.12 -130.502)" fill="#fff"/>
        <path id="Tracé_5485" data-name="Tracé 5485" d="M333.3,136.65c-.5,2.663-1.039,7.535.819,9.309,0,0-.535,3.807-5.891,5.161a4.673,4.673,0,0,1-2.373-5.161c2.968-.71,2.888-2.908,2.373-5Z" transform="translate(-293.194 -121.614)" fill="#b55b52"/>
        <path id="Tracé_5486" data-name="Tracé 5486" d="M333.718,140.19l-3,2.563a8.455,8.455,0,0,1,.255,1.469,3.663,3.663,0,0,0,2.813-2.6A3.882,3.882,0,0,0,333.718,140.19Z" transform="translate(-295.678 -123.385)" opacity="0.2"/>
        <path id="Tracé_5487" data-name="Tracé 5487" d="M333.528,119.337c-1.034,4.327-1.384,6.176-3.922,8.045-3.822,2.8-8.754.6-8.994-3.942-.215-4.087,1.5-10.493,6-11.492S334.563,115.01,333.528,119.337Z" transform="translate(-290.612 -109.177)" fill="#b55b52"/>
        <path id="Tracé_5488" data-name="Tracé 5488" d="M336.6,113.348c.774,1.474,3.173,4,3.9,7.23,3.5-1.084,4.907-7.93.135-9.748C335.539,112.834,336.6,113.348,336.6,113.348Z" transform="translate(-298.574 -108.695)" fill="#263238"/>
        <path id="Tracé_5489" data-name="Tracé 5489" d="M332.463,126.275c-.06.36-.3.615-.535.57s-.37-.36-.3-.715.3-.615.535-.575S332.528,125.911,332.463,126.275Z" transform="translate(-296.122 -116.061)" fill="#263238"/>
        <path id="Tracé_5490" data-name="Tracé 5490" d="M323.861,124.7c-.065.36-.3.615-.535.57s-.37-.36-.31-.72.3-.61.54-.57S323.925,124.341,323.861,124.7Z" transform="translate(-291.816 -115.27)" fill="#263238"/>
        <path id="Tracé_5491" data-name="Tracé 5491" d="M323.489,123.66l-.809-.4S323,124,323.489,123.66Z" transform="translate(-291.655 -114.914)" fill="#263238"/>
        <path id="Tracé_5492" data-name="Tracé 5492" d="M325.509,127.16a9.732,9.732,0,0,1-1.669,2.049,1.549,1.549,0,0,0,1.224.46Z" transform="translate(-292.236 -116.866)" fill="#a02724"/>
        <path id="Tracé_5493" data-name="Tracé 5493" d="M328.6,134.776a3.833,3.833,0,0,1-.61-.055.107.107,0,0,1,.04-.21,2.853,2.853,0,0,0,2.5-.695.106.106,0,1,1,.155.145A3,3,0,0,1,328.6,134.776Z" transform="translate(-294.27 -120.179)" fill="#263238"/>
        <path id="Tracé_5494" data-name="Tracé 5494" d="M344.37,129.713a3.278,3.278,0,0,1-1.759,1.754c-1.059.425-1.714-.5-1.524-1.554.17-.959.924-2.333,2.039-2.3a1.459,1.459,0,0,1,1.244,2.1Z" transform="translate(-300.849 -117.09)" fill="#b55b52"/>
        <path id="Tracé_5495" data-name="Tracé 5495" d="M334.473,122.318a.235.235,0,0,1-.15-.08,1.7,1.7,0,0,0-1.374-.68.211.211,0,1,1-.04-.42,2.1,2.1,0,0,1,1.749.834.22.22,0,0,1-.035.3.215.215,0,0,1-.15.045Z" transform="translate(-296.678 -113.852)" fill="#263238"/>
        <path id="Tracé_5496" data-name="Tracé 5496" d="M322.742,120.243a.215.215,0,0,1-.115-.1.21.21,0,0,1,.095-.285,2.1,2.1,0,0,1,1.939,0,.212.212,0,1,1-.215.365,1.689,1.689,0,0,0-1.534,0,.2.2,0,0,1-.17.025Z" transform="translate(-291.617 -113.091)" fill="#263238"/>
        <path id="Tracé_5497" data-name="Tracé 5497" d="M332.094,125.22l-.814-.4S331.6,125.569,332.094,125.22Z" transform="translate(-295.958 -115.695)" fill="#263238"/>
        <path id="Tracé_5498" data-name="Tracé 5498" d="M316.47,215.93l.764,37.759,19.637-1.754c3.373-13.616,5.241-24.588-1.374-36.016Z" transform="translate(-288.548 -161.276)" fill="#263238"/>
        <path id="Tracé_5499" data-name="Tracé 5499" d="M333.959,254.252l2.633-12.836L332.84,234.4Z" transform="translate(-296.739 -170.522)" opacity="0.2"/>
        <path id="Tracé_5500" data-name="Tracé 5500" d="M319.687,153.81c-1.629,1.439-3.687,5.132-4.047,9.494-.31,3.777,1,22.055,1.839,25.218a8.178,8.178,0,0,1-5.137-2.758s-2.238-19.607-2.174-24.179.74-6.356,3.722-6.93S319.687,153.81,319.687,153.81Z" transform="translate(-285.395 -130.2)" fill="#e34168"/>
        <path id="Tracé_5501" data-name="Tracé 5501" d="M341.43,153.85c1.969,3.063,1.244,6.081.789,9.838-.974,7.995-.255,21.376,1.094,24.858a12.416,12.416,0,0,0,5.9-2.5,178.653,178.653,0,0,1,.939-24.678c.56-4.537-.37-6.566-3.353-7.14A21.985,21.985,0,0,0,341.43,153.85Z" transform="translate(-301.037 -130.205)" fill="#e34168"/>
        <rect id="Rectangle_19492" data-name="Rectangle 19492" width="13.221" height="19.132" rx="0.8" transform="translate(38.697 53.573) rotate(-66.98)" fill="#263238"/>
        <rect id="Rectangle_19493" data-name="Rectangle 19493" width="13.166" height="18.597" rx="0.79" transform="translate(38.859 53.883) rotate(-66.98)" fill="#fafafa"/>
        <rect id="Rectangle_19494" data-name="Rectangle 19494" width="13.221" height="19.132" rx="0.8" transform="translate(40.196 54.212) rotate(-66.98)" fill="#e34168"/>
        <rect id="Rectangle_19495" data-name="Rectangle 19495" width="13.221" height="19.132" rx="0.8" transform="translate(40.196 54.212) rotate(-66.98)" fill="#fff" opacity="0.6"/>
        <path id="Tracé_5502" data-name="Tracé 5502" d="M353.843,159.53c1.149.859,2.144,1.729,3.163,2.643s1.964,1.889,2.9,2.893a35.134,35.134,0,0,1,2.648,3.2,23.4,23.4,0,0,1,2.223,3.653l.23.5.06.125.09.235a3.384,3.384,0,0,1,.14.5,4.827,4.827,0,0,1,.06,1.584,9.957,9.957,0,0,1-.625,2.318,24.653,24.653,0,0,1-1.9,3.752,50.762,50.762,0,0,1-4.752,6.5l-1.694-1.224c.635-1.109,1.279-2.248,1.889-3.383s1.2-2.273,1.729-3.423a25.158,25.158,0,0,0,1.354-3.4,6.436,6.436,0,0,0,.29-1.5,1.06,1.06,0,0,0-.035-.38h0l-.05-.095-.2-.38a29.274,29.274,0,0,0-4.5-5.736c-.864-.9-1.789-1.759-2.723-2.608s-1.924-1.684-2.848-2.428Z" transform="translate(-305.97 -133.062)" fill="#b55b52"/>
        <path id="Tracé_5503" data-name="Tracé 5503" d="M351.957,156.14c.5.41.914.774,1.364,1.169s.864.779,1.289,1.174c.849.794,1.684,1.6,2.5,2.443a47.212,47.212,0,0,1,4.6,5.421,24.363,24.363,0,0,1,1.959,3.2c.155.285.285.59.425.889l.06.13.11.285a4.961,4.961,0,0,1,.15.545,4.82,4.82,0,0,1,.09.914,7.525,7.525,0,0,1-.5,2.443,24.64,24.64,0,0,1-1.584,3.348c-.555,1-1.124,1.974-1.654,2.923l-3.832-1.849c.43-1.054.869-2.074,1.259-3.073a19.3,19.3,0,0,0,.934-2.818,2,2,0,0,0,.07-.834v.09a.625.625,0,0,0,.03.145.5.5,0,0,0,.035.09.062.062,0,0,0-.035-.055c-.11-.2-.2-.4-.33-.6a19.837,19.837,0,0,0-1.689-2.378,41.707,41.707,0,0,0-4.317-4.5c-.779-.715-1.589-1.4-2.408-2.079-.41-.335-.824-.67-1.239-1s-.854-.655-1.229-.924Z" transform="translate(-304.329 -131.365)" fill="#e34168"/>
        <path id="Tracé_5504" data-name="Tracé 5504" d="M359.115,212.07l-1.824-.31-3.473,1.869a2.389,2.389,0,0,0-1.1,1.259l-.42,1.1a.839.839,0,0,0,.36,1.024l2.034,1.184a.844.844,0,0,0,1.1-.235l1.474-2.233S359.5,213.879,359.115,212.07Z" transform="translate(-306.445 -159.194)" fill="#b55b52"/>
        <path id="Tracé_5505" data-name="Tracé 5505" d="M328.727,111.241c-3.707,1.074-9.229-.814-9.269,9.159-1.369-2.353-1.664-7.23,0-10.668,1.619-3.343,9.808-4.337,11.767-1.564S328.727,111.241,328.727,111.241Z" transform="translate(-289.473 -106.557)" fill="#263238"/>
      </g>
    </g>
    <g id="freepik--Arrow--inject-70" transform="translate(-18739.303 -13398.152)">
      <path id="Tracé_5524" data-name="Tracé 5524" d="M134.694,222.67l-8.088,6.165,3.543.5-6.913,11.914-9.943-1.819a.69.69,0,0,0-.658.242h0l-8.264,9.889-11.458-1.874a.8.8,0,0,0-.679.211h0l-8.953,8.488h0a.932.932,0,0,0-.042,1.286.859.859,0,0,0,1.243.044l8.566-8.288,11.5,1.777h0a.751.751,0,0,0,.7-.269l8.186-9.995,10,1.757h0a.657.657,0,0,0,.684-.329l7.059-12.381,2.11,2.983Z" transform="translate(-83.003 -222.67)" fill="#e34168"/>
    </g>
    <g id="Groupe_14256" data-name="Groupe 14256" transform="translate(-18794.34 -13383.022)">
      <g id="freepik--Table--inject-362" transform="translate(0 49.066)">
        <rect id="Rectangle_19461" data-name="Rectangle 19461" width="81.573" height="2.308" transform="translate(3.413 17.567)" fill="#e34168"/>
        <rect id="Rectangle_19462" data-name="Rectangle 19462" width="18.931" height="2.308" transform="translate(66.056 17.567)" opacity="0.2"/>
        <path id="Tracé_5366" data-name="Tracé 5366" d="M360.2,345.06l-4.26-86.21h1.068l4.26,86.21Z" transform="translate(-291.804 -238.981)" fill="#e34168"/>
        <path id="Tracé_5367" data-name="Tracé 5367" d="M360.2,345.06l-4.26-86.21h1.068l4.26,86.21Z" transform="translate(-291.804 -238.981)" fill="#fff" opacity="0.7"/>
        <path id="Tracé_5368" data-name="Tracé 5368" d="M395.3,345.06l-4.265-86.21h1.073l4.26,86.21Z" transform="translate(-307.978 -238.981)" fill="#e34168"/>
        <path id="Tracé_5369" data-name="Tracé 5369" d="M395.3,345.06l-4.265-86.21h1.073l4.26,86.21Z" transform="translate(-307.978 -238.981)" fill="#e34168"/>
        <path id="Tracé_5370" data-name="Tracé 5370" d="M395.3,345.06l-4.265-86.21h1.073l4.26,86.21Z" transform="translate(-307.978 -238.981)" fill="#fff" opacity="0.7"/>
        <path id="Tracé_5371" data-name="Tracé 5371" d="M273.168,345.06l4.265-86.21H276.36l-4.26,86.21Z" transform="translate(-253.169 -238.981)" fill="#e34168"/>
        <path id="Tracé_5372" data-name="Tracé 5372" d="M273.168,345.06l4.265-86.21H276.36l-4.26,86.21Z" transform="translate(-253.169 -238.981)" fill="#fff" opacity="0.7"/>
        <path id="Tracé_5373" data-name="Tracé 5373" d="M238.063,345.06l4.26-86.21h-1.068l-4.265,86.21Z" transform="translate(-236.99 -238.981)" fill="#e34168"/>
        <path id="Tracé_5374" data-name="Tracé 5374" d="M238.063,345.06l4.26-86.21h-1.068l-4.265,86.21Z" transform="translate(-236.99 -238.981)" fill="#fff" opacity="0.7"/>
        <path id="Tracé_5375" data-name="Tracé 5375" d="M328.975,222h26.2a1.294,1.294,0,0,1,1.3,1.542l-2.205,14.5a1.866,1.866,0,0,1-1.774,1.542H326.3a1.3,1.3,0,0,1-1.31-1.542l2.205-14.5A1.876,1.876,0,0,1,328.975,222Z" transform="translate(-277.531 -221.999)" fill="#e34168"/>
        <path id="Tracé_5376" data-name="Tracé 5376" d="M328.225,222h26.226a1.294,1.294,0,0,1,1.3,1.542l-2.205,14.5a1.866,1.866,0,0,1-1.774,1.542H325.551a1.3,1.3,0,0,1-1.31-1.542l2.205-14.5A1.871,1.871,0,0,1,328.225,222Z" transform="translate(-277.186 -221.999)" fill="#e34168"/>
        <path id="Tracé_5377" data-name="Tracé 5377" d="M328.225,222h26.226a1.294,1.294,0,0,1,1.3,1.542l-2.205,14.5a1.866,1.866,0,0,1-1.774,1.542H325.551a1.3,1.3,0,0,1-1.31-1.542l2.205-14.5A1.871,1.871,0,0,1,328.225,222Z" transform="translate(-277.186 -221.999)" fill="#fff" opacity="0.2"/>
        <path id="Tracé_5378" data-name="Tracé 5378" d="M325.95,239.5a.857.857,0,0,1-.663-.286.884.884,0,0,1-.189-.723l2.205-14.477a1.413,1.413,0,0,1,1.321-1.148H354.85a.857.857,0,0,1,.663.286.884.884,0,0,1,.183.723l-2.2,14.5a1.413,1.413,0,0,1-1.321,1.148Z" transform="translate(-277.585 -222.4)" fill="#fff" opacity="0.8"/>
        <path id="Tracé_5379" data-name="Tracé 5379" d="M311.919,253.51H346.7a.485.485,0,0,1,.491.577H311.25A.7.7,0,0,1,311.919,253.51Z" transform="translate(-271.21 -236.52)" fill="#e34168"/>
      </g>
      <g id="freepik--Character--inject-362" transform="translate(19.89 0)">
        <path id="Tracé_5380" data-name="Tracé 5380" d="M245.01,398.748l3.435,1.936,4.249-8.228-3.435-1.936Z" transform="translate(-220.681 -250.59)" fill="#ffb573"/>
        <path id="Tracé_5381" data-name="Tracé 5381" d="M249.041,406.4l-4-1.968a.28.28,0,0,0-.383.113l-1.747,3.068a.706.706,0,0,0,.307.944c1.407.658,2.114.906,3.871,1.769,1.078.539,3.661,1.86,5.155,2.6s2.157-.766,1.618-1.213a14.076,14.076,0,0,1-4.314-4.793A1.078,1.078,0,0,0,249.041,406.4Z" transform="translate(-220.872 -256.984)" fill="#263238"/>
        <path id="Tracé_5382" data-name="Tracé 5382" d="M247.307,390.52l3.435,1.936-2.189,4.243-3.542-1.736Z" transform="translate(-218.698 -250.59)" opacity="0.2"/>
        <path id="Tracé_5383" data-name="Tracé 5383" d="M232.7,240.93s11.091,22.3,14.418,33.182c3.639,11.921-13.652,52.269-13.652,52.269l-6.314-2.766s11.323-39.959,9.355-44.391c-5.392-12.24-17.987-38.034-17.987-38.034Z" transform="translate(-200.682 -181.657)" fill="#263238"/>
        <path id="Tracé_5384" data-name="Tracé 5384" d="M249.656,263.692c3.025,5.074,4.314,14.218,4.5,20.166-1.709-3.677-3.542-7.505-5.257-11.064h0c-1.154-3.391-2.275-6.659-3.321-9.457C245.812,261.4,247.365,259.837,249.656,263.692Z" transform="translate(-222.481 -191.053)" opacity="0.3"/>
        <path id="Tracé_5385" data-name="Tracé 5385" d="M241.53,392.528l6.9,3.613,1.979-2.335-8.163-4.346Z" transform="translate(-216.456 -250.102)" fill="#e34168"/>
        <path id="Tracé_5386" data-name="Tracé 5386" d="M249.22,409.7a5.042,5.042,0,0,1-.884-.593.09.09,0,0,1,.043-.162c.151-.027,1.5-.221,1.849.167a.356.356,0,0,1,.081.329.539.539,0,0,1-.329.4A1.078,1.078,0,0,1,249.22,409.7Zm-.6-.6c.577.442,1.051.652,1.3.572a.334.334,0,0,0,.2-.27.167.167,0,0,0-.032-.162C249.9,409.035,249.166,409.04,248.621,409.1Z" transform="translate(-220.063 -259.049)" fill="#e34168"/>
        <path id="Tracé_5387" data-name="Tracé 5387" d="M249.2,408.117a.08.08,0,0,1-.032-.119c0-.043.437-1.105.971-1.278a.453.453,0,0,1,.4.059.345.345,0,0,1,.178.4c-.108.426-1,.911-1.461.949Zm1.2-1.2a.254.254,0,0,0-.216,0c-.318.1-.631.674-.787,1.014.437-.108,1.078-.5,1.138-.782a.205.205,0,0,0-.1-.194Z" transform="translate(-220.953 -258.045)" fill="#e34168"/>
        <path id="Tracé_5388" data-name="Tracé 5388" d="M220.868,181.144c.69,1.4,1.386,2.626,2.157,3.888s1.553,2.475,2.416,3.672c.421.6.868,1.192,1.3,1.785s.917,1.17,1.413,1.736a37.5,37.5,0,0,0,3.122,3.316c.27.27.588.539.879.782a11.624,11.624,0,0,0,.917.76l.976.723c.108.07.081.065.41.28a4.264,4.264,0,0,0,.82.4,4.092,4.092,0,0,0,3.521-.372,4.243,4.243,0,0,0,.733-.582,3.825,3.825,0,0,0,.307-.356,2.543,2.543,0,0,0,.216-.3,10.121,10.121,0,0,0,.647-1.31,15.776,15.776,0,0,0,.755-2.394,31.12,31.12,0,0,0,.652-4.475,38.661,38.661,0,0,0,.086-4.405,1.736,1.736,0,0,0-3.418-.361v.059a60.438,60.438,0,0,1-2.313,7.63,10.4,10.4,0,0,1-.749,1.531,4.07,4.07,0,0,1-.367.539c-.038.054,0-.049.059-.092a1.654,1.654,0,0,1,.129-.156,1.509,1.509,0,0,1,.324-.264,1.688,1.688,0,0,1,.733-.27,1.79,1.79,0,0,1,.755.07c.226.049.6.334.35.124l-.647-.615c-.426-.421-.857-.873-1.272-1.332a54.952,54.952,0,0,1-4.621-6.3c-.712-1.122-1.418-2.265-2.1-3.413s-1.37-2.356-1.973-3.445l-.043-.075a3.478,3.478,0,0,0-6.158,3.235Z" transform="translate(-196.353 -151.763)" fill="#263238"/>
        <path id="Tracé_5389" data-name="Tracé 5389" d="M247.425,198.778a25.709,25.709,0,0,1,.539,4.853c-.178-.173-.345-.345-.512-.539a42.5,42.5,0,0,1-3.693-4.313q-.706-.927-1.359-1.887c-.27-.685-.539-1.37-.744-2.065-.075-.232-.146-.453-.216-.685C243.192,193.267,246.374,194.125,247.425,198.778Z" transform="translate(-213.931 -159.956)" opacity="0.3"/>
        <path id="Tracé_5390" data-name="Tracé 5390" d="M218.853,185.688l.437-2.788,3.467,1.618a14.778,14.778,0,0,1-1.046,2.664,1.413,1.413,0,0,1-2.259.372h0a2.092,2.092,0,0,1-.6-1.866Z" transform="translate(-175.984 -154.916)" fill="#ffb573"/>
        <path id="Tracé_5391" data-name="Tracé 5391" d="M218.782,179.43l2.588,1.785L220.3,182.9l-3.467-1.6Z" transform="translate(-173.525 -153.317)" fill="#ffb573"/>
        <path id="Tracé_5392" data-name="Tracé 5392" d="M233.223,406.969l3.866-.884-1.553-9.074-3.866.884Z" transform="translate(-197.567 -253.581)" fill="#ffb573"/>
        <path id="Tracé_5393" data-name="Tracé 5393" d="M220.946,412.9l-4.346,1a.28.28,0,0,0-.226.329l.577,3.489a.706.706,0,0,0,.836.539c1.5-.377,2.205-.631,4.119-1.078,1.175-.27,4.443-.89,6.066-1.262s1.208-1.968.485-1.957a16.251,16.251,0,0,1-6.794-.976,1.111,1.111,0,0,0-.717-.081Z" transform="translate(-180.999 -260.89)" fill="#263238"/>
        <path id="Tracé_5394" data-name="Tracé 5394" d="M233.06,397.9l3.871-.89.8,4.68-3.871.884Z" transform="translate(-198.98 -253.581)" opacity="0.2"/>
        <path id="Tracé_5395" data-name="Tracé 5395" d="M243.934,241.19s6.389,26.582,8.3,37.8c2.092,12.283,7.926,49.4,7.926,49.4l-7.085,1.618s-8.843-35.387-12.018-47.3c-3.451-12.94-10.6-28.577-10.6-41.275C234.741,241.438,243.934,241.19,243.934,241.19Z" transform="translate(-220.394 -181.777)" fill="#263238"/>
        <path id="Tracé_5396" data-name="Tracé 5396" d="M229,401.976,237.637,400l-.194-2.788-9.333,2.583Z" transform="translate(-195.874 -253.673)" fill="#e34168"/>
        <path id="Tracé_5397" data-name="Tracé 5397" d="M228.5,412.651a5.112,5.112,0,0,1-1.078.1.1.1,0,0,1-.086-.054.092.092,0,0,1,0-.1c.1-.113,1.024-1.111,1.542-1.035a.356.356,0,0,1,.27.21.507.507,0,0,1,0,.512A1.078,1.078,0,0,1,228.5,412.651Zm-.847-.092c.723,0,1.229-.156,1.37-.377a.345.345,0,0,0,0-.34.178.178,0,0,0-.129-.1C228.609,411.7,228.038,412.171,227.655,412.559Z" transform="translate(-187.029 -260.282)" fill="#e34168"/>
        <path id="Tracé_5398" data-name="Tracé 5398" d="M229.7,412.151h-.043a.086.086,0,0,1-.065-.059c0-.043-.356-1.138-.049-1.618a.458.458,0,0,1,.35-.21.345.345,0,0,1,.388.2,2.03,2.03,0,0,1-.539,1.655Zm.173-1.693a.28.28,0,0,0-.178.124,2.114,2.114,0,0,0,0,1.289,1.844,1.844,0,0,0,.394-1.326c0-.049-.065-.108-.2-.092Z" transform="translate(-189.274 -259.685)" fill="#e34168"/>
        <path id="Tracé_5399" data-name="Tracé 5399" d="M267.3,178.53a3.877,3.877,0,0,0-2.976-2.6,22.969,22.969,0,0,0-2.982-.453,78.717,78.717,0,0,0-9.021.162c-1.569.108-3.17.329-4.448.539h-.043a2.529,2.529,0,0,0-2.07,2.982A124.286,124.286,0,0,1,248,195.212c.453,7.845.146,14.019.329,15.911l21.222-.388C270.5,191.551,268.671,182.87,267.3,178.53Z" transform="translate(-239.144 -151.467)" fill="#fff"/>
        <path id="Tracé_5400" data-name="Tracé 5400" d="M268.745,175.12c1.078,4.136,7.894,11.463,8.719,22.975-.3,6.314-.049,10.622-.825,14.849l-12.994-.345c-.2-2,1.272-8.433.307-14.952-.938-6.319-2.27-14.914-3.025-18.753a2.7,2.7,0,0,1,2.157-3.149h.049c1.348-.221,3.036-.458,4.691-.566Z" transform="translate(-254.973 -151.331)" fill="#263238"/>
        <path id="Tracé_5401" data-name="Tracé 5401" d="M276.771,227.874a.14.14,0,0,0,.108-.054,21.191,21.191,0,0,0,3.138-5.883.135.135,0,0,0-.086-.173.14.14,0,0,0-.173.092,20.738,20.738,0,0,1-3.095,5.8.135.135,0,0,0,.027.189A.162.162,0,0,0,276.771,227.874Z" transform="translate(-265.635 -172.823)" fill="#fff" opacity="0.2"/>
        <path id="Tracé_5402" data-name="Tracé 5402" d="M287.423,188.465c.927,3.774.609,9-.162,13.765-.793-5.349-1.866-12.293-2.626-16.6C285.536,185.02,286.69,185.457,287.423,188.465Z" transform="translate(-278.31 -156.065)" opacity="0.3"/>
        <path id="Tracé_5403" data-name="Tracé 5403" d="M250.267,178.482A4.464,4.464,0,0,0,247,175.511a40,40,0,0,0-4.276-.361c1.208,3.914.5,15.372-.032,24.414,1.618,4.562,1.494,7.91,1.521,13.393l8.891-.776C254.074,192.064,251.6,182.138,250.267,178.482Z" transform="translate(-220.057 -151.345)" fill="#263238"/>
        <path id="Tracé_5404" data-name="Tracé 5404" d="M270.934,166.973c-2.637-.572-3.127-2.157-2.982-3.968a10.53,10.53,0,0,1,.183-1.332l-3.338-2.7-2.448-1.957c.723,2.89,1.574,8.174-.356,10.147,0,0,1.677,2.647,6.158,2.324C271.943,169.243,270.934,166.973,270.934,166.973Z" transform="translate(-248.617 -142.99)" fill="#ffb573"/>
        <path id="Tracé_5405" data-name="Tracé 5405" d="M269.693,178.96l.744.69-2.3.868.275-.879Z" transform="translate(-251.27 -153.1)" fill="#e0e0e0"/>
        <path id="Tracé_5406" data-name="Tracé 5406" d="M274.6,179.58s0-2.259.836-2.744a9.9,9.9,0,0,1-4.556-2.486l-1.364.539S270.021,177.5,274.6,179.58Z" transform="translate(-257.138 -150.976)" fill="#f5f5f5"/>
        <path id="Tracé_5407" data-name="Tracé 5407" d="M264.133,178.63l-.523.868,2.443.21-.507-.771Z" transform="translate(-244.358 -152.948)" fill="#e0e0e0"/>
        <path id="Tracé_5408" data-name="Tracé 5408" d="M263.512,179.19a3.51,3.51,0,0,0-2.076-2.459c1.316-.394,1.353-2.221,1.353-2.221l1.289.248A3.933,3.933,0,0,1,263.512,179.19Z" transform="translate(-241.632 -151.05)" fill="#f5f5f5"/>
        <path id="Tracé_5409" data-name="Tracé 5409" d="M270.757,163.369a10.4,10.4,0,0,0-.183,1.332c-1.229-.226-2.89-1.5-3.084-2.75a5.531,5.531,0,0,1-.07-1.251Z" transform="translate(-251.207 -144.686)" opacity="0.2"/>
        <path id="Tracé_5410" data-name="Tracé 5410" d="M260.881,141.14a4.508,4.508,0,0,1-.183,4.594l-2.642-3.289Z" transform="translate(-236.641 -135.672)" fill="#263238"/>
        <path id="Tracé_5411" data-name="Tracé 5411" d="M257.983,143.181c.189,3.947.1,6.255,2.054,8.374a5.138,5.138,0,0,0,8.8-2.265c.89-3.494.437-9.36-3.386-11.113a5.2,5.2,0,0,0-7.473,5Z" transform="translate(-244.588 -134.063)" fill="#ffb573"/>
        <path id="Tracé_5412" data-name="Tracé 5412" d="M260.439,136.052c1.7-5.457,18.694-8.277,12.1.954l-7.225-.987-.27,1.855a25.658,25.658,0,0,1-1.477,4.233l.3,1.677-.313,2.728s-3-3.332-4.524-4.912C256.762,139.249,259.069,135.917,260.439,136.052Z" transform="translate(-249.632 -130.999)" fill="#263238"/>
        <path id="Tracé_5413" data-name="Tracé 5413" d="M269.834,139.39c-1.887,1.391-6.821,1.655-6.821,1.655a4.724,4.724,0,0,1,1.5-1.833c-1.979,1.283-3.737,2.761-7.042,2.885a9.571,9.571,0,0,1,5.165-5.51C266.62,134.8,273.376,136.785,269.834,139.39Z" transform="translate(-245.971 -133.259)" fill="#263238"/>
        <path id="Tracé_5414" data-name="Tracé 5414" d="M281.28,131.41s.733.5.9,2.221-1.58,3.952-1.58,3.952l-.431-1.105A7.162,7.162,0,0,0,281.28,131.41Z" transform="translate(-269.739 -131.189)" fill="#263238"/>
        <path id="Tracé_5415" data-name="Tracé 5415" d="M275.514,151.692a3.71,3.71,0,0,0,1.693,1.828c.965.475,1.477-.4,1.229-1.467-.221-.96-1-2.362-1.979-2.394S275.093,150.7,275.514,151.692Z" transform="translate(-263.38 -139.598)" fill="#ffb573"/>
        <path id="Tracé_5416" data-name="Tracé 5416" d="M266.25,150.146c0,.318.162.588.367.6s.383-.243.388-.566-.162-.588-.372-.6S266.255,149.806,266.25,150.146Z" transform="translate(-246.749 -139.561)" fill="#263238"/>
        <path id="Tracé_5417" data-name="Tracé 5417" d="M259.6,150.539c0,.324.162.588.372.6s.383-.243.383-.539-.162-.588-.367-.6S259.632,150.194,259.6,150.539Z" transform="translate(-236.388 -139.755)" fill="#263238"/>
        <path id="Tracé_5418" data-name="Tracé 5418" d="M260.523,151a11.926,11.926,0,0,0,1.488,2.815,1.822,1.822,0,0,1-1.531.216Z" transform="translate(-238.55 -140.216)" fill="#ed893e"/>
        <path id="Tracé_5419" data-name="Tracé 5419" d="M266.737,157a2.734,2.734,0,0,1-1.833-1.143.1.1,0,0,1,.027-.129.092.092,0,0,1,.129.032,2.7,2.7,0,0,0,2.054,1.078.1.1,0,0,1,.092.1.1.1,0,0,1-.1.086A2.633,2.633,0,0,1,266.737,157Z" transform="translate(-246.224 -142.388)" fill="#263238"/>
        <path id="Tracé_5420" data-name="Tracé 5420" d="M267.822,147.216a.2.2,0,0,1-.086-.038.189.189,0,0,1-.027-.264,1.806,1.806,0,0,1,1.542-.706.189.189,0,1,1-.043.372,1.45,1.45,0,0,0-1.208.539.178.178,0,0,1-.178.1Z" transform="translate(-249.999 -138.006)" fill="#263238"/>
        <path id="Tracé_5421" data-name="Tracé 5421" d="M259.022,147.684a.189.189,0,0,1-.14-.108,1.569,1.569,0,0,0-1.078-.906.183.183,0,0,1-.151-.216.189.189,0,0,1,.216-.156h0a1.952,1.952,0,0,1,1.326,1.122.189.189,0,0,1-.2.264Z" transform="translate(-234.17 -138.048)" fill="#263238"/>
        <path id="Tracé_5422" data-name="Tracé 5422" d="M285.777,178.919c-.361.809-.669,1.542-.965,2.313s-.593,1.537-.874,2.308c-.539,1.542-1.078,3.111-1.51,4.7a48.441,48.441,0,0,0-1.866,9.953,88.425,88.425,0,0,0,0,9.786c.156,3.235.41,6.4.836,9.6a1.736,1.736,0,0,0,3.445-.032h0c.35-3.149.625-6.308.911-9.441q.21-2.351.453-4.675c.146-1.547.34-3.084.539-4.545a55.869,55.869,0,0,1,2.243-8.627c.485-1.44.987-2.885,1.521-4.314s1.105-2.9,1.618-4.249l.032-.076a3.483,3.483,0,0,0-6.416-2.7Z" transform="translate(-280.427 -152.164)" fill="#263238"/>
        <path id="Tracé_5423" data-name="Tracé 5423" d="M293.587,251.585l2.248,1.078-3.812,1.364s-2.583-.814-1.37-2.238l.679-.216A2.431,2.431,0,0,1,293.587,251.585Z" transform="translate(-289.225 -186.44)" fill="#ffb573"/>
        <path id="Tracé_5424" data-name="Tracé 5424" d="M293.041,256.217l-4.028.771-1.073-1.844,3.812-1.364Z" transform="translate(-285.141 -187.578)" fill="#ffb573"/>
      </g>
    </g>
  </g>
</svg>
