<svg xmlns="http://www.w3.org/2000/svg" width="18.68" height="17" viewBox="0 0 18.68 17">
  <g id="Groupe_13167" data-name="Groupe 13167" transform="translate(-177.231 -57.446)">
    <path id="Icon_material-person-pin-circle" data-name="Icon material-person-pin-circle" d="M183.881,57.446a6.657,6.657,0,0,0-6.65,6.65c0,4.987,6.65,10.35,6.65,10.35s6.65-5.363,6.65-10.35A6.657,6.657,0,0,0,183.881,57.446Zm0,1.9a1.9,1.9,0,1,1-1.9,1.9h0A1.908,1.908,0,0,1,183.881,59.346Zm0,9.5a4.541,4.541,0,0,1-3.8-2.043c.019-1.257,2.537-1.947,3.8-1.947s3.781.694,3.8,1.948A4.541,4.541,0,0,1,183.881,68.846Z" fill="#424242"/>
    <path id="Tracé_2878" data-name="Tracé 2878" d="M195.437,59.5h-1.581V57.92a.473.473,0,0,0-.473-.474h-.645a.474.474,0,0,0-.473.474V59.5h-1.581a.473.473,0,0,0-.473.473v.645a.473.473,0,0,0,.473.473h1.581v1.581a.473.473,0,0,0,.473.473h.645a.472.472,0,0,0,.473-.473V61.092h1.581a.474.474,0,0,0,.474-.473v-.645A.473.473,0,0,0,195.437,59.5Z" fill="#424242"/>
  </g>
</svg>
