<svg xmlns="http://www.w3.org/2000/svg" width="26.077" height="26.027" viewBox="0 0 26.077 26.027">
  <g id="Groupe_727" data-name="Groupe 727" transform="translate(-946.535 -755.116)">
    <path id="Tracé_1" data-name="Tracé 1" d="M425.557,544.812c-.031.072-.075.136-.04.215s.085.157.123.237a1.033,1.033,0,0,0,.062.115c.023.036.07.07.088.107a.093.093,0,0,1,0,.048.081.081,0,0,0,.014.06c.03.05.061.1.092.147.059.091.118.182.178.272.03.047.087.1.076.164-.016.094-.161.108-.233.129l-.321.089a18.809,18.809,0,0,1-2.613.526,17.508,17.508,0,0,1-2.74.113q-.684-.023-1.366-.092-.327-.033-.652-.075a.535.535,0,0,1-.217-.063.258.258,0,0,1-.085-.082.353.353,0,0,1-.02-.161c-.034-.929-.012-1.86-.013-2.79,0-.231,0-.462,0-.693,0-.137-.042-.351.089-.446a.33.33,0,0,1,.185-.049c.11,0,.22,0,.331,0h8.75a.419.419,0,0,1,.262.054c.11.088-.078.238-.135.3q-.239.244-.482.484-.492.49-.981.981c-.073.074-.144.15-.221.221A.349.349,0,0,0,425.557,544.812Z" transform="translate(528.705 225.64)" fill="#c4c4c4"/>
    <path id="Tracé_2" data-name="Tracé 2" d="M602.954,667.495c0,.085-.083.041-.133.07a1.917,1.917,0,0,0-.263.2c-.167.137-.325.285-.488.426a10.171,10.171,0,0,1-1.079.793,13.692,13.692,0,0,1-2.383,1.243q-.625.25-1.274.436-.324.093-.653.172c-.111.027-.223.053-.335.076s-.235.053-.352.066c-.236.026-.469.066-.705.089s-.476.039-.715.049c-.48.021-.961.016-1.442.008a4.856,4.856,0,0,1-.7-.051c-.113-.018-.22-.058-.335-.067-.052,0-.1,0-.157,0s-.117-.011-.175-.017a3.442,3.442,0,0,1-.64-.108c-.05-.015-.1-.032-.147-.052s-.092-.034-.1-.093.049-.084.1-.1a18.172,18.172,0,0,0,2.573-.841c.848-.339,1.682-.721,2.493-1.141a26.622,26.622,0,0,0,4.586-3.057.751.751,0,0,1,.244-.158.225.225,0,0,1,.226.084c.172.165.338.336.507.5.337.338.673.677,1.013,1.013l.244.239C602.917,667.336,603.022,667.405,602.954,667.495Z" transform="translate(365.765 109.924)" fill="#c1c1c1"/>
    <path id="Tracé_3" data-name="Tracé 3" d="M464.708,321.379a.2.2,0,0,0,.058,0c.01-.005.021-.029.028-.038.019-.025.037-.051.058-.074a.587.587,0,0,1,.153-.1c.04-.025.077-.056.117-.082a.571.571,0,0,0,.13-.1.248.248,0,0,0,.058-.131.159.159,0,0,0-.065-.135,1.818,1.818,0,0,1-.218-.207.282.282,0,0,1-.051-.128.132.132,0,0,1,.012-.089,1.091,1.091,0,0,1,.071-.094,4.305,4.305,0,0,0,.256-.388,3.172,3.172,0,0,0,.344-.834c.03-.124.026-.3.126-.388a.261.261,0,0,1,.188-.059l.278-.011c.363-.012.726-.015,1.089-.006l.278.009.116.005a.7.7,0,0,1,.162.009c.118.038.149.179.142.286a4.578,4.578,0,0,1-.135.762,5.046,5.046,0,0,1-1.486,2.586,5.5,5.5,0,0,1-1.4.917,4.542,4.542,0,0,1-.889.305,4.139,4.139,0,0,1-.944.093.51.51,0,0,0-.322.127c-.058.045-.2.189-.276.148-.127-.07.027-.184.075-.245q.15-.194.307-.383a12.049,12.049,0,0,1,1.375-1.41C464.466,321.609,464.588,321.5,464.708,321.379Z" transform="translate(486.651 436.706)" fill="#528ff4"/>
    <path id="Tracé_4" data-name="Tracé 4" d="M427.468,478.985a.627.627,0,0,1-.1.274.485.485,0,0,1-.17.088q-.109.048-.219.092a7.814,7.814,0,0,1-.857.285,11.71,11.71,0,0,1-1.809.327,12.3,12.3,0,0,1-3.813-.16c-.069-.014-.14-.027-.208-.044-.044-.011-.161-.038-.183-.083-.011-.023,0-.09.006-.116s0-.071.006-.106c.005-.077.011-.155.019-.232a2.959,2.959,0,0,1,.077-.446,2.034,2.034,0,0,1,.064-.2c.008-.021.024-.09.041-.1s.105.005.133.007c.309.023.613.084.919.129a9.253,9.253,0,0,0,.948.08,10.992,10.992,0,0,0,3.7-.414,12.41,12.41,0,0,0,1.672-.654c.06-.028.119-.059.179-.087s.146-.071.2-.052a.133.133,0,0,1,.082.119.26.26,0,0,1-.063.127,5.192,5.192,0,0,0-.434.759C427.588,478.71,427.527,478.847,427.468,478.985Z" transform="translate(526.62 286.88)" fill="#4e8cf4"/>
    <path id="Tracé_5" data-name="Tracé 5" d="M744.071,360c0,.05.03.048.064.063a.591.591,0,0,1,.134.083c.036.032.064.071.1.1s.09.064.134.1a1.009,1.009,0,0,1,.119.1.721.721,0,0,1,.079.076.086.086,0,0,1,.016.086c-.007.02-.027.052-.046.053a.331.331,0,0,1-.066-.018c-.2-.039-.207.177-.234.318q-.073.385-.167.765c-.123.5-.271.992-.436,1.479q-.124.366-.26.727a1.674,1.674,0,0,1-.118.278.149.149,0,0,1-.115.088.3.3,0,0,1-.171-.089,2.5,2.5,0,0,1-.225-.212,3.177,3.177,0,0,0-.481-.455,2.176,2.176,0,0,1-.392-.292.333.333,0,0,1-.09-.2.4.4,0,0,1,0-.062c0-.037.011-.04.049-.037a.28.28,0,0,1,.139.07c.061.046.209.2.286.108a.612.612,0,0,0,.084-.182q.069-.181.131-.364a14.584,14.584,0,0,0,.411-1.494c.057-.252.109-.505.159-.759a3.439,3.439,0,0,1,.111-.509c.027-.074.069-.132.154-.126a1.221,1.221,0,0,1,.364.136A.737.737,0,0,1,744.071,360Z" transform="translate(223.487 397.914)" fill="#3b6dd7"/>
    <path id="Tracé_6" data-name="Tracé 6" d="M681.309,388.382a1.028,1.028,0,0,1-.3-.187.837.837,0,0,0-.128-.1c-.054-.031-.113-.055-.166-.089a.149.149,0,0,0-.061-.031.153.153,0,0,1-.071-.018c-.061-.032-.124-.062-.187-.09s-.12-.051-.181-.075l-.082-.031c-.022-.008-.073-.018-.089-.037-.035-.042.016-.081.039-.113a.244.244,0,0,0,.039-.155c.006-.14,0-.28,0-.419a1.566,1.566,0,0,1,.015-.192.691.691,0,0,1,.077-.2q.088-.184.173-.37c.223-.488.428-.985.613-1.489q.07-.192.136-.385c.027-.078.045-.163.078-.239a.115.115,0,0,1,.153-.07c.1.031.083.248.081.332-.008.562,0,1.124,0,1.685,0,.282,0,.564,0,.846s-.063.54-.063.812a.705.705,0,0,0,.13.482.46.46,0,0,0,.191.118,1.279,1.279,0,0,1,.272.086.357.357,0,0,1,.145.211,1,1,0,0,0,.159.295c.072.095.162.174.23.272s.153.223.227.336.142.222.209.335a.486.486,0,0,1,.07.151c.008.041.009.129-.048.137a.119.119,0,0,1-.107-.067c-.03-.054-.064-.105-.1-.156-.068-.1-.142-.194-.21-.293a3.508,3.508,0,0,0-.189-.3q-.128-.15-.265-.292t-.282-.275q-.067-.061-.135-.121a.767.767,0,0,0-.073-.062c-.019-.013-.045-.011-.061-.027s-.006-.031-.013-.045-.064-.047-.083-.062A1.75,1.75,0,0,0,681.309,388.382Z" transform="translate(281.778 374.928)" fill="#3a64ca"/>
    <path id="Tracé_7" data-name="Tracé 7" d="M418.7,506.483a1.269,1.269,0,0,1,.4.06,1.564,1.564,0,0,0,.17.05,1.268,1.268,0,0,0,.152,0,.244.244,0,0,1,.125.049c.02.012.016.012.042.009l.049,0a.626.626,0,0,1,.1.005c.122.015.238.058.361.066s.268-.006.4.007.273.033.41.045a3.556,3.556,0,0,0,.41,0c.146,0,.292,0,.437,0a10.723,10.723,0,0,0,1.7-.114,8.183,8.183,0,0,0,.817-.193c.268-.067.54-.119.8-.21.121-.042.24-.089.362-.126a1.785,1.785,0,0,1,.191-.048.389.389,0,0,0,.161-.049c.036-.024.077-.07.122-.076s.058.048.063.089a.8.8,0,0,1-.08.339,3.947,3.947,0,0,0-.106.4q-.02.1-.035.192c-.011.071-.011.146-.025.216,0,.024-.007.037-.038.038s-.036-.017-.056-.031a.561.561,0,0,0-.161-.076,1.286,1.286,0,0,0-.367-.031h-5.261a3.143,3.143,0,0,0-.425.016,2.893,2.893,0,0,0-.39.086.992.992,0,0,1-.182.041c-.051,0-.147,0-.179-.041a.359.359,0,0,1-.037-.174.824.824,0,0,1,.017-.181A2.321,2.321,0,0,0,418.7,506.483Z" transform="translate(528.018 260.136)" fill="#4c8bf4"/>
    <path id="Tracé_8" data-name="Tracé 8" d="M418.109,524.1a.518.518,0,0,0,.334-.059,1.952,1.952,0,0,1,.349-.091,4.733,4.733,0,0,1,.782-.026h4.872c.135,0,.27,0,.4,0,.061,0,.12,0,.18,0,.037,0,.077,0,.1.032a.191.191,0,0,1,.006.1c0,.062,0,.126,0,.188v.49c0,.033.01.068-.034.07s-.08-.078-.089-.122c-.018-.089,0-.255-.092-.3a.667.667,0,0,0-.324-.029c-.133,0-.267,0-.4,0-1.078,0-2.156,0-3.235,0-.268,0-.536.005-.8,0s-.525-.023-.788-.01a4.1,4.1,0,0,0-.736.083,1.731,1.731,0,0,0-.334.12.274.274,0,0,1-.166.03c-.061-.011-.077-.105-.08-.16A1.516,1.516,0,0,1,418.109,524.1Z" transform="translate(528.547 243.216)" fill="#4c8af1"/>
    <path id="Tracé_9" data-name="Tracé 9" d="M701.3,371.274a.144.144,0,0,0,.181.018,1.415,1.415,0,0,0,.206-.2l.407-.409.824-.825c.269-.268.549-.529.808-.807.048-.051.126-.069.13.024s0,.179,0,.268v9.373c0,.044,0,.087,0,.13a.347.347,0,0,1,0,.113c-.022.057-.114.033-.16.034q-1.168,0-2.335,0h-7.037c-.092,0-.183,0-.274,0-.049,0-.162.015-.183-.049-.037-.115.346-.095.4-.1h8.782c.1,0,.2,0,.3,0a.861.861,0,0,0,.238-.01c.094-.024.119-.084.12-.176s0-.192,0-.288q0-.294,0-.588c0-.779-.006-1.558,0-2.336s.007-1.561,0-2.341-.007-1.569,0-2.353q0-.585.012-1.17c0-.06,0-.12,0-.178,0-.016.02-.056,0-.063s-.042.029-.05.036c-.036.033-.07.068-.1.1l-.212.21c-.545.543-1.084,1.092-1.632,1.632-.078.077-.184.221-.309.207a.217.217,0,0,1-.166-.134.193.193,0,0,1-.016-.1C701.226,371.261,701.264,371.242,701.3,371.274Z" transform="translate(268.758 389.133)" fill="#668de0"/>
    <path id="Tracé_10" data-name="Tracé 10" d="M424.079,530.559a.291.291,0,0,0,.191.059c.086,0,.173,0,.259,0h2.055c.079,0,.158,0,.237,0,.048,0,.141-.012.164.046.043.1-.264.108-.318.108-.163,0-.327,0-.49,0H422.02q-2.079,0-4.157,0c-.178,0-.356,0-.534,0a.372.372,0,0,0-.243.054.338.338,0,0,0-.069.266q0,.254,0,.508c0,.689-.016,1.379-.011,2.068s.046,1.377.057,2.066.005,1.378,0,2.067.007,1.378.007,2.066c0,.168.008.339,0,.507,0,.044-.017.086-.021.129s0,.067,0,.1,0,.044-.014.061a.074.074,0,0,1-.082,0c-.036-.027-.02-.1-.02-.137,0-.086,0-.173,0-.259V530.4q0-.122,0-.245c0-.033-.021-.18.044-.173.047,0,.044.131.045.169a1.129,1.129,0,0,0,0,.115.6.6,0,0,0,.034.11c.023.074,0,.158.078.2a.581.581,0,0,0,.243.015l.533,0,1.031,0c1.383,0,2.765,0,4.148,0h.5A1.616,1.616,0,0,0,424.079,530.559Z" transform="translate(529.602 237.512)" fill="#d1d1d1"/>
    <path id="Tracé_11" data-name="Tracé 11" d="M470.037,317.054a.15.15,0,0,1-.119-.108c-.017-.085.112-.069.161-.067.207.007.415,0,.622,0h6.165l2.468,0,1.228,0a2.03,2.03,0,0,1,.3,0c.084.013.163.046.247.058a1.768,1.768,0,0,0,.25-.006.522.522,0,0,1,.126.015,1.307,1.307,0,0,1,.125.052c.076.027.149-.007.225-.008a.163.163,0,0,1,.084.027c.024.014.073.028.084.051.046.092-.151.086-.192.087a1.952,1.952,0,0,1-.282-.012c-.2-.021-.387-.062-.582-.086a4.505,4.505,0,0,0-.59-.037,1.985,1.985,0,0,0-.3.02.7.7,0,0,1-.266,0,1.983,1.983,0,0,0-.309-.012l-.3-.008c-.41-.011-.821-.019-1.231-.02s-.812,0-1.218.02-.816.044-1.225.036-.8-.034-1.206-.037-.82.012-1.23.025c-.818.025-1.636.055-2.454.043l-.288-.006C470.23,317.077,470.136,317.066,470.037,317.054Z" transform="translate(479.696 438.243)" fill="#6f94e1"/>
    <path id="Tracé_12" data-name="Tracé 12" d="M418,550.623V543.2q0-.464,0-.928c0-.067,0-.134,0-.2s.005-.091.07-.094c.154-.007.31,0,.464,0h8.781a1.777,1.777,0,0,0,.4-.011c.055-.013.214-.117.215.011-.073-.014-.041.062-.067.1s-.066.021-.1.02a.179.179,0,0,1-.069-.01c-.025-.011-.036-.037-.057-.048a.409.409,0,0,0-.116,0h-8.826c-.152,0-.3,0-.455,0-.05,0-.129-.007-.162.041s-.021.157-.021.219q0,.244,0,.487v3.247a.38.38,0,0,0,0,.046.117.117,0,0,0,.029.061.649.649,0,0,1,.064.365q0,.969,0,1.938,0,.482,0,.963c0,.317.007.635,0,.951C418.144,550.427,418.13,550.672,418,550.623Z" transform="translate(528.6 226.274)" fill="#cacaca"/>
    <path id="Tracé_13" data-name="Tracé 13" d="M696.093,618.566c-.008-.039.021-.081-.021-.1-.023-.013-.052-.015-.077-.029a.358.358,0,0,1-.071-.06q-.149-.155-.3-.306l-.665-.665-.666-.664c-.045-.045-.089-.09-.131-.138a.4.4,0,0,0-.152-.087,1.187,1.187,0,0,1-.292-.255l-1.338-1.338-.677-.677c-.109-.109-.218-.219-.328-.327-.053-.052-.123-.137-.2-.138s-.155.075-.211.121c-.113.091-.226.183-.342.271s-.242.18-.367.265c-.058.039-.117.076-.176.114a.752.752,0,0,1-.147.086c-.044.016-.128.029-.162-.01s.022-.082.047-.115.013-.045.029-.067a.163.163,0,0,1,.054-.044c.062-.035.128-.064.19-.1a3.77,3.77,0,0,0,.664-.475q.075-.067.147-.137a2.016,2.016,0,0,1,.16-.159.151.151,0,0,1,.139-.04.472.472,0,0,1,.156.132l.679.679,1.343,1.342c.9.9,1.8,1.809,2.706,2.7a.217.217,0,0,1,.075.115C696.161,618.5,696.149,618.576,696.093,618.566Z" transform="translate(272.626 158.853)" fill="#ccc"/>
    <path id="Tracé_14" data-name="Tracé 14" d="M685,703.371c0-.011.008-.038.019-.046s.068,0,.086,0a.9.9,0,0,0,.184-.034c.057-.016.113-.037.171-.05s.1-.016.154-.025a.375.375,0,0,0,.145-.053.133.133,0,0,1,.071-.027c.035,0,.069-.009.1-.016a2.591,2.591,0,0,0,.363-.1c.24-.081.478-.169.716-.256s.491-.195.73-.306a15.426,15.426,0,0,0,1.4-.728,11.339,11.339,0,0,0,1.306-.881c.2-.16.4-.325.591-.492.1-.083.191-.168.282-.256.043-.042.082-.087.126-.127a.1.1,0,0,1,.06-.033c.016,0,.052.016.051.036s-.039.041-.049.057,0,.015,0,.021a.2.2,0,0,1-.025.036l-.064.075a3.06,3.06,0,0,1-.243.255,3.237,3.237,0,0,1-.282.218,3.407,3.407,0,0,0-.266.233,5.344,5.344,0,0,1-.613.465c-.214.144-.424.294-.641.434a10.125,10.125,0,0,1-1.38.728c-.119.053-.237.115-.36.158s-.216.091-.327.128c-.228.076-.442.194-.672.264-.12.037-.243.067-.365.1s-.237.083-.356.125a1.766,1.766,0,0,1-.361.091.484.484,0,0,0-.091.013.288.288,0,0,1-.068.023.8.8,0,0,0-.144.005c-.049.014-.076.055-.131.042A.174.174,0,0,1,685,703.371Z" transform="translate(277.1 77.416)" fill="#bababa"/>
    <path id="Tracé_15" data-name="Tracé 15" d="M565.081,749a11.248,11.248,0,0,0,1.577.058c.263,0,.526-.005.789,0a1.161,1.161,0,0,0,.341-.03.929.929,0,0,1,.321-.028.541.541,0,0,0,.147,0c.056-.011.1-.049.151-.064a.373.373,0,0,1,.132,0,.469.469,0,0,1,.154.022c.038.019.095.055.052.1a.208.208,0,0,1-.14.037.652.652,0,0,0-.29.028c-.026.012-.04.046-.066.054a.272.272,0,0,1-.074,0c-.036,0-.072,0-.108,0-.122.007-.243.03-.364.046a5.437,5.437,0,0,1-.765.015c-.266,0-.533.013-.8.011s-.512-.033-.767-.052c-.064,0-.128-.009-.192-.011a.812.812,0,0,1-.182,0c-.022-.007-.026-.015-.034-.035s0-.015-.008-.025a.079.079,0,0,0-.032-.012.507.507,0,0,0-.152-.016.634.634,0,0,1-.144-.01.255.255,0,0,1-.064-.024.169.169,0,0,0-.1-.021,1.694,1.694,0,0,1-.363-.053c-.056-.014-.111-.033-.166-.05a.761.761,0,0,0-.185-.015.144.144,0,0,1-.074-.02.22.22,0,0,0-.056-.028.772.772,0,0,0-.14-.008c-.05,0-.091-.027-.14-.033a1.6,1.6,0,0,1-.186-.034c-.116-.028-.228-.066-.341-.1s-.23-.073-.344-.115c-.051-.019-.1-.038-.154-.055l-.078-.023c-.026-.007-.081-.007-.1-.022s-.015-.052-.051-.068-.061-.011-.076-.038c-.049-.092.1-.109.155-.1.24.059.474.139.71.214.116.037.233.073.35.1s.238.044.352.079a.185.185,0,0,1,.1.084c.02.027.022.023.058.029a.925.925,0,0,1,.093.022,2.1,2.1,0,0,0,.315.085c.055.007.11,0,.165.012s.114.024.172.037a.779.779,0,0,0,.154.021c.027,0,.052,0,.079-.005s.052.017.083.024C564.891,748.99,564.995,748.941,565.081,749Z" transform="translate(392.955 31.903)" fill="#b9b9b9"/>
    <path id="Tracé_16" data-name="Tracé 16" d="M643.854,334.711a.071.071,0,0,1-.081.062.974.974,0,0,1-.115-.011,2.11,2.11,0,0,1-.218-.066l-.218-.065c-.139-.04-.279-.076-.418-.118-.121-.036-.245-.022-.361-.069a.377.377,0,0,0-.148-.026c-.072,0-.147-.028-.221-.031-.143-.006-.286.011-.429,0a.213.213,0,0,1-.156-.045.189.189,0,0,1-.047-.144c0-.15,0-.3,0-.451.009-1.23.005-2.46,0-3.69q0-.457,0-.914c0-.292.016-.587,0-.879a.476.476,0,0,1,.034-.283.245.245,0,0,1,.052-.059c.031-.026.042-.019.07.008a.212.212,0,0,1,.056.132,3.375,3.375,0,0,1,.008.414q0,.231,0,.463,0,1.84,0,3.681,0,.463,0,.926a2.488,2.488,0,0,0,.01.45c.023.125.188.159.3.167a3.134,3.134,0,0,1,.425.029c.137.029.272.064.406.1.252.073.506.137.752.226A.68.68,0,0,1,643.854,334.711Z" transform="translate(318.13 427.844)" fill="#3859b9"/>
    <path id="Tracé_17" data-name="Tracé 17" d="M607.056,630.995a.869.869,0,0,1-.127.214.61.61,0,0,1-.171.122,4.383,4.383,0,0,1-.463.2c-.175.066-.354.12-.534.17a4.373,4.373,0,0,1-.549.128,6.763,6.763,0,0,1-2.256-.04,5.554,5.554,0,0,1-.562-.144c-.083-.026-.164-.056-.247-.082a.676.676,0,0,1-.17-.068.244.244,0,0,1-.066-.062c-.022-.032-.046-.066-.012-.094.064-.051.13-.017.2.009.084.033.174.056.261.084a1.654,1.654,0,0,0,.288.085,1.011,1.011,0,0,1,.257.037.3.3,0,0,0,.1.03,1.032,1.032,0,0,0,.108-.008.2.2,0,0,1,.092.013c.036.016.052.044.093.044a1.449,1.449,0,0,1,.257.01c.085.015.169.036.254.047a1.863,1.863,0,0,0,.271,0,5.119,5.119,0,0,0,.593-.006,6.1,6.1,0,0,0,2.159-.6l.11-.063A.181.181,0,0,1,607.056,630.995Z" transform="translate(355.393 142.36)" fill="#cececf"/>
    <path id="Tracé_18" data-name="Tracé 18" d="M418.076,671.215a.051.051,0,0,1-.055-.032c-.01-.031.027-.071.04-.1a.913.913,0,0,1,.171-.206c.126-.134.259-.262.391-.391.277-.273.548-.551.823-.826l.421-.422c.131-.131.259-.269.4-.391.075-.065.161-.123.253-.054a1.916,1.916,0,0,1,.285.351c.209.258.446.494.643.763.049.067.1.136.138.208.034.057.1.143.048.208-.018.023-.014.017-.037,0a.367.367,0,0,1-.043-.032,1.156,1.156,0,0,1-.095-.079.623.623,0,0,1-.135-.187.646.646,0,0,0-.15-.161c-.066-.067-.128-.137-.188-.209-.121-.143-.234-.293-.345-.443l-.077-.1a.294.294,0,0,0-.09-.1.146.146,0,0,0-.163.049c-.134.13-.261.268-.393.4l-.85.85-.425.425c-.135.135-.277.266-.4.407C418.192,671.192,418.146,671.234,418.076,671.215Z" transform="translate(528.579 106.785)" fill="#bcbcbc"/>
    <path id="Tracé_19" data-name="Tracé 19" d="M417.868,436.191c0-.234.011-.47.005-.7,0-.055-.015-.11-.014-.165a.545.545,0,0,1,.029-.145.978.978,0,0,0,.041-.3.722.722,0,0,1,.013-.148c.011-.054.04-.1.049-.156.016-.094-.007-.191.015-.285a.289.289,0,0,1,.021-.061.171.171,0,0,0,.016-.079c0-.061.009-.121.017-.182.014-.113.036-.225.061-.336.049-.219.114-.435.168-.652a6.9,6.9,0,0,1,.183-.666c.16-.442.338-.881.529-1.311.094-.211.19-.422.3-.628a2.639,2.639,0,0,1,.167-.282c.03-.044.062-.086.095-.127.021-.026.044-.057.081-.051.089.016.034.188.014.244a1.183,1.183,0,0,1-.127.231,4.635,4.635,0,0,0-.311.537c-.1.2-.169.411-.256.617s-.18.417-.252.635-.138.431-.205.647-.121.442-.177.664a.5.5,0,0,1-.044.121c-.026.046-.065.079-.092.125a.952.952,0,0,0-.06.318c-.02.111-.046.222-.065.333a2.293,2.293,0,0,0-.028.338c0,.049-.031.072-.047.115a.646.646,0,0,0,0,.17,2.5,2.5,0,0,1-.044.316,1.991,1.991,0,0,0-.023.336v.265a.3.3,0,0,0,0,.089c.009.023.031.037.037.063a.129.129,0,0,1,0,.067C417.949,436.191,417.912,436.222,417.868,436.191Z" transform="translate(528.729 331.764)" fill="#528ff4"/>
    <path id="Tracé_20" data-name="Tracé 20" d="M512.151,721.206c-.019,0-.127-.011-.106.039.013.031.079.012.1.041.039.056-.073.041-.1.036a.593.593,0,0,1-.171-.062c-.242-.121-.5-.21-.742-.325s-.5-.258-.747-.394-.487-.274-.72-.428c-.111-.073-.215-.157-.326-.229-.085-.055-.179-.095-.258-.158-.051-.04-.2-.181-.079-.225.1-.039.226.074.3.126a12.8,12.8,0,0,0,1.447.852q.417.211.848.394c.124.053.248.11.377.151C512.067,721.053,512.149,721.094,512.151,721.206Z" transform="translate(442.924 59.001)" fill="#bbb"/>
    <path id="Tracé_21" data-name="Tracé 21" d="M557.542,596.671a.968.968,0,0,1-.461-.107,1.034,1.034,0,0,0-.232-.059.221.221,0,0,0-.062-.008c-.013,0-.027.023-.041.028a.136.136,0,0,1-.11-.011,6.211,6.211,0,0,1-.879-.466c-.143-.091-.281-.188-.415-.292q-.089-.069-.174-.143a1.781,1.781,0,0,1-.169-.2,3.052,3.052,0,0,0-.36-.33,1.216,1.216,0,0,1-.242-.223.3.3,0,0,1-.052-.189.4.4,0,0,0-.1-.225c-.048-.07-.1-.136-.147-.207A.472.472,0,0,1,554,594a.776.776,0,0,1,.233.3.865.865,0,0,0,.1.139.169.169,0,0,1,.03.062c.015.035.056.058.084.084a3.571,3.571,0,0,1,.275.336,3.017,3.017,0,0,0,.319.321,6.415,6.415,0,0,0,1.528,1.04,4.605,4.605,0,0,0,.511.212q.138.047.278.086C557.406,596.59,557.555,596.6,557.542,596.671Z" transform="translate(400.494 177.207)" fill="#cfcfd0"/>
    <path id="Tracé_22" data-name="Tracé 22" d="M695.064,491.961c-.032-.006-.074.013-.1-.012-.047-.045,0-.1.039-.13a.141.141,0,0,1,.062-.036c.029-.008.031,0,.049-.028a1.6,1.6,0,0,1,.123-.169c.091-.1.2-.176.292-.27a.82.82,0,0,1,.138-.128.746.746,0,0,0,.165-.14,3.352,3.352,0,0,1,.318-.335,4.275,4.275,0,0,0,.344-.32c.114-.121.232-.238.349-.356a3.516,3.516,0,0,0,.33-.337c.072-.095.022-.2-.02-.3-.057-.134-.171-.248-.172-.4a.165.165,0,0,1,.156.063,1.459,1.459,0,0,1,.112.206,1.359,1.359,0,0,1,.129.309c.041.179-.116.316-.23.431-.222.224-.451.442-.673.665s-.433.438-.652.655q-.184.183-.37.363a1.183,1.183,0,0,1-.193.177C695.2,491.906,695.115,491.91,695.064,491.961Z" transform="translate(267.733 276.11)" fill="#3d68cd"/>
    <path id="Tracé_23" data-name="Tracé 23" d="M447.116,371.591l-.116.058a.782.782,0,0,1,.162-.373c.088-.128.172-.258.258-.388.182-.275.371-.545.572-.806s.426-.524.653-.773.455-.5.7-.731c.119-.112.25-.211.374-.318a2.389,2.389,0,0,0,.185-.175.516.516,0,0,1,.077-.085c.031-.019.063,0,.1-.009.018.128-.083.2-.18.258a1.993,1.993,0,0,0-.341.289,1.626,1.626,0,0,1-.336.3.392.392,0,0,0-.155.126c-.019.03-.025.065-.041.1a.358.358,0,0,1-.072.092c-.122.118-.244.232-.359.357s-.224.255-.332.385l-.163.2-.082.1a.5.5,0,0,0-.079.1.287.287,0,0,0-.009.093.241.241,0,0,1-.047.106c-.046.072-.1.14-.145.212-.1.155-.188.32-.284.478a2.647,2.647,0,0,1-.179.219C447.224,371.455,447.191,371.547,447.116,371.591Z" transform="translate(501.281 390.093)" fill="#7aa9f6"/>
    <path id="Tracé_24" data-name="Tracé 24" d="M643.98,317.754c-.013-.074.086-.057.13-.06.085,0,.17-.012.255-.016a1.188,1.188,0,0,1,.227.009c.077.012.15.04.228.046a1.331,1.331,0,0,1,.424.042c.017.007.034.02.051.026a.091.091,0,0,0,.058,0,.655.655,0,0,1,.1,0,1.658,1.658,0,0,1,.24.036,1.389,1.389,0,0,0,.22.031c.085,0,.169,0,.254,0a3.119,3.119,0,0,1,.477.084,3.151,3.151,0,0,0,.473.09,2.89,2.89,0,0,1,.436.116c.318.076.616.207.925.31.041.014.021.02.042.046s.038.025.05.044c.044.072-.053.1-.108.1a1.328,1.328,0,0,1-.366-.107c-.159-.039-.314-.1-.471-.148s-.322-.094-.484-.137q-.485-.127-.979-.215-.548-.1-1.1-.144-.142-.012-.284-.02l-.132-.007a.99.99,0,0,1-.148-.023c-.09-.018-.182-.022-.273-.034A.393.393,0,0,1,643.98,317.754Z" transform="translate(315.739 437.485)" fill="#6088de"/>
    <path id="Tracé_25" data-name="Tracé 25" d="M425.155,539.031c-.005.026.008.054,0,.079-.014.045-.073.039-.111.039-.117,0-.235,0-.352,0H422.5l-2.917,0H418.5a1.485,1.485,0,0,0-.286.013.15.15,0,0,1-.085,0,.087.087,0,0,1-.034-.025c-.022-.025-.027-.04,0-.06a.434.434,0,0,1,.263-.067c.231,0,.462,0,.693,0h5.108c.241,0,.486.012.727,0a1.292,1.292,0,0,0,.168-.023.225.225,0,0,1,.082-.008c.018,0,.012-.005.019.01A.155.155,0,0,1,425.155,539.031Z" transform="translate(528.526 229.041)" fill="#adbad4"/>
    <path id="Tracé_26" data-name="Tracé 26" d="M602.334,449.645c-.041.006-.059-.027-.082-.053-.038-.043-.082-.082-.122-.123l-.269-.269-.523-.522-1.052-1.053c-.079-.08-.158-.16-.241-.236-.03-.028-.051-.059-.009-.088a.12.12,0,0,1,.131,0,1.634,1.634,0,0,1,.434.37c.139.151.29.289.432.437q.246.258.5.513c.19.193.383.384.581.569a1.264,1.264,0,0,1,.232.257.361.361,0,0,1,.064.15C602.408,449.643,602.377,449.664,602.334,449.645Z" transform="translate(357.153 315.406)" fill="#588ae5"/>
    <path id="Tracé_27" data-name="Tracé 27" d="M550.979,544c.049.01.106-.021.115.05a.075.075,0,0,1-.032.074c-.038.034-.074.069-.11.105l-.464.465-.929.929c-.155.155-.323.3-.469.468-.017.019-.031.047-.057.055a.072.072,0,0,1-.086-.027c-.027-.062.1-.16.139-.2l.939-.94.523-.524.261-.263C550.868,544.137,550.963,544.087,550.979,544Z" transform="translate(405.257 224.303)" fill="#bebebe"/>
    <path id="Tracé_28" data-name="Tracé 28" d="M471.989,319c0-.065.074-.071.123-.052a.816.816,0,0,1,.245.189c.167.157.332.318.494.48.323.322.641.648.963.97a.331.331,0,0,1,.078.1c.018.044.006.09.022.134.029.079.13.141.189.2a.981.981,0,0,1,.094.1c.015.019.09.1.027.1-.012,0-.015-.01-.023-.014l-.021-.006a.108.108,0,0,1-.043-.024c-.033-.033-.064-.07-.1-.1l-1-1-.563-.563-.277-.278c-.049-.049-.1-.1-.147-.147C472.023,319.064,471.983,319.044,471.989,319Z" transform="translate(477.744 436.298)" fill="#5d8de6"/>
    <path id="Tracé_29" data-name="Tracé 29" d="M566.543,444.8a.372.372,0,0,0-.134.009c-.043.017-.085.043-.127.064-.088.043-.176.086-.263.13a2.814,2.814,0,0,0-.49.3c-.15.121-.318.216-.468.337a5.381,5.381,0,0,0-.434.4l-.1.1a.472.472,0,0,1-.1.09c-.093.049-.074-.141-.051-.186a.847.847,0,0,1,.169-.192q.1-.1.2-.192a6.221,6.221,0,0,1,.88-.687,5.066,5.066,0,0,1,.551-.306c.081-.039.184-.105.273-.059A.151.151,0,0,1,566.543,444.8Z" transform="translate(390.738 317.934)" fill="#5185e5"/>
    <path id="Tracé_30" data-name="Tracé 30" d="M481.678,695.3a.054.054,0,0,0-.055.032c-.015.023.01.015-.018.027a.126.126,0,0,1-.047,0c-.034-.005-.059-.042-.083-.064s-.062-.056-.094-.083c-.128-.109-.262-.209-.393-.314-.273-.217-.528-.458-.779-.7l-.174-.171c-.049-.048-.1-.069-.1-.144a.349.349,0,0,1,0-.1c.02-.027.085,0,.107.006a.851.851,0,0,1,.188.167c.252.242.516.473.784.7q.227.189.459.372C481.564,695.107,481.708,695.163,481.678,695.3Z" transform="translate(470.261 83.22)" fill="#bcbcbc"/>
    <path id="Tracé_31" data-name="Tracé 31" d="M784.343,369.9c-.091,0-.148.021-.211-.058s-.127-.155-.191-.232q-.222-.27-.448-.537c-.147-.172-.308-.331-.471-.487s-.3-.309-.464-.453a2.492,2.492,0,0,1-.182-.23,1.036,1.036,0,0,0-.228-.2.541.541,0,0,1-.106-.064c-.034-.035-.029-.082.027-.087s.1.049.131.077l.139.107c.09.069.179.139.262.217s.165.172.248.258c.167.171.342.334.511.5A7.773,7.773,0,0,1,784.343,369.9Z" transform="translate(185.712 390.504)" fill="#668ddf"/>
    <path id="Tracé_32" data-name="Tracé 32" d="M722.058,332.046,722,331.93c.177-.029.324.093.477.16.189.082.386.147.569.242s.334.187.5.274a2.153,2.153,0,0,1,.482.311c-.077.078-.168.032-.254,0s-.173-.074-.257-.116c-.178-.088-.349-.187-.525-.28a3.439,3.439,0,0,0-.512-.229A.819.819,0,0,1,722.058,332.046Z" transform="translate(242.249 424.064)" fill="#7c9ee4"/>
    <path id="Tracé_33" data-name="Tracé 33" d="M639.359,441.536c.051,0,.064-.035.048-.076a1.327,1.327,0,0,1-.061-.17,1.745,1.745,0,0,1-.022-.384q0-.415,0-.83t0-.818c0-.123-.055-.655.186-.579a.74.74,0,0,0,.216.012h.455c.046,0,.112-.008.107.058-.139,0-.277,0-.416,0-.065,0-.131,0-.2,0a.385.385,0,0,0-.157,0c-.068.031-.046.147-.045.2q0,.209,0,.418,0,.824,0,1.647c0,.147,0,.294.007.44,0,.042,0,.11-.044.133S639.368,441.573,639.359,441.536Z" transform="translate(320.128 323.516)" fill="#90afec"/>
    <path id="Tracé_34" data-name="Tracé 34" d="M546.863,474.476c-.042-.141.082-.285.143-.4s.129-.267.2-.4a2.108,2.108,0,0,1,.242-.384.272.272,0,0,0,.056-.075.282.282,0,0,0,0-.1c0-.047.045-.084.07-.124a.458.458,0,0,1,.168-.195.228.228,0,0,1,.138-.012c.038.007.032.017.032.054s-.03.07-.063.1a3.556,3.556,0,0,0-.541.732c-.086.149-.165.3-.241.456a2.073,2.073,0,0,0-.1.214C546.943,474.4,546.928,474.458,546.863,474.476Z" transform="translate(407.224 291.389)" fill="#558ae8"/>
    <path id="Tracé_35" data-name="Tracé 35" d="M764.893,355.137a.2.2,0,0,1-.1-.014c-.033-.019-.046-.056-.073-.079s-.059-.024-.089-.042-.062-.036-.095-.052a1.8,1.8,0,0,1-.367-.2.5.5,0,0,1-.132-.168c-.012-.026-.022-.033,0-.047a.079.079,0,0,1,.06,0c.021.006.033.018.053.019a.261.261,0,0,1,.044,0c.051.01.079.061.116.093a.136.136,0,0,0,.062.031c.021.005.023,0,.041.014a.8.8,0,0,1,.057.057,1.55,1.55,0,0,0,.258.187C764.819,354.985,764.909,355.016,764.893,355.137Z" transform="translate(202.665 402.773)" fill="#678edf"/>
    <path id="Tracé_36" data-name="Tracé 36" d="M707,462c.04.008.071-.008.107.019a1.113,1.113,0,0,1,.112.112l.231.232.224.223c.037.037.077.073.112.112s.017.068.027.115A6.653,6.653,0,0,1,707,462Z" transform="translate(256.378 301.542)" fill="#4367c5"/>
    <path id="Tracé_37" data-name="Tracé 37" d="M679.083,320.208a1.422,1.422,0,0,1-.244-.014.716.716,0,0,0-.208-.053.3.3,0,0,1-.18-.015c-.033-.02-.037-.041-.078-.037a.641.641,0,0,1-.128.006.765.765,0,0,1-.118-.023.688.688,0,0,1-.127-.034c-.023-.011-.014.008-.02-.024a.089.089,0,0,1,0-.029c.008-.016.033-.01.055-.01q.071,0,.141.006a2.394,2.394,0,0,1,.527.1.59.59,0,0,0,.237.058C679.005,320.136,679.06,320.134,679.083,320.208Z" transform="translate(283.714 435.322)" fill="#81a1e5"/>
    <path id="Tracé_38" data-name="Tracé 38" d="M755.56,349.308a.856.856,0,0,0-.132,0,.227.227,0,0,1-.088,0,.749.749,0,0,1-.166-.08c-.028-.014-.059-.017-.086-.029a.405.405,0,0,1-.065-.05.239.239,0,0,1-.1-.121.145.145,0,0,1,0-.041c0-.03,0-.025.024-.032a.271.271,0,0,1,.068,0c.033,0,.026,0,.042.029.033.054.1.059.151.076A.636.636,0,0,1,755.56,349.308Z" transform="translate(211.243 408.022)" fill="#688ee0"/>
    <path id="Tracé_39" data-name="Tracé 39" d="M504.94,357.972a.3.3,0,0,1,.058,0s0,.032,0,.037a.391.391,0,0,1,0,.08.181.181,0,0,1-.085.115c-.069.052-.107.149-.2.172a.1.1,0,0,1-.07,0c-.031-.021-.008-.035.006-.053a.6.6,0,0,1,.1-.128c.044-.035.1-.042.144-.075A.145.145,0,0,0,504.94,357.972Z" transform="translate(446.999 399.531)" fill="#75a5f6"/>
    <path id="Tracé_40" data-name="Tracé 40" d="M594.676,758.99c.044-.007.053.049.09.055s.076,0,.111,0a.765.765,0,0,1,.091.017c.066.016.131.038.2.047a.44.44,0,0,0,.11,0c.017,0,.031-.009.044,0a.028.028,0,0,1,.006.04c-.027.041-.157.019-.2.014-.071-.009-.141-.027-.211-.043-.035-.008-.07-.015-.106-.02a.667.667,0,0,1-.107-.009C594.688,759.088,594.624,758.99,594.676,758.99Z" transform="translate(362.199 21.797)" fill="#bcbcbc"/>
    <path id="Tracé_41" data-name="Tracé 41" d="M677.991,759.616c0-.042-.008-.058.034-.075a.386.386,0,0,1,.081-.02c.056-.009.111-.022.167-.034a.4.4,0,0,1,.183-.011.329.329,0,0,0,.087.024h.029l.014-.013c.014,0,.025-.007.036.006a.048.048,0,0,1-.008.049c-.013.011-.054,0-.072.006a1.391,1.391,0,0,0-.183.032A.926.926,0,0,1,677.991,759.616Z" transform="translate(283.703 21.345)" fill="#c1c1c1"/>
    <path id="Tracé_42" data-name="Tracé 42" d="M704,754.112a.5.5,0,0,1,.406-.116A.5.5,0,0,1,704,754.112Z" transform="translate(259.203 26.501)" fill="#bababa"/>
    <path id="Tracé_43" data-name="Tracé 43" d="M606,761.058V761a.427.427,0,0,0,.281.06c.057,0,.119-.023.125.056h-.268C606.085,761.116,605.99,761.134,606,761.058Z" transform="translate(351.517 19.903)" fill="#bbb"/>
    <path id="Tracé_44" data-name="Tracé 44" d="M691,451c.119.021.238.043.29.174C691.171,451.154,691.053,451.132,691,451Z" transform="translate(271.449 311.904)" fill="#4367c5"/>
    <path id="Tracé_45" data-name="Tracé 45" d="M501.232,364c0,.009.007.05,0,.058s-.03.009-.039.014a.238.238,0,0,0-.064.057c-.037.042-.07.091-.129.1A.261.261,0,0,1,501.232,364Z" transform="translate(450.417 393.852)" fill="#7aa9f6"/>
    <path id="Tracé_46" data-name="Tracé 46" d="M671,762.029c-.006-.076.089-.058.138-.058h.268c.006.076-.089.058-.138.058Z" transform="translate(290.291 18.99)" fill="#c1c1c1"/>
    <path id="Tracé_47" data-name="Tracé 47" d="M702,457.99c.128-.009.181.081.232.174C702.1,458.173,702.051,458.084,702,457.99Z" transform="translate(261.087 305.319)" fill="#4367c5"/>
    <path id="Tracé_48" data-name="Tracé 48" d="M780.232,366.1c-.1,0-.206,0-.232-.116C780.1,365.976,780.2,365.98,780.232,366.1Z" transform="translate(187.616 391.988)" fill="#6c92e0"/>
    <path id="Tracé_49" data-name="Tracé 49" d="M722,748.1a.284.284,0,0,1,.29-.116A.284.284,0,0,1,722,748.1Z" transform="translate(242.249 32.166)" fill="#bababa"/>
    <path id="Tracé_50" data-name="Tracé 50" d="M727,746.1a.284.284,0,0,1,.29-.116A.284.284,0,0,1,727,746.1Z" transform="translate(237.539 34.05)" fill="#bababa"/>
    <path id="Tracé_51" data-name="Tracé 51" d="M586,757.975c.073,0,.148,0,.221,0a.088.088,0,0,1,.055.013c.017.015.022.046,0,.058a.037.037,0,0,1-.029,0,.022.022,0,0,0-.025-.012H586.1C586.05,758.033,585.992,758.037,586,757.975Z" transform="translate(370.356 22.754)" fill="#bebebf"/>
    <path id="Tracé_52" data-name="Tracé 52" d="M590,758.991h.259c.019,0,.025,0,.032.01a.181.181,0,0,1,0,.048h-.21C590.034,759.048,589.992,759.044,590,758.991Z" transform="translate(366.588 21.796)" fill="#c1c1c1"/>
    <path id="Tracé_53" data-name="Tracé 53" d="M688.054,759.051H688c0-.053.038-.057.08-.058h.21c0,.043-.024.055-.062.058C688.168,759.055,688.11,759.051,688.054,759.051Z" transform="translate(274.278 21.794)" fill="#bababa"/>
    <path id="Tracé_54" data-name="Tracé 54" d="M422.43,610.04c-.093-.046-.228-.093-.275-.195-.021-.046,0-.1-.031-.143s-.081-.075-.115-.113c-.207-.231-.41-.464-.6-.708-.045-.058-.09-.116-.133-.176a.568.568,0,0,0-.113-.148c-.03-.02-.052-.006-.078.015a2.058,2.058,0,0,0-.153.15l-.679.679-.344.343-.164.163c-.035.035-.074.1-.119.122a.639.639,0,0,1-.186.039,1.086,1.086,0,0,1-.224.007,1.139,1.139,0,0,1-.4-.11c-.028-.013-.053-.028-.052-.063,0-.016.011-.024.014-.038a.282.282,0,0,0,0-.058v-4.355c0-.016-.012-.1,0-.116s.06,0,.077.007c.04.018.071.051.117.054a1.025,1.025,0,0,1,.2,0,1.243,1.243,0,0,0,.2.041c.076.006.152,0,.227.005.149,0,.29.05.439.054a2.3,2.3,0,0,1,.437.031,4.487,4.487,0,0,0,.92.042c.323,0,.646.006.969,0a3.485,3.485,0,0,0,.463-.031,2.171,2.171,0,0,1,.454-.034c.014,0,.03,0,.044,0a.117.117,0,0,0,.059-.015.45.45,0,0,1,.094-.027,1.007,1.007,0,0,1,.2-.009,2.626,2.626,0,0,0,.406-.036c.069-.009.139-.018.207-.033s.146-.047.22-.062a1.768,1.768,0,0,1,.205-.022,2.06,2.06,0,0,0,.236-.038c.311-.063.621-.135.927-.216.143-.038.286-.077.431-.109.068-.015.137-.031.2-.051s.135-.054.2-.077a.475.475,0,0,1,.185,0,.228.228,0,0,1,.057,0,.18.18,0,0,1,.014.033.826.826,0,0,0,.05.094.851.851,0,0,0,.254.26.725.725,0,0,1,.13.145,2.155,2.155,0,0,0,.151.159q.072.069.15.131a.39.39,0,0,1,.073.064c.022.028.039.058.062.085a1.032,1.032,0,0,0,.32.208c.122.067.235.148.35.226a3.629,3.629,0,0,0,.746.408q.049.018.1.033a.158.158,0,0,1,.075.05.388.388,0,0,0,.155.082l.372.112a6.88,6.88,0,0,0,.895.191,3.016,3.016,0,0,0,.451.038c.069,0,.14-.007.209,0s.133.023.2.026a1.144,1.144,0,0,0,.2-.029,1.124,1.124,0,0,1,.228,0,1.514,1.514,0,0,0,.2.011,1.327,1.327,0,0,0,.209-.037,1.209,1.209,0,0,1,.19-.032.528.528,0,0,1,.1,0c.018,0,.032,0,.04.015s0,.038-.008.049c-.024.047-.093.072-.136.1l-.2.112q-.384.21-.774.407-.782.395-1.589.736a21.9,21.9,0,0,1-3.322,1.1,26.16,26.16,0,0,1-3.692.571A.89.89,0,0,1,422.43,610.04Z" transform="translate(527.883 167.03)" fill="#c3c3c3"/>
    <path id="Tracé_55" data-name="Tracé 55" d="M482,620.634a1.1,1.1,0,0,0,.352.072,1.978,1.978,0,0,0,.356-.034c.126-.018.252-.018.379-.024s.252-.029.378-.044c.254-.031.511-.049.764-.091.127-.021.256-.03.383-.053s.245-.031.364-.063c.217-.058.447-.048.661-.118a.517.517,0,0,1,.152-.05,1.284,1.284,0,0,0,.19-.014,2.529,2.529,0,0,0,.348-.082c.48-.141.965-.265,1.444-.413q.742-.229,1.464-.517c.476-.189.939-.409,1.409-.613a5.6,5.6,0,0,0,.645-.311c.193-.115.4-.2.593-.311a2.16,2.16,0,0,0,.274-.183.3.3,0,0,1,.125-.059c.045-.008.1.019.139,0a.045.045,0,0,0,.029-.029c.011-.028,0-.032.033-.052a.427.427,0,0,1,.151-.058c.112-.025.222-.049.332-.084a4.505,4.505,0,0,0,.691-.252c.1-.051.2-.11.3-.162a.442.442,0,0,1,.145-.059.35.35,0,0,0,.152-.052c.191-.118.374-.257.557-.388a4.106,4.106,0,0,0,.53-.441c.032-.033.068-.087.113-.1s.09.031.121.063l.275.278.554.553,1.112,1.112.555.557c.08.08.16.157.243.232.027.025.076.075.055.109a.342.342,0,0,1-.07.056l-.078.064c-.4.323-.811.622-1.222.929s-.818.6-1.246.882-.859.551-1.3.8c-.217.124-.439.24-.66.357s-.437.242-.66.354-.449.213-.676.317-.458.214-.691.314c-.934.4-1.893.748-2.86,1.059a1.8,1.8,0,0,1-.319.076,1.115,1.115,0,0,1-.166.01c-.041,0-.1-.006-.088.055a.473.473,0,0,0-.151-.06c-.043-.006-.086-.013-.129-.021-.1-.018-.2-.041-.294-.064-.218-.053-.433-.115-.646-.186-.09-.03-.179-.062-.266-.1a.651.651,0,0,1-.065-.027.422.422,0,0,1-.065-.055.527.527,0,0,0-.157-.086c-.1-.037-.2-.063-.3-.107s-.2-.089-.3-.133c-.216-.093-.433-.186-.639-.3-.093-.05-.177-.115-.27-.164-.123-.064-.253-.112-.375-.178a8.173,8.173,0,0,1-.725-.461,1.742,1.742,0,0,1-.35-.252,1.884,1.884,0,0,0-.286-.24c-.119-.092-.238-.181-.358-.271s-.229-.21-.347-.311-.235-.192-.346-.3a2.145,2.145,0,0,1-.158-.164C482.062,620.722,482,620.69,482,620.634Z" transform="translate(468.314 156.437)" fill="#c2c2c2"/>
    <path id="Tracé_56" data-name="Tracé 56" d="M680.386,759.033a.489.489,0,0,0-.259.035.219.219,0,0,0-.031.023.056.056,0,0,0-.02-.017c-.016,0-.035-.009-.051-.014-.032-.011-.064-.033-.034-.068s.074-.016.1-.016c.055,0,.111,0,.166,0S680.381,758.958,680.386,759.033Z" transform="translate(281.831 21.812)" fill="#b4b4b5"/>
    <path id="Tracé_57" data-name="Tracé 57" d="M609.344,760.055H609.1c-.046,0-.11.006-.1-.058h.243C609.285,760,609.349,759.991,609.344,760.055Z" transform="translate(348.691 20.848)" fill="#bcbcbc"/>
    <path id="Tracé_58" data-name="Tracé 58" d="M677.173,760c.052.01.112-.021.116.058h-.2c-.045,0-.092,0-.09-.058Z" transform="translate(284.637 20.845)" fill="#b4b4b4"/>
    <path id="Tracé_59" data-name="Tracé 59" d="M454,325.4a1.961,1.961,0,0,1,.3-.431c.055-.076.106-.154.16-.231a.325.325,0,0,1,.084-.1.679.679,0,0,0,.1-.069,1.747,1.747,0,0,0,.137-.184.319.319,0,0,1,.172-.086.541.541,0,0,1,.117,0c.043,0,.086-.007.13-.006.085,0,.169.015.254.01a.444.444,0,0,0,.119-.022.366.366,0,0,0,.054-.023.111.111,0,0,1,.08-.009,1,1,0,0,0,.283-.021,3.751,3.751,0,0,0,.562-.154,5.968,5.968,0,0,0,1.024-.507,3.659,3.659,0,0,0,.452-.314c.07-.058.135-.124.206-.18s.146-.107.211-.169a5.429,5.429,0,0,0,1.455-3.042c.01-.1.016-.2.02-.3a.23.23,0,0,1,0-.068c.01-.02.04-.018.067-.022.052-.007.1-.012.156-.016.2-.013.4,0,.6,0h.145a.408.408,0,0,1,.067,0,.132.132,0,0,1,.062.035.279.279,0,0,1,.1.162,1.182,1.182,0,0,1-.033.369,6.109,6.109,0,0,1-.645,2.128,6.726,6.726,0,0,1-1,1.431,5.863,5.863,0,0,1-1.292,1.05,6.444,6.444,0,0,1-1.572.668,7.8,7.8,0,0,1-.89.193,7.4,7.4,0,0,1-1.217.047A.674.674,0,0,1,454,325.4Z" transform="translate(494.688 435.819)" fill="#528ef4"/>
    <path id="Tracé_60" data-name="Tracé 60" d="M476.717,321.155c-.046.012-.107-.079-.135-.106l-.188-.187-.359-.359-.726-.726-.163-.163-.1-.1a.394.394,0,0,1-.067-.065c-.022-.039.005-.038.039-.042l.113-.012c.091-.008.181-.013.272-.015.333-.01.666.011,1,.008a6.665,6.665,0,0,1,1.125.025c-.046.183-.068.371-.117.553a3.533,3.533,0,0,1-.193.5,1.473,1.473,0,0,1-.266.424.545.545,0,0,0-.112.153A.173.173,0,0,1,476.717,321.155Z" transform="translate(474.932 435.885)" fill="#548ff4"/>
    <path id="Tracé_61" data-name="Tracé 61" d="M476.612,318.032h-2.394a1.526,1.526,0,0,1-.161,0c-.037,0-.06-.016-.058-.058h3.39l1.7,0c.281,0,.564.007.844-.02.133-.013.266-.029.4-.037s.27,0,.405,0c.553.01,1.108,0,1.662,0h1.024a1.323,1.323,0,0,1,.232,0c.044.008.05.039.053.079.006.062-.056.083-.107.1a1.417,1.417,0,0,1-.361.021q-.214.006-.428.007c-.281,0-.562-.007-.843,0s-.559,0-.838,0-.564,0-.845,0a.816.816,0,0,1-.34-.039c-.026-.012-.052-.042-.078-.052a.331.331,0,0,0-.092,0h-3.16Z" transform="translate(475.85 437.265)" fill="#5b95f4"/>
    <path id="Tracé_62" data-name="Tracé 62" d="M436.069,319.969h.3c.047,0,.1-.013.127.027a.249.249,0,0,1,.046.1.891.891,0,0,1,0,.243q-.006.156-.01.312c-.011.408-.012.816-.01,1.224s.006.824.005,1.236q0,.15,0,.3c0,.049,0,.1,0,.15a.768.768,0,0,1-.034.141,3.629,3.629,0,0,1-.193.506c-.152.331-.337.646-.506.969a7.216,7.216,0,0,1-.593.933c-.221.3-.459.586-.7.87-.047.055-.092.11-.138.166a.279.279,0,0,1-.134.1.173.173,0,0,1-.09,0c-.013,0-.036-.02-.049-.019a.277.277,0,0,0-.078.038q-.127.063-.252.13-.259.139-.507.3a1.056,1.056,0,0,0-.177.138.41.41,0,0,1-.168.117.15.15,0,0,0-.047.015.424.424,0,0,0-.05.05c-.034.033-.068.065-.1.1-.065.058-.133.114-.2.171a2.445,2.445,0,0,0-.391.365.316.316,0,0,0-.058.207.205.205,0,0,0-.192.108c-.039.064-.057.153-.138.179a.216.216,0,0,1-.059.006.18.18,0,0,0-.075.027l-.165.082q-.156.076-.312.15a10.567,10.567,0,0,1-1.3.515,10.364,10.364,0,0,1-1.368.352c-.06.01-.12.02-.18.026s-.115,0-.171.006a2.481,2.481,0,0,1-.27.065.683.683,0,0,0-.278.009c-.043.017-.072.051-.12.053s-.094-.009-.141-.009c-.5,0-.993.01-1.49,0a4.281,4.281,0,0,1-.707-.055,1.36,1.36,0,0,0-.338-.064,1.464,1.464,0,0,1-.328-.029,3.334,3.334,0,0,1-.334-.068c-.052-.014-.1-.029-.153-.047-.022-.008-.061-.016-.072-.035a.119.119,0,0,1,0-.069.652.652,0,0,1,.041-.106.481.481,0,0,0,.024-.141,1.877,1.877,0,0,1,.092-.313c.029-.106.046-.215.069-.322.01-.045.012-.069.053-.087a.25.25,0,0,0,.03-.012c.011-.006.021-.015.032-.021a.245.245,0,0,1,.066-.025.657.657,0,0,1,.273.028c.121.025.243.047.366.067a9.543,9.543,0,0,0,5.417-.672,9.233,9.233,0,0,0,2.109-1.279,9.463,9.463,0,0,0,2.888-3.946,8.519,8.519,0,0,0,.6-2.686A.913.913,0,0,1,436.069,319.969Z" transform="translate(523.07 435.328)" fill="#4f8cf4"/>
    <path id="Tracé_63" data-name="Tracé 63" d="M751.067,373.479a.171.171,0,0,1,.122.032c.052.043.1.1.144.145l.284.286.286.285c.095.094.2.184.287.284a.134.134,0,0,1,.039.113c-.007.025,0,.01-.017.018a.108.108,0,0,1-.032,0,.206.206,0,0,1-.069-.014.548.548,0,0,1-.177-.154c-.035-.037-.11-.122-.16-.065a.358.358,0,0,0-.047.133c-.019.066-.038.131-.056.2-.069.251-.125.5-.2.755s-.146.495-.228.74c-.162.487-.344.966-.537,1.441a.922.922,0,0,1-.149.3.161.161,0,0,1-.227,0c-.07-.056-.134-.128-.2-.19-.042-.04-.085-.078-.13-.115s-.085-.089-.128-.131c-.168-.167-.361-.309-.524-.482s-.332-.326-.493-.5c-.04-.042-.078-.084-.115-.128s-.093-.089-.075-.142c.038-.115.215.082.246.114.187.19.376.376.563.565.044.044.085.094.133.133s.04.017.054-.019c.043-.118.091-.234.134-.352.092-.247.178-.5.269-.743s.148-.486.223-.73a4.659,4.659,0,0,0,.192-.708,2.653,2.653,0,0,1,.076-.366c.035-.122.058-.246.088-.369a3.032,3.032,0,0,0,.067-.373.158.158,0,0,1,.06-.111c.035-.028.052,0,.082.022C750.917,373.413,750.973,373.5,751.067,373.479Z" transform="translate(217.13 385.07)" fill="#3a6cd6"/>
    <path id="Tracé_64" data-name="Tracé 64" d="M735.733,348.22c.055.006.076-.073.133-.023a.538.538,0,0,0,.084.075c.037.021.08.033.116.056a.785.785,0,0,1,.084.082.868.868,0,0,0,.109.082c.072.046.152.082.221.132s.1.109.167.148a.22.22,0,0,0,.041.02c.026.009.033,0,.026.033a.047.047,0,0,1-.062.036c-.077-.019-.13-.123-.191-.169a.183.183,0,0,0-.193-.036c-.068.038-.066.119-.068.187a1.733,1.733,0,0,1-.039.3c-.041.2-.079.4-.115.594-.077.419-.206.824-.316,1.235a4.491,4.491,0,0,1-.156.581c-.039.095-.089.185-.125.281s-.067.2-.1.3c-.015.051-.026.189-.11.151a.783.783,0,0,1-.192-.183,1.5,1.5,0,0,0-.2-.188,1.376,1.376,0,0,0-.213-.082.541.541,0,0,1-.255-.31.215.215,0,0,1-.023-.111c.01-.054.027-.108.041-.161q.039-.15.081-.3c.113-.41.235-.818.335-1.232.049-.205.092-.412.128-.62s.083-.422.109-.635c.012-.1.015-.2.022-.3,0-.07.026-.192.1-.217a.447.447,0,0,1,.393.149C735.627,348.131,735.677,348.179,735.733,348.22Z" transform="translate(230.606 408.993)" fill="#3c6ed7"/>
    <path id="Tracé_65" data-name="Tracé 65" d="M730.619,408.836a1.651,1.651,0,0,0,.213.248c.037.035.076.069.116.1a.751.751,0,0,1,.062.047c.026.025.011.039.014.073s.058.077.088.108.074.078.111.117a1.446,1.446,0,0,0,.109.1c.019.016.039.032.06.046a.16.16,0,0,1,.032.021c.011.014.006.025.008.044.006.05.042.091.044.146a.458.458,0,0,1-.035.159c-.037.106-.072.212-.119.315-.091.2-.2.395-.282.6a3.7,3.7,0,0,1-.3.623,2.058,2.058,0,0,1-.153.217c-.04.051-.093.089-.151.039a.188.188,0,0,1-.059-.146q-.009-.1-.015-.2c-.008-.13-.012-.261-.014-.392,0-.257,0-.515.006-.772q.006-.432.007-.864a1.175,1.175,0,0,1,.063-.381,1.712,1.712,0,0,1,.069-.17C730.519,408.875,730.548,408.8,730.619,408.836Z" transform="translate(234.384 351.629)" fill="#3965cc"/>
    <path id="Tracé_66" data-name="Tracé 66" d="M703,384.3a.686.686,0,0,1-.181-.149c-.052-.056-.113-.109-.16-.168a.3.3,0,0,1-.062-.209.419.419,0,0,0-.08-.2c-.013-.024-.023-.063-.05-.073s-.062.03-.084.054a.1.1,0,0,1-.159,0c-.1-.1-.25-.16-.337-.28-.1-.137-.037-.3-.045-.45a1.321,1.321,0,0,1,0-.273c.016-.1.031-.194.04-.292a11.47,11.47,0,0,0,.01-1.173c0-.4.008-.8.006-1.205,0-.2,0-.4,0-.6a.519.519,0,0,0,0-.15c-.014-.036-.046-.06-.055-.1-.014-.067.007-.177.084-.2s.133.071.178.11l.176.15a2.445,2.445,0,0,1,.324.325,1.309,1.309,0,0,1,.128.194.384.384,0,0,1,.048.111,1.208,1.208,0,0,1,.005.15q.009.306.011.613c0,.4,0,.8,0,1.2q0,.291,0,.583c0,.082-.008.2.075.249a.268.268,0,0,0,.171.012A4.433,4.433,0,0,1,703,384.3Z" transform="translate(261.252 379.884)" fill="#3a65cb"/>
    <path id="Tracé_67" data-name="Tracé 67" d="M682.582,360.12v.246c0,.049,0,.04-.036.067a.164.164,0,0,0-.043.061,1.134,1.134,0,0,0-.035.137c-.016.053-.054.087-.067.138a7.319,7.319,0,0,1-.315.877c-.116.292-.239.581-.349.874a3.076,3.076,0,0,1-.206.412c-.018.033-.063.152-.1.149-.054,0-.088-.131-.1-.173a2.393,2.393,0,0,1-.008-.4q0-.253,0-.507,0-.507,0-1.013c0-.327.011-.655,0-.982,0-.165-.008-.33-.006-.495,0-.082,0-.165.011-.247a.647.647,0,0,1,.038-.242c.069-.122.161-.049.233.023.056.056.1.124.153.183s.115.125.175.185c.115.116.235.226.35.343.055.055.108.112.163.166A.389.389,0,0,1,682.582,360.12Z" transform="translate(280.563 398.603)" fill="#3a65ca"/>
    <path id="Tracé_68" data-name="Tracé 68" d="M721.239,422.048v-1.708a.182.182,0,0,0-.019-.115c-.077-.112.024-.25.071-.353.062-.136.122-.273.181-.41s.12-.274.184-.409a.3.3,0,0,1,.079-.126.089.089,0,0,1,.068-.017c.025.009.017.013.017.038v2.369c0,.039.014.044.036.073a.229.229,0,0,1,.035.075.909.909,0,0,1,.016.2q.017.457,0,.914c0,.084-.005.168-.009.251a.286.286,0,0,1-.057.177c-.018.022-.038.036-.065.015s-.016-.042-.017-.066a.341.341,0,0,0-.065-.17c-.075-.119-.15-.236-.23-.352A2.064,2.064,0,0,1,721.239,422.048Z" transform="translate(243.009 342.133)" fill="#3865cb"/>
    <path id="Tracé_69" data-name="Tracé 69" d="M671.122,382v3.624c0,.027.007.028-.018.039a.127.127,0,0,1-.076-.007.626.626,0,0,1-.125-.082c-.044-.026-.093-.013-.139-.029s-.049-.053-.09-.059-.059.009-.087,0a.053.053,0,0,1-.035-.024c0-.007,0-.016-.008-.022s-.012-.019-.033-.034a.318.318,0,0,1-.113-.255c-.015-.279-.005-.56,0-.839,0-.145,0-.289.006-.434a1.17,1.17,0,0,1,.045-.4c.053-.15.13-.294.191-.441s.114-.287.168-.432.106-.272.143-.412C670.976,382.1,671.009,382.009,671.122,382Z" transform="translate(290.862 376.897)" fill="#3964c9"/>
    <path id="Tracé_70" data-name="Tracé 70" d="M417.984,531.318a.137.137,0,0,0,.073-.012c.022-.011.041-.03.063-.043a.91.91,0,0,1,.132-.067,1.72,1.72,0,0,1,.281-.084c.1-.022.192-.04.287-.065s.208-.071.316-.093a2.909,2.909,0,0,1,.682-.025c.243.008.487.008.731.01.992.008,1.985,0,2.977,0,.24,0,.481.006.721-.013a2,2,0,0,1,.68.015c.018,0,.074.013.084.027s0,.074,0,.093v.186c0,.033.006.058-.015.082a.2.2,0,0,1-.064.038.411.411,0,0,1-.136.032c-.1.008-.2,0-.3,0h-.372q-1.5,0-3,0l-1.486,0c-.246,0-.491,0-.737.013s-.468.022-.7.022a.453.453,0,0,1-.138-.015.239.239,0,0,1-.057-.026C417.976,531.373,417.984,531.354,417.984,531.318Z" transform="translate(528.613 236.637)" fill="#4b86ed"/>
    <path id="Tracé_71" data-name="Tracé 71" d="M425.945,529.014c-.132,0-.263.008-.395,0a1.82,1.82,0,0,0-.368.017c-.118.016-.236.037-.356.046s-.255,0-.383-.008c-.261-.007-.521,0-.782,0h-.795c-.532,0-1.064-.007-1.6,0-.125,0-.252.014-.377.008a2.94,2.94,0,0,1-.334-.058.725.725,0,0,0-.168-.011c-.026,0-.052.008-.078.007a.27.27,0,0,0-.064,0c-.036.009-.059.058-.092.08a.271.271,0,0,1-.124.04,1.416,1.416,0,0,0-.248.006c-.072.02-.115.092-.183.121a.594.594,0,0,1-.107.014c-.02,0-.038.017-.057.024a.276.276,0,0,1-.1.009,1.155,1.155,0,0,0-.186,0,.349.349,0,0,0-.1.051.1.1,0,0,1-.049.013c-.039,0-.028-.028-.028-.061v-.087c0-.041.015-.041.049-.06a2.618,2.618,0,0,1,.289-.153.873.873,0,0,1,.151-.049.69.69,0,0,1,.075-.012c.012,0,.027,0,.039,0,.028-.006.022-.008.044-.026.068-.053.182-.017.262-.02.13,0,.261,0,.391,0,.083,0,.2.029.272-.026.032-.025.041-.042.085-.041s.066.036.107.056a.606.606,0,0,0,.28.009c.533-.005,1.066,0,1.6,0,1.065,0,2.131-.009,3.2,0,.033,0,.1-.009.125.025S425.939,528.985,425.945,529.014Z" transform="translate(527.678 238.593)" fill="#4b88f0"/>
    <path id="Tracé_72" data-name="Tracé 72" d="M417.981,537.924c.109,0,.218.009.328.009a2.851,2.851,0,0,0,.342-.033,6.4,6.4,0,0,1,.7-.041c.462-.005.924.017,1.387.009.937-.016,1.875,0,2.812,0h1.412c.034,0,.046-.008.046.029a.3.3,0,0,1,0,.077c-.013.039-.093.041-.13.041-.113,0-.226,0-.339,0h-4.919c-.47,0-.942-.008-1.412,0a1.225,1.225,0,0,1-.134,0,.175.175,0,0,1-.074-.02C417.972,537.975,417.981,537.956,417.981,537.924Z" transform="translate(528.617 230.089)" fill="#467ce1"/>
    <path id="Tracé_73" data-name="Tracé 73" d="M796.235,374.456c.13.1.221-.014.313-.107l.326-.328.669-.671.67-.67.331-.331a.984.984,0,0,1,.137-.137c.07-.045.052.08.045.116-.031.148-.07.295-.1.444s-.053.3-.078.448c-.05.3-.111.588-.178.88q-.2.856-.45,1.7a20.308,20.308,0,0,1-1.287,3.251c-.08.158-.211.549-.455.395a.881.881,0,0,1-.139-.124l-.18-.177-.326-.323q-.333-.332-.663-.667c-.078-.079-.226-.183-.225-.307a.418.418,0,0,1,.077-.176q.054-.1.1-.2a14.063,14.063,0,0,0,.652-1.648c.1-.293.192-.589.28-.887.042-.143.079-.287.124-.429.021-.066.057-.178.14-.185S796.185,374.4,796.235,374.456Z" transform="translate(173.82 386.125)" fill="#386bd6"/>
    <path id="Tracé_74" data-name="Tracé 74" d="M822.726,381.142c.105-.019.145-.167.187-.248.061-.119.123-.238.183-.358.115-.231.214-.471.316-.708s.206-.48.3-.723.174-.494.261-.742.175-.5.259-.746.176-.493.239-.747c.032-.128.052-.259.082-.388s.064-.248.1-.371a2.655,2.655,0,0,0,.1-.358c.007-.047,0-.1,0-.143a.26.26,0,0,1,.048-.133c.015-.025.009-.008.009-.033s-.005-.041-.006-.061a.527.527,0,0,1,.008-.1,1.556,1.556,0,0,1,.05-.192c.04-.135.061-.274.088-.412s.065-.267.084-.4c.016-.117-.007-.234.128-.276v4.332c0,.042,0,.085,0,.127a.891.891,0,0,1-.028.137c-.036.153-.078.3-.126.453-.1.3-.211.588-.335.874s-.257.569-.386.854-.239.567-.386.837c-.04.072-.083.142-.127.212a.774.774,0,0,1-.112.16.179.179,0,0,1-.19.049c-.069-.025-.107-.1-.153-.152-.108-.127-.23-.242-.347-.361-.056-.057-.112-.115-.164-.176S822.67,381.214,822.726,381.142Z" transform="translate(147.387 384.433)" fill="#376ad6"/>
    <path id="Tracé_75" data-name="Tracé 75" d="M782.256,389.433c-.066,0-.138-.137-.21-.105-.027.012-.037.053-.046.077-.023.067-.038.136-.056.2-.088.332-.188.661-.3.987s-.223.645-.353.961c-.063.153-.11.312-.174.464s-.136.284-.185.434a.534.534,0,0,1-.162.3.221.221,0,0,1-.166.048.393.393,0,0,1-.153-.117q-.193-.184-.379-.374l-.181-.187c-.04-.042-.09-.086-.089-.149a.619.619,0,0,1,.082-.212c.036-.081.072-.161.108-.242.069-.155.132-.313.189-.473.118-.33.23-.662.341-1a8.089,8.089,0,0,0,.328-1.111,1.32,1.32,0,0,0,.064-.218.28.28,0,0,1,.008-.1c.011-.034.031-.065.041-.1.022-.072.043-.146.064-.218a.325.325,0,0,0,.016-.106c0-.017-.011-.04-.01-.056a.136.136,0,0,1,.021-.048,3.614,3.614,0,0,1,.35.34c.121.112.262.192.374.316a3.951,3.951,0,0,1,.287.387.767.767,0,0,0,.053.075.12.12,0,0,0,.032.027.079.079,0,0,0,.028.009c.014,0,.02,0,.019.014a.537.537,0,0,1,.04.07A.1.1,0,0,1,782.256,389.433Z" transform="translate(187.799 371.148)" fill="#396cd6"/>
    <path id="Tracé_76" data-name="Tracé 76" d="M837,454.461c.063,0,.093-.053.116-.1.034-.074.072-.146.112-.218a3.6,3.6,0,0,0,.218-.417c.058-.145.125-.283.194-.422s.135-.3.2-.457c.132-.3.267-.6.387-.912s.231-.649.353-.971c.005-.014.016-.063.044-.043a.538.538,0,0,1,0,.139v2.892a.653.653,0,0,1-.056.219c-.028.076-.059.152-.092.226-.066.148-.142.293-.219.436a2.276,2.276,0,0,1-.221.384.279.279,0,0,1-.158.1.1.1,0,0,1-.1-.031l-.108-.086A3.228,3.228,0,0,1,837,454.461Z" transform="translate(133.926 311.985)" fill="#3669d6"/>
    <path id="Tracé_77" data-name="Tracé 77" d="M851,505.277a.138.138,0,0,0,.132-.036,1.423,1.423,0,0,0,.089-.164c.07-.114.135-.227.194-.347s.13-.259.2-.388q.05-.1.1-.2l.043-.091c.019-.041.024-.036.062-.052v1.928c0,.03,0,.042-.02.061a.127.127,0,0,1-.067.023.45.45,0,0,1-.235-.1.969.969,0,0,1-.186-.155A1.832,1.832,0,0,1,851,505.277Z" transform="translate(120.739 261.981)" fill="#3569d5"/>
    <path id="Tracé_78" data-name="Tracé 78" d="M777.063,536.459c.018,0,.1-.012.116,0a.247.247,0,0,1,0,.058c-.007.011-.043.019-.055.023a.82.82,0,0,1-.229,0c-.185,0-.37,0-.555,0h-4.42c-.05,0-.179.009-.15-.077s.165-.082.23-.09a2.819,2.819,0,0,1,.492,0c.178.008.355-.006.533-.005l.549,0c.182,0,.364-.006.547-.008s.365.006.548,0c.2-.006.4,0,.595.007s.407-.005.611-.008A3.935,3.935,0,0,1,777.063,536.459Z" transform="translate(195.373 231.496)" fill="#335fc9"/>
    <path id="Tracé_79" data-name="Tracé 79" d="M771.752,538.923h5.238a.605.605,0,0,1,.139,0c.022.006.032,0,.022.027a.044.044,0,0,1-.022.024.234.234,0,0,1-.1.007H771.8c-.022,0-.044.008-.058-.013S771.733,538.923,771.752,538.923Z" transform="translate(195.4 229.09)" fill="#305ac2"/>
    <path id="Tracé_80" data-name="Tracé 80" d="M701.354,537.645a.155.155,0,0,1,0,.048c-.008.016-.025.01-.046.01H697c0-.06.054-.057.1-.073a1.092,1.092,0,0,1,.2-.05,2.72,2.72,0,0,1,.43-.018h2.729c.168,0,.336,0,.5,0A.547.547,0,0,1,701.354,537.645Z" transform="translate(265.798 230.368)" fill="#3259be"/>
    <path id="Tracé_81" data-name="Tracé 81" d="M417.982,539.966h6.956c.024,0,.067-.01.071.015a.04.04,0,0,1-.019.034c-.032.022-.1.01-.137.01h-6.767a.308.308,0,0,1-.081,0c-.027-.008-.014.014-.023-.019A.2.2,0,0,1,417.982,539.966Z" transform="translate(528.616 228.105)" fill="#6890dc"/>
    <path id="Tracé_82" data-name="Tracé 82" d="M418,691.951a1.379,1.379,0,0,0,.079.285,1.019,1.019,0,0,1,.023.289,1.185,1.185,0,0,1-.056.289c-.015.046-.031.093-.047.138s-.022.045-.058.044v-.964a.21.21,0,0,1,0-.07c0-.014,0-.018.019-.012Z" transform="translate(528.653 84.946)" fill="#c4c4c4"/>
    <path id="Tracé_83" data-name="Tracé 83" d="M640.552,319.5c-.092-.017-.059.181-.058.231,0,.118,0,.236,0,.355q0,.36,0,.719,0,.719,0,1.439,0,1.439,0,2.878,0,.18,0,.36a1.182,1.182,0,0,0,0,.149c0,.031.015.061.017.092a.1.1,0,0,1-.026.079c-.009.009-.034.03-.047.027s-.041-.052-.048-.065a.5.5,0,0,1-.034-.252c.015-.464-.014-.931-.014-1.4s.031-.948.048-1.423.02-.954.019-1.431-.005-.946,0-1.419q0-.358.006-.715a.257.257,0,0,1,.019-.134c.017-.024.039-.016.068-.016s.049,0,.07.014c.07.061.06.181.062.263A.316.316,0,0,1,640.552,319.5Z" transform="translate(319.167 436.257)" fill="#385cbc"/>
    <path id="Tracé_84" data-name="Tracé 84" d="M639.534,318.956v6.782a.193.193,0,0,0,.015.1l.044.087h-.077c-.036,0-.042,0-.061-.033a.445.445,0,0,1-.055-.137,1,1,0,0,1-.008-.278c.006-.1,0-.2,0-.3q0-.179,0-.358c0-.485,0-.969,0-1.454a2.377,2.377,0,0,1,.02-.347,1.545,1.545,0,0,1,.032-.157.7.7,0,0,0,.041-.168v-3.7a.21.21,0,0,1,0-.039C639.482,318.949,639.526,318.956,639.534,318.956Z" transform="translate(320.069 436.284)" fill="#4e8bf2"/>
    <path id="Tracé_85" data-name="Tracé 85" d="M657.2,338.216q0,.457,0,.915,0,.226,0,.452c0,.12-.025.276.058.375a1.062,1.062,0,0,1-.225-.029c-.07-.018-.135-.05-.2-.072a.6.6,0,0,0-.093-.024c-.021,0-.082.007-.1,0s-.021-.045-.033-.058-.052-.05-.076-.078a1.122,1.122,0,0,1-.17-.775c0-.666-.022-1.331-.039-2s-.033-1.331-.033-2q0-.254,0-.508c0-.157,0-.318.012-.474a.29.29,0,0,1,.072-.2c.061-.049.121.023.151.074a.764.764,0,0,1,.059.384q0,.559,0,1.118,0,.277,0,.553,0,.138,0,.277c0,.05,0,.1,0,.15a.2.2,0,0,1-.018.123c.041-.036.022-.1.034-.153.016-.07.039-.14.061-.208.046-.137.1-.272.143-.41.018-.058.032-.207.108-.225.13-.031.14.186.14.266,0,.613.012,1.225.006,1.838,0,.168-.005.337-.012.505q0,.126-.012.253a2.306,2.306,0,0,1-.013.252,1.373,1.373,0,0,1,.035-.231A.146.146,0,0,1,657.2,338.216Z" transform="translate(304.149 422.365)" fill="#3a63c7"/>
    <path id="Tracé_86" data-name="Tracé 86" d="M644.813,320.39c0,.862.012,1.725-.006,2.587-.009.424.053.844.066,1.267.007.209,0,.418-.005.627s0,.427,0,.641q0,.178,0,.355c0,.06,0,.12,0,.18,0,.021,0,.063.019.076s.045-.016.065-.023.01-.013.024,0,.008.038.009.05c.006.1-.012.195.059.277-.117.035-.22-.043-.332-.058-.023,0-.053.005-.075,0a.17.17,0,0,1-.066-.05.262.262,0,0,1-.064-.142,2.589,2.589,0,0,1-.009-.371q0-.231-.007-.461c-.012-.622-.034-1.245-.049-1.867s-.025-1.245-.014-1.867c.006-.308,0-.612-.013-.919a1.866,1.866,0,0,0-.04-.424,1.073,1.073,0,0,0-.163-.311c-.038-.053-.077-.105-.116-.158a.445.445,0,0,1-.1-.2c0-.09.114-.05.16-.02a1.174,1.174,0,0,1,.161.127c.1.1.2.208.3.307a.505.505,0,0,1,.121.166A.726.726,0,0,1,644.813,320.39Z" transform="translate(315.72 435.72)" fill="#3961c5"/>
    <path id="Tracé_87" data-name="Tracé 87" d="M644.432,322a.708.708,0,0,1,.214.189c.064.067.141.109.137.213,0,.032-.01.064.011.091s.066.027.091.052c.047.047.023.139-.006.188a.225.225,0,0,0-.047.122c0,.045.05.082.062.128a1.34,1.34,0,0,1,0,.3c0,.252,0,.5,0,.757,0,.512,0,1.025,0,1.537,0,.249.007.5.009.748a2.76,2.76,0,0,0,.022.363,3.072,3.072,0,0,1,.045.364c.007.274-.016.55-.015.825,0,.144,0,.288,0,.432a1.583,1.583,0,0,0,0,.2.555.555,0,0,0,.06.169h-.169a.228.228,0,0,1-.042,0c-.028-.006-.012.013-.024-.023a.459.459,0,0,1-.011-.1c-.011-.125-.014-.251-.013-.377q0-.362,0-.724a.41.41,0,0,0-.006-.165c-.034-.076-.111-.048-.171-.077s-.083-.136-.095-.2a.918.918,0,0,1,0-.164q0-.1,0-.2,0-.757.006-1.515c.006-.5.024-.994.014-1.491-.005-.279-.019-.558-.047-.835A2.124,2.124,0,0,1,644.432,322Z" transform="translate(315.345 433.413)" fill="#395fc1"/>
    <path id="Tracé_88" data-name="Tracé 88" d="M644.032,321.057c0,.1-.016.208-.01.313s.033.185.047.277a.576.576,0,0,0,.029.123c.016.041.052.075.059.119a.586.586,0,0,1-.008.117c0,.058,0,.117,0,.175,0,.227,0,.454,0,.682a1.228,1.228,0,0,0,.022.306,1.047,1.047,0,0,1,.045.285c-.005.1-.041.205-.054.308a2.885,2.885,0,0,0-.02.33c0,.221.012.441.01.662s-.007.455-.007.683q0,.171,0,.342a2.138,2.138,0,0,0,0,.342c.019.107.049.21.065.318a3.256,3.256,0,0,1,.029.331,5.823,5.823,0,0,1-.019.664c0,.056-.009.111-.013.166,0,.013,0,.07-.007.078s-.073,0-.087,0a.262.262,0,0,1-.076,0c-.021-.008-.027-.034-.033-.057a.5.5,0,0,1-.009-.157c.012-.225,0-.452,0-.677q0-1.382,0-2.765,0-.694,0-1.388c0-.227,0-.455,0-.683a.8.8,0,0,0-.019-.293.476.476,0,0,1-.01-.156V321A.051.051,0,0,1,644.032,321.057Z" transform="translate(315.745 434.356)" fill="#385ebf"/>
    <path id="Tracé_89" data-name="Tracé 89" d="M647.022,409.775a.491.491,0,0,1-.058-.328q0-.207,0-.413,0-.413,0-.826c.116,0,0,.162.1.173.067.008.076-.039.073-.091-.005-.077.034-.088.095-.131a.551.551,0,0,1,.019.211q0,.115,0,.231,0,.231,0,.461t0,.45a.68.68,0,0,1,0,.208c-.014.041-.058.069-.055.115C647.129,409.807,647.048,409.88,647.022,409.775Z" transform="translate(312.929 352.258)" fill="#385ec1"/>
    <path id="Tracé_90" data-name="Tracé 90" d="M643.889,331.982c.084-.015.059.129.059.176q0,.146,0,.293v5.419c0,.022.014.138,0,.151s-.053-.023-.056-.04a1.408,1.408,0,0,1,0-.278q0-.3,0-.6v-5.117Z" transform="translate(315.831 424.012)" fill="#385cbc"/>
    <path id="Tracé_91" data-name="Tracé 91" d="M418.921,693.861v-.77a.565.565,0,0,1,0-.136c.008-.026,0-.018.025-.025a.147.147,0,0,1,.049,0,1.248,1.248,0,0,1,.175.052.415.415,0,0,0,.191,0c.13-.017.242.088.372.065A6.662,6.662,0,0,1,418.921,693.861Z" transform="translate(527.735 84.023)" fill="#c2c2c2"/>
    <path id="Tracé_92" data-name="Tracé 92" d="M440.862,320c.03.134-.054.255-.063.385a1.8,1.8,0,0,0,.015.213,1.352,1.352,0,0,1-.006.243c-.02.159-.055.317-.079.477s-.042.32-.071.479c-.057.318-.168.615-.254.925a2.365,2.365,0,0,1-.138.409,1.442,1.442,0,0,0-.157.4.633.633,0,0,1-.094.2c-.039.071-.077.143-.115.215-.07.135-.138.27-.206.406a7.271,7.271,0,0,1-.457.8,9.648,9.648,0,0,1-1.166,1.39,9.323,9.323,0,0,1-1.422,1.184,8.941,8.941,0,0,1-1.651.889c-.29.115-.575.235-.875.324-.149.044-.295.094-.442.142a.673.673,0,0,1-.2.039.429.429,0,0,0-.185.009.375.375,0,0,1-.133.05.444.444,0,0,0-.166.023.366.366,0,0,1-.177.032.475.475,0,0,0-.211.031.343.343,0,0,1-.166.031.567.567,0,0,0-.208.007,1.638,1.638,0,0,1-.456.049c-.328,0-.656-.006-.984,0-.076,0-.151,0-.227.006a.577.577,0,0,1-.192-.042.408.408,0,0,0-.178-.025,1.189,1.189,0,0,1-.182.019.256.256,0,0,1-.081-.016c-.036-.014-.06-.043-.1-.049-.071-.011-.146,0-.218-.017-.144-.024-.285-.068-.429-.091a1.125,1.125,0,0,0-.2-.017c-.033,0-.032.01-.042-.018a.146.146,0,0,1,0-.039.505.505,0,0,1,.021-.112c.02-.067.05-.13.074-.2s.044-.144.067-.216a3.554,3.554,0,0,1,.169-.442c.013-.027.021-.057.048-.071a.273.273,0,0,1,.093-.017,1.436,1.436,0,0,1,.248,0c.312.023.616.11.928.139a7.763,7.763,0,0,0,1.9-.055,8.954,8.954,0,0,0,2.955-1.032,7.907,7.907,0,0,0,2.069-1.647,8.339,8.339,0,0,0,1.434-2.3,9.017,9.017,0,0,0,.492-1.485,6.6,6.6,0,0,0,.147-.934c.013-.158.015-.316.022-.474a.359.359,0,0,1,.046-.18c.028-.043.049-.038.1-.038h1.093Z" transform="translate(518.277 435.301)" fill="#4f8df4"/>
    <path id="Tracé_93" data-name="Tracé 93" d="M446.242,319.92c0,.152,0,.3,0,.455,0,.061,0,.122-.005.182a.9.9,0,0,1-.051.2c-.032.1.018.2-.019.3-.008.021-.035.045-.04.065a.511.511,0,0,0,.008.1.918.918,0,0,1-.023.194c-.027.122-.069.24-.095.362s-.047.272-.087.407a7.083,7.083,0,0,1-.3.792c-.114.262-.241.519-.371.774a7.122,7.122,0,0,1-.432.7c-.147.22-.289.439-.456.644a7.384,7.384,0,0,1-.528.576c-.187.185-.381.363-.579.537a4.907,4.907,0,0,1-.619.478,2.679,2.679,0,0,1-.338.182.851.851,0,0,0-.132.1,1.022,1.022,0,0,1-.144.081,2.341,2.341,0,0,0-.29.145.647.647,0,0,0-.06.045c-.016.014-.036.045-.055.053a.611.611,0,0,1-.085.007.436.436,0,0,0-.078.025c-.1.043-.189.114-.294.15a2.853,2.853,0,0,0-.337.144,2.04,2.04,0,0,1-.363.127c-.13.036-.256.082-.385.119a2.513,2.513,0,0,1-.384.066.786.786,0,0,0-.147.055,1.155,1.155,0,0,1-.211.036c-.147.02-.294.038-.441.058s-.284.047-.427.061c-.291.029-.583.007-.875.018a1.87,1.87,0,0,1-.424-.016c-.065-.012-.131-.029-.2-.037a1.168,1.168,0,0,0-.179,0,.471.471,0,0,1-.159-.015c-.026-.008-.059-.039-.084-.043a.862.862,0,0,0-.093.01c-.119,0-.228-.067-.348-.066a.246.246,0,0,1-.141-.032.37.37,0,0,1-.058-.026.17.17,0,0,1-.01-.1.976.976,0,0,1,.078-.182l.092-.205c.062-.137.122-.274.188-.409a.384.384,0,0,1,.081-.093c.017-.019.017-.04.029-.059a.175.175,0,0,1,.088-.044,1,1,0,0,1,.374.029q.212.028.425.045a7.286,7.286,0,0,0,1.661-.052,7.53,7.53,0,0,0,2.655-.973,6.879,6.879,0,0,0,1.79-1.5,6.988,6.988,0,0,0,1.174-2.025,8.663,8.663,0,0,0,.358-1.216c.024-.108.048-.216.064-.325.017-.125.021-.252.031-.378a1.433,1.433,0,0,1,.069-.37.856.856,0,0,1,.034-.082c.009-.019.025-.069.044-.08a.4.4,0,0,1,.115,0h.988Z" transform="translate(511.736 435.377)" fill="#508df4"/>
    <path id="Tracé_94" data-name="Tracé 94" d="M452.768,320a.6.6,0,0,1-.03.3,1.137,1.137,0,0,0-.034.3,1.013,1.013,0,0,1-.054.3,1.49,1.49,0,0,0-.044.3,1.621,1.621,0,0,1-.058.3c-.014.049-.029.1-.041.148-.006.023-.011.046-.016.07a.544.544,0,0,1-.013.091c-.012.03-.049.044-.059.084a.472.472,0,0,0,0,.106c0,.081-.059.136-.078.214a4.064,4.064,0,0,1-.21.573,4.8,4.8,0,0,1-.294.583c-.116.2-.241.393-.369.584a2.562,2.562,0,0,1-.183.262c-.055.063-.119.117-.172.182a.461.461,0,0,0-.06.094c-.009.019-.012.045-.022.063a.377.377,0,0,1-.06.06c-.077.079-.153.158-.229.238-.151.159-.3.316-.47.46a6.477,6.477,0,0,1-1.091.763c-.2.111-.4.211-.608.313a4.912,4.912,0,0,1-.6.284c-.207.071-.422.107-.633.164-.11.03-.218.064-.327.1a.527.527,0,0,1-.133.029c-.042,0-.085,0-.127,0a.253.253,0,0,0-.11.045c-.024.014-.032.009-.064.006a.6.6,0,0,0-.09,0,2.435,2.435,0,0,0-.295.051,1.692,1.692,0,0,1-.327.015c-.118,0-.235,0-.353,0-.225,0-.451,0-.676,0a.6.6,0,0,1-.142-.017c-.05-.013-.095-.041-.146-.05-.095-.016-.192.011-.286-.01-.042-.009-.075-.037-.116-.046a.664.664,0,0,0-.143.006,2.089,2.089,0,0,0,.254-.456,1.258,1.258,0,0,1,.036-.125c.019-.038.051-.072.072-.111a2.354,2.354,0,0,1,.126-.215l.076-.113c.015-.023.019-.027.047-.027a.676.676,0,0,1,.068,0c.088.008.174.03.26.047a3.435,3.435,0,0,0,.565.006,3.529,3.529,0,0,0,.588-.022c.191-.028.382-.065.573-.1a4.975,4.975,0,0,0,1.118-.328,6.534,6.534,0,0,0,1.017-.523,6.85,6.85,0,0,0,.894-.69,6.014,6.014,0,0,0,.741-.862,6.24,6.24,0,0,0,.589-.957,5.8,5.8,0,0,0,.388-1.069c.051-.19.09-.382.128-.575a2.444,2.444,0,0,0,.079-.569c0-.094-.012-.188-.012-.282Z" transform="translate(504.107 435.297)" fill="#518ef4"/>
    <path id="Tracé_95" data-name="Tracé 95" d="M566.445,612.464c-.023,0-.047,0-.069,0a.119.119,0,0,1-.061-.042l-.145-.146-.138-.137a.156.156,0,0,1-.05-.061c-.007-.025,0-.052,0-.077A2.181,2.181,0,0,1,566.445,612.464Z" transform="translate(389.21 160.252)" fill="#c4c4c4"/>
    <path id="Tracé_96" data-name="Tracé 96" d="M699.989,507.861c-.006-.041.026-.058.052-.081.043-.038.082-.081.123-.122l.244-.244.512-.512.5-.5.252-.252c.036-.036.071-.073.1-.11a.092.092,0,0,1,.038-.031c.023-.007.025.01.038.011s0-.006,0-.006c.017.008.025.13.028.149q.015.089.027.179.023.179.034.359a4.431,4.431,0,0,1-.019.729q-.02.18-.055.359c0,.012-.006.069-.016.078s-.076,0-.092.006l-.2.01q-.369.017-.739.016Q700.41,507.893,699.989,507.861Z" transform="translate(262.982 260.094)" fill="#3665cb"/>
    <path id="Tracé_97" data-name="Tracé 97" d="M731.967,490.694v-1.743a.338.338,0,0,1,.013-.152c.054-.1.217-.158.222-.292a.44.44,0,0,0-.062-.188l-.034-.071a.248.248,0,0,1-.015-.03c-.01-.033-.008-.013,0-.038a.693.693,0,0,1,.082-.124,1.542,1.542,0,0,1,.176-.218c.036-.035.087-.08.139-.049.08.049.068.181.074.261.008.1.013.206.016.309.006.214,0,.428,0,.642s-.005.427-.007.641c0,.2.008.394,0,.589a.559.559,0,0,0,0,.19.2.2,0,0,0,.159.125.512.512,0,0,0,.492-.113c.028-.03.05-.068.08-.1a.557.557,0,0,0,.052-.046c.032-.038.055-.083.083-.124a.226.226,0,0,1,.1-.092.167.167,0,0,1,.071-.008c.049,0,.072.014.09.06.046.119-.012.264.087.365a.381.381,0,0,0,.3.072.13.13,0,0,1,.106.03.077.077,0,0,1,.013.054.189.189,0,0,1-.01.045c-.012.036-.021.032-.059.032h-.634c-.424,0-.85-.012-1.275,0A.483.483,0,0,1,731.967,490.694Z" transform="translate(232.862 277.261)" fill="#3764cc"/>
    <path id="Tracé_98" data-name="Tracé 98" d="M732.479,449.381a.364.364,0,0,0-.17.2c-.036.072-.087.18-.171.2-.022.006-.053.009-.067-.006a.433.433,0,0,1-.029-.064.867.867,0,0,1-.072-.131.459.459,0,0,1-.013-.157v-1.5a.47.47,0,0,1,0-.092c.007-.032,0-.017.022-.039s.024-.019.034-.029a.605.605,0,0,0,.1-.12,2.75,2.75,0,0,0,.176-.324,1,1,0,0,1,.191-.325c.129.124.089.347.09.508,0,.218,0,.436,0,.655s0,.429,0,.643q0,.161-.011.322A.32.32,0,0,1,732.479,449.381Z" transform="translate(232.872 315.671)" fill="#3864cc"/>
    <path id="Tracé_99" data-name="Tracé 99" d="M699.974,537.809h2.207a.313.313,0,0,0,.035,0c.016,0,.031-.011.045-.012s.033.005.036.031a.089.089,0,0,1,0,.029c-.008.016,0,.006-.023.01a.9.9,0,0,1-.173,0H698c0-.06.04-.058.088-.057.078,0,.157,0,.235,0h1.651Z" transform="translate(264.855 230.146)" fill="#355ec4"/>
    <path id="Tracé_100" data-name="Tracé 100" d="M458.29,409a.635.635,0,0,1-.29.406A.635.635,0,0,1,458.29,409Z" transform="translate(490.92 351.465)" fill="#528ff4"/>
    <path id="Tracé_101" data-name="Tracé 101" d="M449.174,425c-.021.119-.043.238-.174.29C449.021,425.171,449.043,425.053,449.174,425Z" transform="translate(499.397 336.394)" fill="#528ff4"/>
    <path id="Tracé_102" data-name="Tracé 102" d="M706.337,332.684a2.219,2.219,0,0,1-.258-.151c-.041-.026-.082-.052-.124-.075a.439.439,0,0,0-.141-.065c-.04,0-.081.012-.124.006a.444.444,0,0,1-.126-.042c-.077-.037-.149-.085-.227-.122-.1-.049-.2-.1-.306-.156-.052-.026-.124-.062-.182-.034s-.068.1-.076.149c-.018.115-.03.231-.046.346-.065.457-.123.917-.227,1.368-.051.222-.109.443-.17.662a2.744,2.744,0,0,1-.088.3.226.226,0,0,1-.094.13c-.111.05-.241-.133-.3-.2-.132-.135-.277-.257-.409-.391a2.044,2.044,0,0,1-.183-.209,1.4,1.4,0,0,1-.079-.116.094.094,0,0,1-.021-.063.927.927,0,0,1,.013-.1c.032-.226.074-.45.117-.673s.088-.455.125-.683.049-.428.069-.644a1.551,1.551,0,0,1,.053-.3.508.508,0,0,1,.056-.144.172.172,0,0,1,.154-.042.282.282,0,0,1,.071.018.115.115,0,0,0,.069.006.278.278,0,0,1,.143.031c.041.019.077.048.118.066a.394.394,0,0,0,.138.026.427.427,0,0,1,.216.067.52.52,0,0,0,.091.045c.039.014.084.005.118.022s.081.054.123.077.092.047.139.067c.089.039.179.073.269.11.192.08.364.2.548.291.1.051.2.1.3.15a.607.607,0,0,1,.067.034c.026.018.02.029.034.057a.125.125,0,0,0,.09.066C706.348,332.583,706.33,332.615,706.337,332.684Z" transform="translate(260.002 424.529)" fill="#3d6fd7"/>
    <path id="Tracé_103" data-name="Tracé 103" d="M657.542,320.609c-.117,0-.237.009-.354,0a1.522,1.522,0,0,1-.328-.079,2.245,2.245,0,0,0-.3-.086.3.3,0,0,0-.177.008.2.2,0,0,0-.1.143,2.681,2.681,0,0,0-.04.345c-.026.253-.056.506-.1.757-.02.121-.039.245-.065.365a.388.388,0,0,1-.091.214c-.06.048-.131-.009-.175-.053a2.365,2.365,0,0,0-.262-.178,5.388,5.388,0,0,1-.426-.417c-.18-.169-.35-.35-.526-.524a.87.87,0,0,1-.233-.3,1.69,1.69,0,0,1-.061-.35.857.857,0,0,0-.308-.546,3.713,3.713,0,0,0,.4,0,.417.417,0,0,1,.154.005c.055.014.107.038.162.05.112.025.23,0,.343.022.057.013.109.041.166.054a1.2,1.2,0,0,0,.178.024,5.326,5.326,0,0,1,.77.131c.13.03.26.06.388.1.059.018.116.04.175.057a.915.915,0,0,0,.192.022.594.594,0,0,1,.173.058c.054.022.111.026.165.047a1.226,1.226,0,0,0,.159.063C657.469,320.555,657.555,320.539,657.542,320.609Z" transform="translate(306.3 435.385)" fill="#3f70d7"/>
    <path id="Tracé_104" data-name="Tracé 104" d="M644.539,318.93c.008.08.074.054.131.057.034,0,.071-.005.1,0s.039.026.055.062.048.056.056.091a.944.944,0,0,1-.008.144,2.172,2.172,0,0,0,.056.306.769.769,0,0,1,.016.144c0,.021,0,.059-.013.072a.052.052,0,0,1-.055,0c-.025-.015-.039-.048-.061-.066a.9.9,0,0,1-.114-.1,1.146,1.146,0,0,1-.145-.262,1.136,1.136,0,0,0-.133-.216.678.678,0,0,0-.206-.175.5.5,0,0,0-.141-.055.5.5,0,0,0-.086,0,.2.2,0,0,1-.039,0c-.006,0,0-.051,0-.058.064,0,.128.006.191.006a1.619,1.619,0,0,1,.167-.013C644.4,318.874,644.456,318.954,644.539,318.93Z" transform="translate(315.761 436.367)" fill="#3f6ed5"/>
    <path id="Tracé_105" data-name="Tracé 105" d="M602.381,383.986v2.4a.35.35,0,0,1-.021.147q-.027.067-.059.132a4.429,4.429,0,0,1-.657.912c-.127.148-.249.3-.375.45-.067.078-.136.154-.2.233a.232.232,0,0,1-.158.106c-.1,0-.195-.1-.261-.164s-.148-.155-.224-.23-.136-.141-.207-.208c-.034-.032-.083-.049-.111-.083s-.07-.105-.1-.157a.321.321,0,0,0,.255-.149c.076-.1.145-.2.227-.3.1-.112.194-.221.28-.341s.182-.249.274-.372a10.1,10.1,0,0,0,.937-1.559c.073-.146.149-.292.218-.44.036-.077.069-.155.1-.235C602.3,384.09,602.315,383.974,602.381,383.986Z" transform="translate(357.165 375.027)" fill="#4e8cf4"/>
    <path id="Tracé_106" data-name="Tracé 106" d="M614,428.781c.143.012.214-.107.281-.211a4.026,4.026,0,0,1,.365-.434,9.228,9.228,0,0,0,.7-.907q.079-.119.153-.241c.009-.015.038-.088.066-.064.007.006,0,.06,0,.07v3.414c-.088,0-.107-.1-.141-.156a.619.619,0,0,0-.165-.181,2.609,2.609,0,0,1-.218-.155,1.591,1.591,0,0,1-.165-.212,1.513,1.513,0,0,0-.175-.2,1.012,1.012,0,0,0-.1-.081l-.054-.036c-.016-.01-.055-.022-.066-.037s-.011-.057-.027-.08a.21.21,0,0,0-.063-.054.524.524,0,0,1-.134-.087.4.4,0,0,1-.042-.087.327.327,0,0,0-.071-.087A.428.428,0,0,1,614,428.781Z" transform="translate(343.978 334.587)" fill="#4d8cf4"/>
    <path id="Tracé_107" data-name="Tracé 107" d="M740.96,428.542v-1.5c0-.25-.005-.5,0-.751a.619.619,0,0,1,.072-.3c.053-.094.108-.186.156-.282a2.268,2.268,0,0,0,.236-.707,4.8,4.8,0,0,1,.49.459,1.779,1.779,0,0,1,.218.255.619.619,0,0,1,.08.293c.013.244,0,.492,0,.736s0,.493,0,.739,0,.493,0,.739q0,.185-.008.369a.587.587,0,0,1-.045.3c-.059.092-.091.267-.217.291-.177.033-.2-.151-.2-.279.015-.24,0-.483,0-.724q0-.206,0-.411,0-.1,0-.206a.687.687,0,0,1,.012-.211c-.037.011-.05.084-.068.115-.038.066-.075.132-.111.2-.071.129-.141.26-.214.388-.064.113-.135.221-.2.333C741.124,428.472,741.068,428.548,740.96,428.542Z" transform="translate(224.391 336.394)" fill="#3865cd"/>
    <path id="Tracé_108" data-name="Tracé 108" d="M761,440.077V437a1.281,1.281,0,0,1,.243.212.968.968,0,0,0,.116.1.88.88,0,0,1,.121.075c.05.05.05.135.112.176.025.016.041.011.056.036a.167.167,0,0,1,.015.079c0,.076,0,.154,0,.231,0,.284.011.569,0,.853a1.233,1.233,0,0,1-.055.419,2.86,2.86,0,0,1-.169.347c-.068.121-.141.24-.209.361C761.181,439.978,761.129,440.109,761,440.077Z" transform="translate(205.513 325.091)" fill="#3866ce"/>
    <path id="Tracé_109" data-name="Tracé 109" d="M771.916,447.058V447a2.325,2.325,0,0,1,.365.338c.031.026.068.043.1.069a1.073,1.073,0,0,1,.1.121q.1.115.209.227.213.222.445.426a.641.641,0,0,1,.113.1.373.373,0,0,0,.061.1c.071.066.14.133.209.2q.471.473.944.944l.237.235c.028.028.053.058.079.087a.252.252,0,0,0,.039.036c.012.009.051.016.057.025s0,.051.005.065a.431.431,0,0,1,.025.05.206.206,0,0,1-.023.133c-.038.093-.085.182-.127.274-.091.2-.206.388-.314.578-.052.091-.2.42-.35.262a.268.268,0,0,1-.044-.179q-.005-.163-.009-.326c-.005-.221-.007-.442,0-.663a1.381,1.381,0,0,0-.177-.961.972.972,0,0,0-.17-.165,2.2,2.2,0,0,1-.183-.178c-.079-.078-.141-.19-.251-.229a.284.284,0,0,0-.2.013.1.1,0,0,1-.14-.057.988.988,0,0,1-.026-.214.549.549,0,0,0-.093-.217,3.116,3.116,0,0,0-.391-.4c-.142-.141-.284-.284-.424-.428A.206.206,0,0,1,771.916,447.058Z" transform="translate(195.236 315.671)" fill="#3767d1"/>
    <path id="Tracé_110" data-name="Tracé 110" d="M702.6,341.117a11.263,11.263,0,0,0,.859.889c.06.06.052.008.077-.043a1.371,1.371,0,0,0,.1-.279c.05-.207.1-.414.155-.621s.1-.428.136-.646a2.533,2.533,0,0,1,.036-.3A.835.835,0,0,0,704,340a.782.782,0,0,0,0-.109.2.2,0,0,1,.019-.1c.009-.016.027-.028.035-.043a.114.114,0,0,0,0-.064.917.917,0,0,1,.009-.278c.017-.093.041-.185.05-.28a.77.77,0,0,0,0-.137c0-.033-.008-.072.033-.082s.064.022.089.041a.672.672,0,0,0,.127.071c.092.041.19.069.278.118s.173.116.269.162.2.087.3.135a.379.379,0,0,0-.056.132c0,.055-.005.111-.006.166a1.207,1.207,0,0,1-.009.309.751.751,0,0,0-.051.253.987.987,0,0,1-.049.3c-.055.214-.084.435-.137.65-.025.1-.061.2-.089.3s-.045.209-.07.312c-.053.212-.127.417-.185.627a3.14,3.14,0,0,1-.086.312c-.02.05-.043.1-.063.148s-.017.027-.051.03a.343.343,0,0,1-.07.011c-.039-.005-.071-.058-.1-.085s-.08-.083-.12-.125c-.076-.077-.153-.153-.23-.228-.157-.154-.315-.307-.462-.47s-.314-.357-.486-.524q-.13-.126-.267-.245c-.039-.034-.1-.07-.115-.123S702.551,341.076,702.6,341.117Z" transform="translate(260.599 417.49)" fill="#3d6ed7"/>
    <path id="Tracé_111" data-name="Tracé 111" d="M716.992,393a3.005,3.005,0,0,1,.655.57c.049.05.1.1.148.146a.334.334,0,0,1,.072.114.155.155,0,0,0,.084.093c.026.009.02,0,.027.024a.24.24,0,0,1,0,.053.544.544,0,0,1-.005.105c-.013.073-.066.111-.093.177a.286.286,0,0,0-.018.085.66.66,0,0,1,0,.124c-.01.032,0,.007-.021.019a.157.157,0,0,0-.026.009.075.075,0,0,0-.027.049.992.992,0,0,1-.041.145c-.122.316-.271.619-.419.923a.362.362,0,0,0-.037.115c0,.018,0,.037,0,.055s0,.025,0,.037h-.014c-.024.016-.031.012-.039.044s0,.034-.012.049-.041.032-.056.053a.536.536,0,0,0-.039.074.189.189,0,0,1-.114.116c-.021-.412-.016-.825-.016-1.237s0-.825,0-1.237Q716.992,393.353,716.992,393Z" transform="translate(246.966 366.536)" fill="#3966cb"/>
    <path id="Tracé_112" data-name="Tracé 112" d="M683.73,329.614a.335.335,0,0,1-.153-.009.341.341,0,0,1-.1-.1c-.079-.094-.179-.175-.266-.263s-.192-.2-.293-.3c-.047-.044-.094-.088-.143-.13-.026-.022-.055-.041-.079-.064a.75.75,0,0,1-.058-.086.525.525,0,0,0-.132-.1.071.071,0,0,1-.029-.068.069.069,0,0,1,.008-.026c.015-.026.021-.019.045-.012.047.014.087.068.118.1s.038.04.058.059.035.045.05.049c.051.013.047-.111.051-.137.01-.07.024-.14.039-.21a2.808,2.808,0,0,0,.068-.443c0-.032,0-.066,0-.1a.744.744,0,0,1,.035-.094.687.687,0,0,0,.022-.2,1.916,1.916,0,0,1,0-.193,1.858,1.858,0,0,1,.039-.207.817.817,0,0,0,.021-.193.465.465,0,0,1,.007-.138c.019-.067.074-.076.136-.067.133.02.267.071.4.1s.28.072.417.119l.1.038c.038.015.039.009.041.044a1.944,1.944,0,0,1,0,.244c-.012.147-.039.293-.057.439-.02.165-.027.331-.052.5s-.069.324-.1.487-.055.326-.1.486c-.02.073-.043.143-.056.217S683.747,329.534,683.73,329.614Z" transform="translate(279.473 428.993)" fill="#3e6fd7"/>
    <path id="Tracé_113" data-name="Tracé 113" d="M672.011,351.731a.6.6,0,0,0-.12.258,2.73,2.73,0,0,1-.1.3c-.088.223-.17.448-.255.671a.48.48,0,0,1-.06.15c-.044.041-.079-.016-.1-.053a.682.682,0,0,1-.033-.3c0-.242,0-.485-.005-.727,0-.492-.009-.985,0-1.477q0-.179.011-.358c0-.091-.016-.228.056-.3s.137.017.183.062c.078.076.158.15.235.228.043.044.085.089.124.136a.394.394,0,0,1,.057.073.268.268,0,0,1,.006.1v1.243Z" transform="translate(289.973 407.166)" fill="#3a65c9"/>
    <path id="Tracé_114" data-name="Tracé 114" d="M686,361.976c.119-.017.2.115.276.189l.29.291c.094.094.191.186.284.281a.557.557,0,0,0,.089.094c.01.006.023.008.033.014s.01,0,.016.022a.47.47,0,0,1,0,.1A9.657,9.657,0,0,1,686,361.976Z" transform="translate(276.158 395.76)" fill="#3a65cb"/>
    <path id="Tracé_115" data-name="Tracé 115" d="M667.475,346.145V349.3a.519.519,0,0,1-.021.2.363.363,0,0,0-.042.15c0,.028.007.022-.009.042a.264.264,0,0,1-.025.021.226.226,0,0,0-.052.073,1.061,1.061,0,0,0-.025.4c0,.025.006.058-.025.067s-.025-.008-.032-.03c-.018-.058-.04-.118-.055-.177a.9.9,0,0,1-.006-.22q0-.126,0-.252c0-.16,0-.321,0-.481,0-.647,0-1.294,0-1.941a1.2,1.2,0,0,0-.007-.274,1.2,1.2,0,0,1-.042-.259,3.521,3.521,0,0,1,.043-.5c0-.042,0-.088.011-.129a.11.11,0,0,1,.061-.073.081.081,0,0,1,.1.009.721.721,0,0,1,.074.093C667.457,346.06,667.521,346.088,667.475,346.145Z" transform="translate(293.928 410.894)" fill="#3b65c8"/>
    <path id="Tracé_116" data-name="Tracé 116" d="M823,498.116V498a4.028,4.028,0,0,1,.558.542c.063.079.117.207.209.255a.4.4,0,0,1,.079.043l.065.055c.053.046.1.095.156.144.1.1.194.2.292.292a.865.865,0,0,1,.121.124c.023.034.032.076.054.11a.136.136,0,0,0,.035.04c.017.013.041.011.057.022s.04.06.055.078.04.048.062.071c.082.087.174.163.255.251.03.032.082.064.094.109s-.025.1.029.123.192-.043.2.065h-1.2a.73.73,0,0,1-.236-.016,1.35,1.35,0,0,0-.409-.009c-.242-.009-.215-.266-.22-.443-.009-.31-.005-.614.011-.923A1.422,1.422,0,0,0,823,498.116Z" transform="translate(147.113 267.633)" fill="#3566d3"/>
    <path id="Tracé_117" data-name="Tracé 117" d="M798.4,477a2.632,2.632,0,0,1,.4.375c.03.031.059.061.09.09a.268.268,0,0,1,.087.1.256.256,0,0,1,0,.1c0,.051,0,.1,0,.152q0,.641,0,1.282c0,.107,0,.214,0,.32,0,.022-.009.119.02.129s.077-.066.091-.081a1.035,1.035,0,0,0,.139-.233c.048-.092.1-.184.15-.274l.077-.136.033-.058c.009-.015.028-.069.044-.078.035-.02.046.042.052.064a1.514,1.514,0,0,1,.047.258,5.539,5.539,0,0,1,.029.728,3.627,3.627,0,0,1-.057.666.807.807,0,0,1-.027.1c0,.008-.008.034-.016.039s-.054,0-.067,0h-.4a.516.516,0,0,1-.151-.013.567.567,0,0,0-.14-.02c-.095,0-.19.01-.284,0a.259.259,0,0,1-.127-.025.19.19,0,0,1-.059-.128,3.806,3.806,0,0,1-.027-.626c.008-.431,0-.861,0-1.292q0-.319,0-.638c0-.193-.012-.391,0-.583A.349.349,0,0,1,798.4,477Z" transform="translate(170.374 287.413)" fill="#3666d0"/>
    <path id="Tracé_118" data-name="Tracé 118" d="M761.129,500.3a.222.222,0,0,1-.058,0c-.005-.005,0-.031-.009-.04a.07.07,0,0,0-.053-.018c-.089-.007-.179,0-.268-.006l-.116,0-.07,0h-.023c-.021.007-.031,0-.028-.023a.319.319,0,0,1-.014-.111c0-.045,0-.089,0-.134,0-.082,0-.164,0-.246a.269.269,0,0,0,0-.058c0-.013-.02-.026-.025-.04a.133.133,0,0,1,.008-.1.972.972,0,0,1,.119-.186l.14-.2c.188-.269.357-.546.521-.829a2.108,2.108,0,0,1,.126-.2c.033-.044.069-.107.123-.127.13-.048.159.106.168.195.017.174.008.35.009.525s0,.334,0,.5c0,.242-.014.488,0,.729.007.1.029.181.132.206a.828.828,0,0,0,.184.014c.108,0,.216,0,.323,0a.582.582,0,0,1,.431.085c.034.032.018.056-.023.058s-.107,0-.16,0h-1.443Z" transform="translate(206.022 267.65)" fill="#3664cd"/>
    <path id="Tracé_119" data-name="Tracé 119" d="M819.992,502.231v-1.72a.758.758,0,0,1,.023-.255.623.623,0,0,1,.115-.19c.026-.032.041-.055.077-.028s.06.056.09.082a1.152,1.152,0,0,1,.161.164c.106.142.059.3.056.464-.007.384,0,.768,0,1.152a.8.8,0,0,0,.006.229c.014.042.052.041.09.043.1,0,.193,0,.289,0,.053,0,.2-.031.2.058Z" transform="translate(149.947 265.724)" fill="#3566d1"/>
    <path id="Tracé_120" data-name="Tracé 120" d="M799.982,537.01a.2.2,0,0,1,0-.039c.005-.025,0-.014.023-.019a.539.539,0,0,1,.1,0h.2c.061,0,.123,0,.185,0,.041,0,.076.009.072.058Z" transform="translate(168.795 230.946)" fill="#3766cf"/>
    <path id="Tracé_121" data-name="Tracé 121" d="M659.508,334.7c0,.191,0,.382,0,.572a.645.645,0,0,1-.042.223.49.49,0,0,0-.024.1.253.253,0,0,0,0,.059.06.06,0,0,1-.01.056.626.626,0,0,0-.071.2c-.014.072-.035.142-.049.213a.524.524,0,0,1-.068.2c-.02.029-.052.048-.071.077a.147.147,0,0,0-.016.095.958.958,0,0,1-.141.526.121.121,0,0,1-.032-.1c0-.056,0-.113,0-.169q0-.155,0-.311V334.53c0-.059,0-.117,0-.176s.012-.1.008-.147c-.007-.074-.086-.128-.062-.207a.316.316,0,0,1,.134.084c.029.043.059.087.087.131a.792.792,0,0,0,.121.16C659.367,334.468,659.487,334.552,659.508,334.7Z" transform="translate(301.664 422.11)" fill="#3b63c8"/>
    <path id="Tracé_122" data-name="Tracé 122" d="M655.979,331a.322.322,0,0,1,.174.174C656.042,331.174,655.966,331.119,655.979,331Z" transform="translate(304.438 424.936)" fill="#3b63c8"/>
    <path id="Tracé_123" data-name="Tracé 123" d="M646,319.853a.344.344,0,0,1,.219.029.5.5,0,0,0,.1.027c.03,0,.057,0,.077.024a.438.438,0,0,1,.037.1c.014.035.029.07.043.1a.543.543,0,0,1,.048.24A2.785,2.785,0,0,1,646,319.853Z" transform="translate(313.836 435.444)" fill="#3f6cd2"/>
    <path id="Tracé_124" data-name="Tracé 124" d="M742.163,464.78c-.009.064-.086.1-.058.174-.1.013-.105.12-.157.188a.325.325,0,0,1-.091.079c-.027.016-.038.03-.06,0a.266.266,0,0,1-.039-.068.743.743,0,0,1-.02-.28c0-.128,0-.256,0-.384,0-.254-.01-.51,0-.764,0-.028.015-.079-.022-.083s-.054.051-.068.076c-.06.105-.135.2-.2.306s-.139.209-.213.311c-.042.059-.085.141-.157.167a.141.141,0,0,1-.114-.007c-.022-.015-.011,0-.017-.031a.306.306,0,0,1,0-.046v-1.76a.325.325,0,0,1,0-.087c.006-.019.039-.043.052-.06s.036-.047.053-.071c.071-.1.128-.212.19-.32s.129-.216.187-.328.134-.213.2-.323.1-.235.171-.343a1.362,1.362,0,0,1,.02.442c0,.161,0,.322,0,.483,0,.325,0,.65,0,.975,0,.041-.018.128.009.164.039.052.093,0,.112-.039.04-.079.049-.184.141-.223.034-.015.044,0,.065.031a.263.263,0,0,1,.036.076.685.685,0,0,1,.015.2c0,.159,0,.318,0,.477A7.785,7.785,0,0,1,742.163,464.78Z" transform="translate(224.408 302.363)" fill="#3765cd"/>
    <path id="Tracé_125" data-name="Tracé 125" d="M740.885,501.208a.154.154,0,0,0,.167-.082c.053-.078.1-.159.154-.239l.311-.488c.051-.08.1-.164.154-.241.011-.015.031-.047.052-.047s.034.041.034.062c0,.188,0,.375,0,.563q0,.59,0,1.18a.356.356,0,0,1-.21.316.57.57,0,0,1-.211.02c-.1,0-.2,0-.3,0-.062,0-.138.016-.15-.062a1.953,1.953,0,0,1,0-.312C740.886,501.655,740.885,501.431,740.885,501.208Z" transform="translate(224.466 265.644)" fill="#3664cd"/>
    <path id="Tracé_126" data-name="Tracé 126" d="M663.348,338.465a.883.883,0,0,0-.2-.227c-.077-.07-.153-.125-.151-.237a3.311,3.311,0,0,1,.5.476l.052.064c.012.015.044.042.049.06.015.06-.054.029-.078.01C663.46,338.564,663.429,338.48,663.348,338.465Z" transform="translate(297.823 418.342)" fill="#3a65c9"/>
    <path id="Tracé_127" data-name="Tracé 127" d="M672.99,348.058V348a1.811,1.811,0,0,1,.331.3c.053.048.1.1.15.152.025.024.058.037.083.06s.016.019.016.046v.077a1.551,1.551,0,0,1-.312-.286c-.05-.048-.1-.1-.146-.145a.453.453,0,0,0-.07-.062c-.012-.008-.037-.015-.045-.025S672.99,348.081,672.99,348.058Z" transform="translate(288.413 408.923)" fill="#3a65ca"/>
    <path id="Tracé_128" data-name="Tracé 128" d="M761,476.938c-.079-.008-.061-.065-.057-.123.008-.109,0-.222,0-.331q0-.339,0-.679t0-.679v-.085a.233.233,0,0,1,0-.068c.007-.016.027-.01.046-.02a.12.12,0,0,0,.042-.039.614.614,0,0,0,.048-.105c.021-.047.045-.093.07-.139.093-.17.206-.33.284-.507.013-.03.024-.094.049-.116.041-.034.072.016.09.049a.531.531,0,0,1,.038.262c0,.452.019.9,0,1.356-.005.125-.013.251-.026.376a.372.372,0,0,1-.084.152l-.089.137A4.016,4.016,0,0,1,761,476.938Z" transform="translate(205.567 290.204)" fill="#3765ce"/>
    <path id="Tracé_129" data-name="Tracé 129" d="M770.98,451.641c-.059-.006-.068-.042-.061-.093a1.72,1.72,0,0,0,0-.223q0-.265,0-.53,0-.541,0-1.083c0-.36,0-.72,0-1.08a3.942,3.942,0,0,0,0-.5c0-.035-.006-.088.044-.09.032,0,.058.052.08.078s.053.062.08.092c.11.12.231.23.347.344s.224.234.339.347.231.183.216.35c-.006.064,0,.126,0,.189s-.007.1.056.1.1-.05.115-.1.037-.1.1-.062a1.2,1.2,0,0,1,.135.129,1,1,0,0,1,.151.163.172.172,0,0,1,.029.118v3.414c-.3,0-.6,0-.9,0-.068,0-.225.037-.256-.05a.511.511,0,0,1-.007-.168q0-.116,0-.232,0-.447,0-.894,0-.226,0-.453,0-.1,0-.209a1.169,1.169,0,0,0,0-.21c-.015-.079-.065-.015-.086.021-.042.071-.083.144-.123.216C771.153,451.37,771.066,451.505,770.98,451.641Z" transform="translate(196.172 314.688)" fill="#3766cf"/>
  </g>
</svg>
