{
  "routingKey": "laboratoirerepresentants",
  "index": "laboratoirerepresentant",
  "mappingProperties": {
    "id": {
      "type": "keyword"
    },
    "nom": {
      "type": "keyword"
    },
    "type": {
      "type": "keyword"
    },
    "civilite": {
      "type": "keyword"
    },
    "prenom": {
      "type": "keyword"
    },
    "sexe": {
      "type": "keyword"
    },
    "fonction": {
      "type": "keyword"
    },
    "commentaire": {
      "type": "keyword"
    },
    "afficherComme": {
      "type": "keyword"
    },
    "isRemoved": {
      "type": "keyword"
    },
    "laboratoire": {
      "properties": {
        "id": {
          "type": "keyword"
        }
      }
    }
  },
  "instances": 1,
  "query": "query laboratoireRepresentant($id: ID!) { laboratoireRepresentant(id: $id) { type id type civilite nom prenom sexe fonction commentaire afficherComme  codeMaj isRemoved  contact { id type adresse1 mailProf } laboratoire { id type nomLabo } userCreation { id userName } userModification { id userName } photo { id type urlPresigned publicUrl  nomOriginal chemin } dateCreation dateModification } }",
  "dataKey": "laboratoireRepresentant"
}
