{
  "routingKey": "suivipublicitaires",
  "index": "suivipublicitaire",
  "mappingProperties": {
    "id": {
      "type": "keyword"
    },
    "user": {
      "properties": {
        "id": {
          "type": "keyword"
        },
        "email": {
          "type": "keyword"
        },

        "login": {
          "type": "keyword"
        },
        "userName": {
          "type": "keyword"
        },
        "role": {
          "properties": {
            "id": {
              "type": "keyword"
            },
            "code": {
              "type": "keyword"
            }
          }
        }
      }
    },
    "transformCommande": {
      "type": "keyword"
    },
    "publicite": {
      "properties": {
        "id": {
          "type": "keyword"
        },
        "libelle": {
          "type": "keyword"
        },
        "typeEspace": {
          "type": "keyword"
        },
        "origine": {
          "type": "keyword"
        },
        "item": {
          "properties": {
            "id": {
              "type": "keyword"
            },
            "code": {
              "type": "keyword"
            }
          }
        },
        "dateDebuit": {
          "type": "date",
          "format": "date_optional_time||strict_date_optional_time"
        },
        "dateFin": {
          "type": "date",
          "format": "date_optional_time||strict_date_optional_time"
        }
      }
    },
    "dateClick": {
      "type": "date",
      "format": "date_optional_time||strict_date_optional_time"
    },
    "nbClick": {
      "type": "keyword"
    },
    "nbView": {
      "type": "keyword"
    },
    "nbAccesOp": {
      "type": "keyword"
    },
    "nbCommande": {
      "type": "keyword"
    }
  },
  "instances": 1,
  "query": "query suiviPublicitaire($id: ID!) { suiviPublicitaire(id: $id) { id dateClick nbClick nbView nbAccesOp nbCommande transformCommande commande { id } user { id userName email login role { id code } }  publicite { id libelle typeEspace origine dateDebut dateFin item { id code name } idItemSource } } }",
  "dataKey": "suiviPublicitaire"
}
