{
  "routingKey": "actualiteorigines",
  "index": "actualiteorigine",
  "mappingProperties": {
    "id": {
      "type": "keyword"
    },
    "libelle": {
      "type": "keyword"
    },
    "code": {
      "type": "keyword"
    },
    "ordre": {
      "type": "keyword"
    }
  },
  "instances": 1,
  "query": "query actualiteOrigine($id: ID!) { actualiteOrigine(id: $id) { id libelle code ordre } }",
  "dataKey": "actualiteOrigine"
}