<svg id="bar_chart-24px" xmlns="http://www.w3.org/2000/svg" width="28.654" height="28.654" viewBox="0 0 28.654 28.654">
  <path id="Tracé_2545" data-name="Tracé 2545" d="M0,0H28.654V28.654H0Z" fill="none"/>
  <g id="Groupe_12531" data-name="Groupe 12531" transform="translate(3.068 1.572)">
    <path id="Tracé_2799" data-name="Tracé 2799" d="M1027.6,414.853c.332.589,2.458.885,3.5.847s3.173-.5,3.093-1.4a9,9,0,0,1,1.062-4.181c.4-.626.438-1.932-1.274-1.31-.4.145-1.346,1.128-1.747-.037-.722-2.093-2.4-1.512-2.765-.145-.255.946-1.275,1.018-2.439.909-1.364-.128-1.539.726-1.085,1.448C1026.183,411.37,1027.216,414.177,1027.6,414.853Z" transform="translate(-1019.907 -407.398)" fill="#fff"/>
    <g id="Groupe_12535" data-name="Groupe 12535" transform="translate(0 8.573)">
      <path id="Tracé_2800" data-name="Tracé 2800" d="M998.419,469.752a5.487,5.487,0,0,1-3.695,1.162A6.057,6.057,0,0,1,991,470.06c-4.09,1.422-7.54,5.6-7.54,9.827,0,5.442,3.106,6.872,11.742,6.872s11.743-1.466,11.743-6.872C1006.945,475.337,1002.742,470.982,998.419,469.752Zm-1.961,7.629v1.2h-3.846a3.76,3.76,0,0,0,0,1.2h3.846v1.2h-3.451a3.882,3.882,0,0,0,3.451,2.1,3.837,3.837,0,0,0,2.528-.94l1.067,1.061a5.385,5.385,0,0,1-8.676-2.218H989.27v-1.2H991.1a5.059,5.059,0,0,1,0-1.2H989.27v-1.2h2.108a5.385,5.385,0,0,1,8.676-2.216l-1.061,1.06a3.887,3.887,0,0,0-5.985,1.156Z" transform="translate(-983.46 -469.75)" fill="#fff"/>
    </g>
  </g>
</svg>
