{
    "language": "Solidity",
    "settings": {
        "remappings": [
            "utils/=contracts/current/utils/",
            "tokens/=contracts/current/tokens/",
            "TokenTransferProxy/=contracts/current/protocol/TokenTransferProxy/",
            "current/=contracts/current/",
            "previous/=contracts/previous/"
        ],
        "optimizer": {
            "enabled": false,
            "runs": 500
        },
        "outputSelection": {
            "Exchange.sol": {
                "*": [
                    "metadata",
                    "abi",
                    "evm.bytecode",
                    "evm.sourceMap"
                ]
            },
            "WETH9.sol": {
                "*": [
                    "metadata",
                    "abi",
                    "evm.bytecode",
                    "evm.sourceMap"
                ]
            },
            "DemoTokens.sol": {
                "*": [
                    "metadata",
                    "abi",
                    "evm.bytecode",
                    "evm.sourceMap"
                ]
            },
            "ZRXToken.sol": {
                "*": [
                    "metadata",
                    "abi",
                    "evm.bytecode",
                    "evm.sourceMap"
                ]
            },
            "contracts/current/protocol/TokenTransferProxy/TokenTransferProxy.sol": {
                "*": [
                    "metadata",
                    "abi",
                    "evm.bytecode",
                    "evm.sourceMap"
                ]
            },
            "dappsys.sol": {
                "*": [
                    "metadata",
                    "abi",
                    "evm.bytecode",
                    "evm.sourceMap"
                ]
            }
        }
    },
    "sources": {
        "Exchange.sol": {
            "urls": [
                "contracts/current/protocol/Exchange/Exchange.sol"
            ]
        },
        "WETH9.sol": {
            "urls": [
                "contracts/current/tokens/WETH9/WETH9.sol"
            ]
        },
        "DemoTokens.sol": {
            "urls": [
                "contracts/DemoTokens.sol"
            ]
        },
        "ZRXToken.sol": {
            "urls": [
                "contracts/current/tokens/ZRXToken/ZRXToken.sol"
            ]
        },
        "contracts/current/protocol/TokenTransferProxy/TokenTransferProxy.sol": {
            "urls": [
                "contracts/current/protocol/TokenTransferProxy/TokenTransferProxy.sol"
            ]
        },
        "dappsys.sol": {
            "urls": [
                "contracts/dappsys.sol"
            ]
        }
    }
}
