{
  "Global": {
    "fs-base": {
      "value": "1rem",
      "type": "fontSizes",
      "description": "Base for all font sizes"
    },
    "border-1": {
      "value": "1px",
      "type": "borderWidth",
      "description": "For use on anything with a 1px border"
    },
    "border-2": {
      "value": "2px",
      "type": "borderWidth",
      "description": "For use on anything with a 2px border"
    },
    "Island": {
      "island-100": {
        "value": "#e4f9fb",
        "type": "color"
      },
      "island-200": {
        "value": "#fff",
        "type": "color"
      },
      "island-300": {
        "value": "#7bf1ff",
        "type": "color"
      },
      "island-400": {
        "value": "#00e4ff",
        "type": "color"
      },
      "island-500": {
        "value": "#1ab2c5",
        "type": "color"
      },
      "island-600": {
        "value": "#15909e",
        "type": "color"
      },
      "island-700": {
        "value": "#0f6771",
        "type": "color"
      },
      "island-800": {
        "value": "#0a464d",
        "type": "color"
      },
      "island-900": {
        "value": "#093f45",
        "type": "color"
      }
    },
    "Mountain": {
      "mountain-100": {
        "value": "#f4e9f7",
        "type": "color"
      },
      "mountain-200": {
        "value": "#f8ddff",
        "type": "color"
      },
      "mountain-300": {
        "value": "#d7ace1",
        "type": "color"
      },
      "mountain-400": {
        "value": "#c380d1",
        "type": "color"
      },
      "mountain-500": {
        "value": "#ff0",
        "type": "color"
      },
      "mountain-600": {
        "value": "#783188",
        "type": "color"
      },
      "mountain-900": {
        "value": "#37123d",
        "type": "color"
      }
    },
    "Desert": {
      "desert-100": {
        "value": "#f9e890",
        "type": "color"
      },
      "desert-200": {
        "value": "#f2cd5d",
        "type": "color"
      },
      "desert-300": {
        "value": "#f9a11e",
        "type": "color"
      },
      "desert-500": {
        "value": "#c93f08",
        "type": "color"
      }
    },
    "fs-sm": {
      "value": ".875rem",
      "type": "fontSizes",
      "description": "Font size used for smaller body text (helper text, etc.) and button text"
    },
    "Core": {
      "fully-rounded": {
        "value": "6.25rem",
        "type": "borderRadius",
        "description": "Fully-rounded sides"
      },
      "size-sm": {
        "value": ".875rem",
        "type": "sizing",
        "description": "14px sizing"
      },
      "spacing-sm": {
        "value": ".5rem",
        "type": "spacing",
        "description": "Small spacing 8px"
      },
      "size-6xl": {
        "value": "2.75rem",
        "type": "sizing",
        "description": "44px / 2.75rem size"
      }
    },
    "Icon": {
      "sizing-sm": {
        "value": "{Core.size-sm}",
        "type": "sizing",
        "description": "14px icon size"
      }
    },
    "lh-default": {
      "value": "24",
      "type": "lineHeights",
      "description": "Default line-height 24px / 1.5rem"
    },
    "Button": {
      "lh-default": {
        "value": "{lh-default}",
        "type": "lineHeights",
        "description": "Default line-height for buttons"
      },
      "fs-default": {
        "value": "{fs-sm}",
        "type": "fontSizes",
        "description": "Default font size for buttons 14px"
      },
      "border-default": {
        "value": {
          "color": "{Button.cta-primary}",
          "width": "{border-2}",
          "style": "solid"
        },
        "type": "border",
        "description": "Default border for buttons"
      },
      "spacing-default": {
        "value": "{Core.spacing-sm}",
        "type": "spacing",
        "description": "Default spacing for button- space between icons and text"
      },
      "height-default": {
        "value": "{Core.size-6xl}",
        "type": "sizing",
        "description": "Default height for buttons"
      }
    },
    "montserrat": {
      "value": "Montserrat",
      "type": "fontFamilies",
      "description": "Font used primarily for headings and buttons"
    },
    "nunito": {
      "value": "Nunito",
      "type": "fontFamilies",
      "description": "Font used primarily for body text"
    },
    "Montserrat": {
      "semibold": {
        "value": "SemiBold",
        "type": "fontWeights"
      }
    },
    "Button Text": {
      "value": {
        "fontFamily": "{montserrat}",
        "fontWeight": "{Montserrat.semibold}",
        "lineHeight": "{Button.lh-default}",
        "fontSize": "{Button.fs-default}"
      },
      "type": "typography"
    },
    "Grayscale": {
      "white": {
        "value": "#fff",
        "type": "color",
        "description": "White"
      }
    }
  },
  "Light Theme": {
    "CTA-Primary": {
      "value": "{Mountain.mountain-500}",
      "type": "color",
      "description": "The primary CTA color for Light Theme"
    },
    "Button": {
      "cta-primary": {
        "value": "{CTA-Primary}",
        "type": "color",
        "description": "Primary CTA color for an enabled button in Light Theme"
      }
    },
    "Typography": {
      "contrast": {
        "value": "{Grayscale.white}",
        "type": "color",
        "description": "Default contrasting text style for Light Theme"
      }
    }
  },
  "Dark Theme": {},
  "$themes": [],
  "$metadata": {
    "tokenSetOrder": [
      "Global",
      "Light Theme",
      "Dark Theme"
    ]
  }
}