4 0 0 92 4 1 0 0 0 
11 0 0 85 4 1 0 0 0 
5 0 0 91 4 1 0 0 0 
5 0 0 91 4 1 0 0 0 
5 0 0 91 4 1 0 0 0 
10 0 0 86 4 1 0 0 0 
1 0 0 95 4 1 0 0 0 
11 0 0 85 4 1 0 0 0 
11 0 0 85 4 1 0 0 0 
11 0 0 85 4 1 0 0 0 
11 0 0 85 4 1 0 0 0 
11 0 0 85 4 1 0 0 0 
11 0 0 85 4 1 0 0 0 
11 0 0 85 4 1 0 0 0 
11 0 0 85 4 1 0 0 0 
11 0 0 85 4 1 0 0 0 
11 0 0 85 4 1 0 0 0 
10 0 0 86 4 1 0 0 0 
10 0 0 86 4 1 0 0 0 
10 0 0 86 4 1 0 0 0 
10 0 0 86 4 1 0 0 0 
10 0 0 86 4 1 0 0 0 
10 0 0 86 4 1 0 0 0 
10 0 0 86 4 1 0 0 0 
10 0 0 86 4 1 0 0 0 
10 0 0 86 4 1 0 0 0 
5 0 0 91 4 1 0 0 0 
5 0 0 91 4 1 0 0 0 
5 0 0 91 4 1 0 0 0 
5 0 0 91 4 1 0 0 0 
5 0 0 91 4 1 0 0 0 
5 0 0 91 4 1 0 0 0 
5 0 0 91 4 1 0 0 0 
5 0 0 91 4 1 0 0 0 
5 0 0 91 4 1 0 0 0 
5 0 0 91 4 1 0 0 0 
5 0 0 91 4 1 0 0 0 
5 0 0 91 4 1 0 0 0 
5 0 0 91 4 1 0 0 0 
5 0 0 91 4 1 0 0 0 
5 0 0 91 4 1 0 0 0 
5 0 0 91 4 1 0 0 0 
5 0 0 91 4 1 0 0 0 
5 0 0 91 4 1 0 0 0 
1 0 0 95 4 1 0 0 0 
1 0 0 95 4 1 0 0 0 
1 0 0 95 4 1 0 0 0 
1 0 0 95 4 1 0 0 0 
1 0 0 95 4 1 0 0 0 
1 0 0 95 4 1 0 0 0 
1 0 0 95 4 1 0 0 0 
1 0 0 95 4 1 0 0 0 
1 0 0 95 4 1 0 0 0 
5 0 0 91 4 1 0 0 0 
5 0 0 91 4 1 0 0 0 
5 0 0 91 4 1 0 0 0 
5 0 0 91 4 1 0 0 0 
5 0 0 91 4 1 0 0 0 
5 0 0 91 4 1 0 0 0 
5 0 0 91 4 1 0 0 0 
5 0 0 91 4 1 0 0 0 
5 0 0 91 4 1 0 0 0 
5 0 0 91 4 1 0 0 0 
5 0 0 91 4 1 0 0 0 
5 0 0 91 4 1 0 0 0 
5 0 0 91 4 1 0 0 0 
5 0 0 91 4 1 0 0 0 
5 0 0 91 4 1 0 0 0 
5 0 0 91 4 1 0 0 0 
5 0 0 91 4 1 0 0 0 
5 0 0 91 4 1 0 0 0 
5 0 0 91 4 1 0 0 0 
11 0 0 85 4 1 0 0 0 
11 0 0 85 4 1 0 0 0 
11 0 0 85 4 1 0 0 0 
11 0 0 85 4 1 0 0 0 
11 0 0 85 4 1 0 0 0 
11 0 0 85 4 1 0 0 0 
11 0 0 85 4 1 0 0 0 
11 0 0 85 4 1 0 0 0 
11 0 0 85 4 1 0 0 0 
5 0 0 91 4 1 0 0 0 
5 0 0 91 4 1 0 0 0 
5 0 0 91 4 1 0 0 0 
5 0 0 91 4 1 0 0 0 
5 0 0 91 4 1 0 0 0 
5 0 0 91 4 1 0 0 0 
5 0 0 91 4 1 0 0 0 
5 0 0 91 4 1 0 0 0 
10 0 0 86 4 1 0 0 0 
10 0 0 86 4 1 0 0 0 
10 0 0 86 4 1 0 0 0 
10 0 0 86 4 1 0 0 0 
10 0 0 86 4 1 0 0 0 
10 0 0 86 4 1 0 0 0 
10 0 0 86 4 1 0 0 0 
10 0 0 86 4 1 0 0 0 
5 0 0 91 4 1 0 0 0 
5 0 0 91 4 1 0 0 0 
5 0 0 91 4 1 0 0 0 
5 0 0 91 4 1 0 0 0 
5 0 0 91 4 1 0 0 0 
5 0 0 91 4 1 0 0 0 
5 0 0 91 4 1 0 0 0 
5 0 0 91 4 1 0 0 0 
1 0 0 95 4 1 0 0 0 
1 0 0 95 4 1 0 0 0 
1 0 0 95 4 1 0 0 0 
1 0 0 95 4 1 0 0 0 
1 0 0 95 4 1 0 0 0 
1 0 0 95 4 1 0 0 0 
1 0 0 95 4 1 0 0 0 
1 0 0 95 4 1 0 0 0 
11 0 0 85 4 1 0 0 0 
11 0 0 85 4 1 0 0 0 
11 0 0 85 4 1 0 0 0 
11 0 0 85 4 1 0 0 0 
11 0 0 85 4 1 0 0 0 
11 0 0 85 4 1 0 0 0 
11 0 0 85 4 1 0 0 0 
11 0 0 85 4 1 0 0 0 
4 0 0 92 4 1 0 0 0 
4 0 0 92 4 1 0 0 0 
4 0 0 92 4 1 0 0 0 
4 0 0 92 4 1 0 0 0 
4 0 0 92 4 1 0 0 0 
4 0 0 92 4 1 0 0 0 
4 0 0 92 4 1 0 0 0 
4 0 0 92 4 1 0 0 0 
4 0 0 92 4 1 0 0 0 
5 0 0 91 4 1 0 0 0 
5 0 0 91 4 1 0 0 0 
5 0 0 91 4 1 0 0 0 
5 0 0 91 4 1 0 0 0 
5 0 0 91 4 1 0 0 0 
5 0 0 91 4 1 0 0 0 
5 0 0 91 4 1 0 0 0 
5 0 0 91 4 1 0 0 0 
5 0 0 91 4 1 0 0 0 
5 0 0 91 4 1 0 0 0 
5 0 0 91 4 1 0 0 0 
5 0 0 91 4 1 0 0 0 
5 0 0 91 4 1 0 0 0 
5 0 0 91 4 1 0 0 0 
5 0 0 91 4 1 0 0 0 
1 0 0 95 4 1 0 0 0 
1 0 0 95 4 1 0 0 0 
1 0 0 95 4 1 0 0 0 
1 0 0 95 4 1 0 0 0 
1 0 0 95 4 1 0 0 0 
1 0 0 95 4 1 0 0 0 
1 0 0 95 4 1 0 0 0 
5 0 0 91 4 1 0 0 0 
5 0 0 91 4 1 0 0 0 
5 0 0 91 4 1 0 0 0 
5 0 0 91 4 1 0 0 0 
5 0 0 91 4 1 0 0 0 
5 0 0 91 4 1 0 0 0 
5 0 0 91 4 1 0 0 0 
5 0 0 91 4 1 0 0 0 
5 0 0 91 4 1 0 0 0 
5 0 0 91 4 1 0 0 0 
11 0 0 85 4 1 0 0 0 
11 0 0 85 4 1 0 0 0 
11 0 0 85 4 1 0 0 0 
11 0 0 85 4 1 0 0 0 
11 0 0 85 4 1 0 0 0 
11 0 0 85 4 1 0 0 0 
11 0 0 85 4 1 0 0 0 
1 0 0 95 4 1 0 0 0 
1 0 0 95 4 1 0 0 0 
1 0 0 95 4 1 0 0 0 
1 0 0 95 4 1 0 0 0 
1 0 0 95 4 1 0 0 0 
1 0 0 95 4 1 0 0 0 
5 0 0 91 4 1 0 0 0 
5 0 0 91 4 1 0 0 0 
5 0 0 91 4 1 0 0 0 
5 0 0 91 4 1 0 0 0 
5 0 0 91 4 1 0 0 0 
5 0 0 91 4 1 0 0 0 
10 0 0 86 4 1 0 0 0 
10 0 0 86 4 1 0 0 0 
10 0 0 86 4 1 0 0 0 
10 0 0 86 4 1 0 0 0 
10 0 0 86 4 1 0 0 0 
10 0 0 86 4 1 0 0 0 
10 0 0 86 4 1 0 0 0 
4 0 0 92 4 1 0 0 0 
4 0 0 92 4 1 0 0 0 
4 0 0 92 4 1 0 0 0 
4 0 0 92 4 1 0 0 0 
4 0 0 92 4 1 0 0 0 
4 0 0 92 4 1 0 0 0 
4 0 0 92 4 1 0 0 0 
4 0 0 92 4 1 0 0 0 
4 0 0 92 4 1 0 0 0 
4 0 0 92 4 1 0 0 0 
11 0 0 85 4 1 0 0 0 
11 0 0 85 4 1 0 0 0 
11 0 0 85 4 1 0 0 0 
11 0 0 85 4 1 0 0 0 
11 0 0 85 4 1 0 0 0 
11 0 0 85 4 1 0 0 0 
1 0 0 95 4 1 0 0 0 
1 0 0 95 4 1 0 0 0 
1 0 0 95 4 1 0 0 0 
1 0 0 95 4 1 0 0 0 
1 0 0 95 4 1 0 0 0 
5 0 0 91 4 1 0 0 0 
5 0 0 91 4 1 0 0 0 
5 0 0 91 4 1 0 0 0 
5 0 0 91 4 1 0 0 0 
5 0 0 91 4 1 0 0 0 
5 0 0 91 4 1 0 0 0 
5 0 0 91 4 1 0 0 0 
5 0 0 91 4 1 0 0 0 
5 0 0 91 4 1 0 0 0 
5 0 0 91 4 1 0 0 0 
5 0 0 91 4 1 0 0 0 
5 0 0 91 4 1 0 0 0 
10 0 0 86 4 1 0 0 0 
10 0 0 86 4 1 0 0 0 
10 0 0 86 4 1 0 0 0 
10 0 0 86 4 1 0 0 0 
10 0 0 86 4 1 0 0 0 
10 0 0 86 4 1 0 0 0 
4 0 0 92 4 1 0 0 0 
4 0 0 92 4 1 0 0 0 
4 0 0 92 4 1 0 0 0 
4 0 0 92 4 1 0 0 0 
4 0 0 92 4 1 0 0 0 
4 0 0 92 4 1 0 0 0 
4 0 0 92 4 1 0 0 0 
4 0 0 92 4 1 0 0 0 
5 0 0 91 4 1 0 0 0 
5 0 0 91 4 1 0 0 0 
5 0 0 91 4 1 0 0 0 
5 0 0 91 4 1 0 0 0 
5 0 0 91 4 1 0 0 0 
5 0 0 91 4 1 0 0 0 
1 0 0 95 4 1 0 0 0 
1 0 0 95 4 1 0 0 0 
1 0 0 95 4 1 0 0 0 
1 0 0 95 4 1 0 0 0 
1 0 0 95 4 1 0 0 0 
1 0 0 95 4 1 0 0 0 
1 0 0 95 4 1 0 0 0 
1 0 0 95 4 1 0 0 0 
1 0 0 95 4 1 0 0 0 
1 0 0 95 4 1 0 0 0 
11 0 0 85 4 1 0 0 0 
11 0 0 85 4 1 0 0 0 
11 0 0 85 4 1 0 0 0 
11 0 0 85 4 1 0 0 0 
11 0 0 85 4 1 0 0 0 
5 0 0 91 4 1 0 0 0 
5 0 0 91 4 1 0 0 0 
5 0 0 91 4 1 0 0 0 
5 0 0 91 4 1 0 0 0 
5 0 0 91 4 1 0 0 0 
5 0 0 91 4 1 0 0 0 
5 0 0 91 4 1 0 0 0 
5 0 0 91 4 1 0 0 0 
5 0 0 91 4 1 0 0 0 
5 0 0 91 4 1 0 0 0 
5 0 0 91 4 1 0 0 0 
5 0 0 91 4 1 0 0 0 
4 0 0 92 4 1 0 0 0 
4 0 0 92 4 1 0 0 0 
4 0 0 92 4 1 0 0 0 
4 0 0 92 4 1 0 0 0 
4 0 0 92 4 1 0 0 0 
4 0 0 92 4 1 0 0 0 
4 0 0 92 4 1 0 0 0 
5 0 0 91 4 1 0 0 0 
5 0 0 91 4 1 0 0 0 
5 0 0 91 4 1 0 0 0 
5 0 0 91 4 1 0 0 0 
10 0 0 86 4 1 0 0 0 
10 0 0 86 4 1 0 0 0 
10 0 0 86 4 1 0 0 0 
10 0 0 86 4 1 0 0 0 
10 0 0 86 4 1 0 0 0 
10 0 0 86 4 1 0 0 0 
10 0 0 86 4 1 0 0 0 
10 0 0 86 4 1 0 0 0 
10 0 0 86 4 1 0 0 0 
10 0 0 86 4 1 0 0 0 
11 0 0 85 4 1 0 0 0 
11 0 0 85 4 1 0 0 0 
11 0 0 85 4 1 0 0 0 
11 0 0 85 4 1 0 0 0 
5 0 0 91 4 1 0 0 0 
5 0 0 91 4 1 0 0 0 
5 0 0 91 4 1 0 0 0 
5 0 0 91 4 1 0 0 0 
5 0 0 91 4 1 0 0 0 
5 0 0 91 4 1 0 0 0 
5 0 0 91 4 1 0 0 0 
5 0 0 91 4 1 0 0 0 
5 0 0 91 4 1 0 0 0 
5 0 0 91 4 1 0 0 0 
5 0 0 91 4 1 0 0 0 
5 0 0 91 4 1 0 0 0 
5 0 0 91 4 1 0 0 0 
5 0 0 91 4 1 0 0 0 
5 0 0 91 4 1 0 0 0 
5 0 0 91 4 1 0 0 0 
5 0 0 91 4 1 0 0 0 
5 0 0 91 4 1 0 0 0 
5 0 0 91 4 1 0 0 0 
5 0 0 91 4 1 0 0 0 
11 0 0 85 4 1 0 0 0 
11 0 0 85 4 1 0 0 0 
11 0 0 85 4 1 0 0 0 
5 0 0 91 4 1 0 0 0 
5 0 0 91 4 1 0 0 0 
5 0 0 91 4 1 0 0 0 
10 0 0 86 4 1 0 0 0 
10 0 0 86 4 1 0 0 0 
10 0 0 86 4 1 0 0 0 
10 0 0 86 4 1 0 0 0 
10 0 0 86 4 1 0 0 0 
5 0 0 91 4 1 0 0 0 
5 0 0 91 4 1 0 0 0 
5 0 0 91 4 1 0 0 0 
5 0 0 91 4 1 0 0 0 
5 0 0 91 4 1 0 0 0 
1 0 0 95 4 1 0 0 0 
1 0 0 95 4 1 0 0 0 
1 0 0 95 4 1 0 0 0 
1 0 0 95 4 1 0 0 0 
10 0 0 86 4 1 0 0 0 
10 0 0 86 4 1 0 0 0 
10 0 0 86 4 1 0 0 0 
10 0 0 86 4 1 0 0 0 
4 0 0 93 3 1 0 0 0 
11 0 0 86 3 1 0 0 0 
5 0 0 92 3 1 0 0 0 
5 0 0 92 3 1 0 0 0 
5 0 0 92 3 1 0 0 0 
10 0 0 87 3 1 0 0 0 
1 0 0 96 3 1 0 0 0 
4 0 0 93 3 1 0 0 0 
11 0 0 86 3 1 0 0 0 
5 0 0 92 3 1 0 0 0 
5 0 0 92 3 1 0 0 0 
5 0 0 92 3 1 0 0 0 
10 0 0 87 3 1 0 0 0 
1 0 0 96 3 1 0 0 0 
11 0 0 86 3 1 0 0 0 
11 0 0 86 3 1 0 0 0 
11 0 0 86 3 1 0 0 0 
11 0 0 86 3 1 0 0 0 
11 0 0 86 3 1 0 0 0 
11 0 0 86 3 1 0 0 0 
11 0 0 86 3 1 0 0 0 
11 0 0 86 3 1 0 0 0 
11 0 0 86 3 1 0 0 0 
11 0 0 86 3 1 0 0 0 
10 0 0 87 3 1 0 0 0 
10 0 0 87 3 1 0 0 0 
10 0 0 87 3 1 0 0 0 
10 0 0 87 3 1 0 0 0 
10 0 0 87 3 1 0 0 0 
10 0 0 87 3 1 0 0 0 
10 0 0 87 3 1 0 0 0 
10 0 0 87 3 1 0 0 0 
10 0 0 87 3 1 0 0 0 
5 0 0 92 3 1 0 0 0 
5 0 0 92 3 1 0 0 0 
5 0 0 92 3 1 0 0 0 
5 0 0 92 3 1 0 0 0 
5 0 0 92 3 1 0 0 0 
5 0 0 92 3 1 0 0 0 
5 0 0 92 3 1 0 0 0 
5 0 0 92 3 1 0 0 0 
5 0 0 92 3 1 0 0 0 
5 0 0 92 3 1 0 0 0 
5 0 0 92 3 1 0 0 0 
5 0 0 92 3 1 0 0 0 
5 0 0 92 3 1 0 0 0 
5 0 0 92 3 1 0 0 0 
5 0 0 92 3 1 0 0 0 
5 0 0 92 3 1 0 0 0 
5 0 0 92 3 1 0 0 0 
5 0 0 92 3 1 0 0 0 
1 0 0 96 3 1 0 0 0 
1 0 0 96 3 1 0 0 0 
1 0 0 96 3 1 0 0 0 
1 0 0 96 3 1 0 0 0 
1 0 0 96 3 1 0 0 0 
1 0 0 96 3 1 0 0 0 
1 0 0 96 3 1 0 0 0 
1 0 0 96 3 1 0 0 0 
1 0 0 96 3 1 0 0 0 
5 0 0 92 3 1 0 0 0 
5 0 0 92 3 1 0 0 0 
5 0 0 92 3 1 0 0 0 
5 0 0 92 3 1 0 0 0 
5 0 0 92 3 1 0 0 0 
5 0 0 92 3 1 0 0 0 
5 0 0 92 3 1 0 0 0 
5 0 0 92 3 1 0 0 0 
5 0 0 92 3 1 0 0 0 
5 0 0 92 3 1 0 0 0 
5 0 0 92 3 1 0 0 0 
5 0 0 92 3 1 0 0 0 
5 0 0 92 3 1 0 0 0 
5 0 0 92 3 1 0 0 0 
5 0 0 92 3 1 0 0 0 
5 0 0 92 3 1 0 0 0 
5 0 0 92 3 1 0 0 0 
5 0 0 92 3 1 0 0 0 
5 0 0 92 3 1 0 0 0 
11 0 0 86 3 1 0 0 0 
11 0 0 86 3 1 0 0 0 
11 0 0 86 3 1 0 0 0 
11 0 0 86 3 1 0 0 0 
11 0 0 86 3 1 0 0 0 
11 0 0 86 3 1 0 0 0 
11 0 0 86 3 1 0 0 0 
11 0 0 86 3 1 0 0 0 
11 0 0 86 3 1 0 0 0 
5 0 0 92 3 1 0 0 0 
5 0 0 92 3 1 0 0 0 
5 0 0 92 3 1 0 0 0 
5 0 0 92 3 1 0 0 0 
5 0 0 92 3 1 0 0 0 
5 0 0 92 3 1 0 0 0 
5 0 0 92 3 1 0 0 0 
5 0 0 92 3 1 0 0 0 
10 0 0 87 3 1 0 0 0 
10 0 0 87 3 1 0 0 0 
10 0 0 87 3 1 0 0 0 
10 0 0 87 3 1 0 0 0 
10 0 0 87 3 1 0 0 0 
10 0 0 87 3 1 0 0 0 
10 0 0 87 3 1 0 0 0 
10 0 0 87 3 1 0 0 0 
5 0 0 92 3 1 0 0 0 
5 0 0 92 3 1 0 0 0 
5 0 0 92 3 1 0 0 0 
5 0 0 92 3 1 0 0 0 
5 0 0 92 3 1 0 0 0 
5 0 0 92 3 1 0 0 0 
5 0 0 92 3 1 0 0 0 
5 0 0 92 3 1 0 0 0 
1 0 0 96 3 1 0 0 0 
1 0 0 96 3 1 0 0 0 
1 0 0 96 3 1 0 0 0 
1 0 0 96 3 1 0 0 0 
1 0 0 96 3 1 0 0 0 
1 0 0 96 3 1 0 0 0 
1 0 0 96 3 1 0 0 0 
1 0 0 96 3 1 0 0 0 
11 0 0 86 3 1 0 0 0 
11 0 0 86 3 1 0 0 0 
11 0 0 86 3 1 0 0 0 
11 0 0 86 3 1 0 0 0 
11 0 0 86 3 1 0 0 0 
11 0 0 86 3 1 0 0 0 
11 0 0 86 3 1 0 0 0 
11 0 0 86 3 1 0 0 0 
4 0 0 93 3 1 0 0 0 
4 0 0 93 3 1 0 0 0 
4 0 0 93 3 1 0 0 0 
4 0 0 93 3 1 0 0 0 
4 0 0 93 3 1 0 0 0 
4 0 0 93 3 1 0 0 0 
4 0 0 93 3 1 0 0 0 
4 0 0 93 3 1 0 0 0 
4 0 0 93 3 1 0 0 0 
5 0 0 92 3 1 0 0 0 
5 0 0 92 3 1 0 0 0 
5 0 0 92 3 1 0 0 0 
5 0 0 92 3 1 0 0 0 
5 0 0 92 3 1 0 0 0 
5 0 0 92 3 1 0 0 0 
5 0 0 92 3 1 0 0 0 
5 0 0 92 3 1 0 0 0 
5 0 0 92 3 1 0 0 0 
5 0 0 92 3 1 0 0 0 
5 0 0 92 3 1 0 0 0 
5 0 0 92 3 1 0 0 0 
5 0 0 92 3 1 0 0 0 
5 0 0 92 3 1 0 0 0 
5 0 0 92 3 1 0 0 0 
1 0 0 96 3 1 0 0 0 
1 0 0 96 3 1 0 0 0 
1 0 0 96 3 1 0 0 0 
1 0 0 96 3 1 0 0 0 
1 0 0 96 3 1 0 0 0 
1 0 0 96 3 1 0 0 0 
1 0 0 96 3 1 0 0 0 
5 0 0 92 3 1 0 0 0 
5 0 0 92 3 1 0 0 0 
5 0 0 92 3 1 0 0 0 
5 0 0 92 3 1 0 0 0 
5 0 0 92 3 1 0 0 0 
5 0 0 92 3 1 0 0 0 
5 0 0 92 3 1 0 0 0 
5 0 0 92 3 1 0 0 0 
5 0 0 92 3 1 0 0 0 
5 0 0 92 3 1 0 0 0 
11 0 0 86 3 1 0 0 0 
11 0 0 86 3 1 0 0 0 
11 0 0 86 3 1 0 0 0 
11 0 0 86 3 1 0 0 0 
11 0 0 86 3 1 0 0 0 
11 0 0 86 3 1 0 0 0 
11 0 0 86 3 1 0 0 0 
1 0 0 96 3 1 0 0 0 
1 0 0 96 3 1 0 0 0 
1 0 0 96 3 1 0 0 0 
1 0 0 96 3 1 0 0 0 
1 0 0 96 3 1 0 0 0 
1 0 0 96 3 1 0 0 0 
5 0 0 92 3 1 0 0 0 
5 0 0 92 3 1 0 0 0 
5 0 0 92 3 1 0 0 0 
5 0 0 92 3 1 0 0 0 
5 0 0 92 3 1 0 0 0 
5 0 0 92 3 1 0 0 0 
10 0 0 87 3 1 0 0 0 
10 0 0 87 3 1 0 0 0 
10 0 0 87 3 1 0 0 0 
10 0 0 87 3 1 0 0 0 
10 0 0 87 3 1 0 0 0 
10 0 0 87 3 1 0 0 0 
10 0 0 87 3 1 0 0 0 
4 0 0 93 3 1 0 0 0 
4 0 0 93 3 1 0 0 0 
4 0 0 93 3 1 0 0 0 
4 0 0 93 3 1 0 0 0 
4 0 0 93 3 1 0 0 0 
4 0 0 93 3 1 0 0 0 
4 0 0 93 3 1 0 0 0 
4 0 0 93 3 1 0 0 0 
4 0 0 93 3 1 0 0 0 
4 0 0 93 3 1 0 0 0 
11 0 0 86 3 1 0 0 0 
11 0 0 86 3 1 0 0 0 
11 0 0 86 3 1 0 0 0 
11 0 0 86 3 1 0 0 0 
11 0 0 86 3 1 0 0 0 
11 0 0 86 3 1 0 0 0 
1 0 0 96 3 1 0 0 0 
1 0 0 96 3 1 0 0 0 
1 0 0 96 3 1 0 0 0 
1 0 0 96 3 1 0 0 0 
1 0 0 96 3 1 0 0 0 
5 0 0 92 3 1 0 0 0 
5 0 0 92 3 1 0 0 0 
5 0 0 92 3 1 0 0 0 
5 0 0 92 3 1 0 0 0 
5 0 0 92 3 1 0 0 0 
5 0 0 92 3 1 0 0 0 
5 0 0 92 3 1 0 0 0 
5 0 0 92 3 1 0 0 0 
5 0 0 92 3 1 0 0 0 
5 0 0 92 3 1 0 0 0 
5 0 0 92 3 1 0 0 0 
5 0 0 92 3 1 0 0 0 
10 0 0 87 3 1 0 0 0 
10 0 0 87 3 1 0 0 0 
10 0 0 87 3 1 0 0 0 
10 0 0 87 3 1 0 0 0 
10 0 0 87 3 1 0 0 0 
10 0 0 87 3 1 0 0 0 
4 0 0 93 3 1 0 0 0 
4 0 0 93 3 1 0 0 0 
4 0 0 93 3 1 0 0 0 
4 0 0 93 3 1 0 0 0 
4 0 0 93 3 1 0 0 0 
4 0 0 93 3 1 0 0 0 
4 0 0 93 3 1 0 0 0 
4 0 0 93 3 1 0 0 0 
5 0 0 92 3 1 0 0 0 
5 0 0 92 3 1 0 0 0 
5 0 0 92 3 1 0 0 0 
5 0 0 92 3 1 0 0 0 
5 0 0 92 3 1 0 0 0 
5 0 0 92 3 1 0 0 0 
1 0 0 96 3 1 0 0 0 
1 0 0 96 3 1 0 0 0 
1 0 0 96 3 1 0 0 0 
1 0 0 96 3 1 0 0 0 
1 0 0 96 3 1 0 0 0 
1 0 0 96 3 1 0 0 0 
1 0 0 96 3 1 0 0 0 
1 0 0 96 3 1 0 0 0 
1 0 0 96 3 1 0 0 0 
1 0 0 96 3 1 0 0 0 
11 0 0 86 3 1 0 0 0 
11 0 0 86 3 1 0 0 0 
11 0 0 86 3 1 0 0 0 
11 0 0 86 3 1 0 0 0 
11 0 0 86 3 1 0 0 0 
5 0 0 92 3 1 0 0 0 
5 0 0 92 3 1 0 0 0 
5 0 0 92 3 1 0 0 0 
5 0 0 92 3 1 0 0 0 
5 0 0 92 3 1 0 0 0 
5 0 0 92 3 1 0 0 0 
5 0 0 92 3 1 0 0 0 
5 0 0 92 3 1 0 0 0 
5 0 0 92 3 1 0 0 0 
5 0 0 92 3 1 0 0 0 
5 0 0 92 3 1 0 0 0 
5 0 0 92 3 1 0 0 0 
4 0 0 93 3 1 0 0 0 
4 0 0 93 3 1 0 0 0 
4 0 0 93 3 1 0 0 0 
4 0 0 93 3 1 0 0 0 
4 0 0 93 3 1 0 0 0 
4 0 0 93 3 1 0 0 0 
4 0 0 93 3 1 0 0 0 
5 0 0 92 3 1 0 0 0 
5 0 0 92 3 1 0 0 0 
5 0 0 92 3 1 0 0 0 
5 0 0 92 3 1 0 0 0 
10 0 0 87 3 1 0 0 0 
10 0 0 87 3 1 0 0 0 
10 0 0 87 3 1 0 0 0 
10 0 0 87 3 1 0 0 0 
10 0 0 87 3 1 0 0 0 
10 0 0 87 3 1 0 0 0 
10 0 0 87 3 1 0 0 0 
10 0 0 87 3 1 0 0 0 
10 0 0 87 3 1 0 0 0 
10 0 0 87 3 1 0 0 0 
11 0 0 86 3 1 0 0 0 
11 0 0 86 3 1 0 0 0 
11 0 0 86 3 1 0 0 0 
11 0 0 86 3 1 0 0 0 
5 0 0 92 3 1 0 0 0 
5 0 0 92 3 1 0 0 0 
5 0 0 92 3 1 0 0 0 
5 0 0 92 3 1 0 0 0 
5 0 0 92 3 1 0 0 0 
5 0 0 92 3 1 0 0 0 
5 0 0 92 3 1 0 0 0 
5 0 0 92 3 1 0 0 0 
5 0 0 92 3 1 0 0 0 
5 0 0 92 3 1 0 0 0 
5 0 0 92 3 1 0 0 0 
5 0 0 92 3 1 0 0 0 
5 0 0 92 3 1 0 0 0 
5 0 0 92 3 1 0 0 0 
5 0 0 92 3 1 0 0 0 
5 0 0 92 3 1 0 0 0 
5 0 0 92 3 1 0 0 0 
5 0 0 92 3 1 0 0 0 
5 0 0 92 3 1 0 0 0 
5 0 0 92 3 1 0 0 0 
11 0 0 86 3 1 0 0 0 
11 0 0 86 3 1 0 0 0 
11 0 0 86 3 1 0 0 0 
5 0 0 92 3 1 0 0 0 
5 0 0 92 3 1 0 0 0 
5 0 0 92 3 1 0 0 0 
10 0 0 87 3 1 0 0 0 
10 0 0 87 3 1 0 0 0 
10 0 0 87 3 1 0 0 0 
10 0 0 87 3 1 0 0 0 
10 0 0 87 3 1 0 0 0 
5 0 0 92 3 1 0 0 0 
5 0 0 92 3 1 0 0 0 
5 0 0 92 3 1 0 0 0 
5 0 0 92 3 1 0 0 0 
5 0 0 92 3 1 0 0 0 
1 0 0 96 3 1 0 0 0 
1 0 0 96 3 1 0 0 0 
1 0 0 96 3 1 0 0 0 
1 0 0 96 3 1 0 0 0 
10 0 0 87 3 1 0 0 0 
10 0 0 87 3 1 0 0 0 
10 0 0 87 3 1 0 0 0 
10 0 0 87 3 1 0 0 0 
4 0 0 95 1 1 0 0 0 
11 0 0 88 1 1 0 0 0 
5 0 0 94 1 1 0 0 0 
5 0 0 94 1 1 0 0 0 
5 0 0 94 1 1 0 0 0 
10 0 0 89 1 1 0 0 0 
1 0 0 98 1 1 0 0 0 
4 0 0 95 1 1 0 0 0 
11 0 0 88 1 1 0 0 0 
5 0 0 94 1 1 0 0 0 
5 0 0 94 1 1 0 0 0 
5 0 0 94 1 1 0 0 0 
10 0 0 89 1 1 0 0 0 
1 0 0 98 1 1 0 0 0 
11 0 0 88 1 1 0 0 0 
11 0 0 88 1 1 0 0 0 
11 0 0 88 1 1 0 0 0 
11 0 0 88 1 1 0 0 0 
11 0 0 88 1 1 0 0 0 
11 0 0 88 1 1 0 0 0 
11 0 0 88 1 1 0 0 0 
11 0 0 88 1 1 0 0 0 
11 0 0 88 1 1 0 0 0 
11 0 0 88 1 1 0 0 0 
10 0 0 89 1 1 0 0 0 
10 0 0 89 1 1 0 0 0 
10 0 0 89 1 1 0 0 0 
10 0 0 89 1 1 0 0 0 
10 0 0 89 1 1 0 0 0 
10 0 0 89 1 1 0 0 0 
10 0 0 89 1 1 0 0 0 
10 0 0 89 1 1 0 0 0 
10 0 0 89 1 1 0 0 0 
5 0 0 94 1 1 0 0 0 
5 0 0 94 1 1 0 0 0 
5 0 0 94 1 1 0 0 0 
5 0 0 94 1 1 0 0 0 
5 0 0 94 1 1 0 0 0 
5 0 0 94 1 1 0 0 0 
5 0 0 94 1 1 0 0 0 
5 0 0 94 1 1 0 0 0 
5 0 0 94 1 1 0 0 0 
5 0 0 94 1 1 0 0 0 
5 0 0 94 1 1 0 0 0 
5 0 0 94 1 1 0 0 0 
5 0 0 94 1 1 0 0 0 
5 0 0 94 1 1 0 0 0 
5 0 0 94 1 1 0 0 0 
5 0 0 94 1 1 0 0 0 
5 0 0 94 1 1 0 0 0 
5 0 0 94 1 1 0 0 0 
1 0 0 98 1 1 0 0 0 
1 0 0 98 1 1 0 0 0 
1 0 0 98 1 1 0 0 0 
1 0 0 98 1 1 0 0 0 
1 0 0 98 1 1 0 0 0 
1 0 0 98 1 1 0 0 0 
1 0 0 98 1 1 0 0 0 
1 0 0 98 1 1 0 0 0 
1 0 0 98 1 1 0 0 0 
5 0 0 94 1 1 0 0 0 
5 0 0 94 1 1 0 0 0 
5 0 0 94 1 1 0 0 0 
5 0 0 94 1 1 0 0 0 
5 0 0 94 1 1 0 0 0 
5 0 0 94 1 1 0 0 0 
5 0 0 94 1 1 0 0 0 
5 0 0 94 1 1 0 0 0 
5 0 0 94 1 1 0 0 0 
5 0 0 94 1 1 0 0 0 
5 0 0 94 1 1 0 0 0 
5 0 0 94 1 1 0 0 0 
5 0 0 94 1 1 0 0 0 
5 0 0 94 1 1 0 0 0 
5 0 0 94 1 1 0 0 0 
5 0 0 94 1 1 0 0 0 
5 0 0 94 1 1 0 0 0 
5 0 0 94 1 1 0 0 0 
5 0 0 94 1 1 0 0 0 
11 0 0 88 1 1 0 0 0 
11 0 0 88 1 1 0 0 0 
11 0 0 88 1 1 0 0 0 
11 0 0 88 1 1 0 0 0 
11 0 0 88 1 1 0 0 0 
11 0 0 88 1 1 0 0 0 
11 0 0 88 1 1 0 0 0 
11 0 0 88 1 1 0 0 0 
11 0 0 88 1 1 0 0 0 
5 0 0 94 1 1 0 0 0 
5 0 0 94 1 1 0 0 0 
5 0 0 94 1 1 0 0 0 
5 0 0 94 1 1 0 0 0 
5 0 0 94 1 1 0 0 0 
5 0 0 94 1 1 0 0 0 
5 0 0 94 1 1 0 0 0 
5 0 0 94 1 1 0 0 0 
10 0 0 89 1 1 0 0 0 
10 0 0 89 1 1 0 0 0 
10 0 0 89 1 1 0 0 0 
10 0 0 89 1 1 0 0 0 
10 0 0 89 1 1 0 0 0 
10 0 0 89 1 1 0 0 0 
10 0 0 89 1 1 0 0 0 
10 0 0 89 1 1 0 0 0 
5 0 0 94 1 1 0 0 0 
5 0 0 94 1 1 0 0 0 
5 0 0 94 1 1 0 0 0 
5 0 0 94 1 1 0 0 0 
5 0 0 94 1 1 0 0 0 
5 0 0 94 1 1 0 0 0 
5 0 0 94 1 1 0 0 0 
5 0 0 94 1 1 0 0 0 
1 0 0 98 1 1 0 0 0 
1 0 0 98 1 1 0 0 0 
1 0 0 98 1 1 0 0 0 
1 0 0 98 1 1 0 0 0 
1 0 0 98 1 1 0 0 0 
1 0 0 98 1 1 0 0 0 
1 0 0 98 1 1 0 0 0 
1 0 0 98 1 1 0 0 0 
11 0 0 88 1 1 0 0 0 
11 0 0 88 1 1 0 0 0 
11 0 0 88 1 1 0 0 0 
11 0 0 88 1 1 0 0 0 
11 0 0 88 1 1 0 0 0 
11 0 0 88 1 1 0 0 0 
11 0 0 88 1 1 0 0 0 
11 0 0 88 1 1 0 0 0 
4 0 0 95 1 1 0 0 0 
4 0 0 95 1 1 0 0 0 
4 0 0 95 1 1 0 0 0 
4 0 0 95 1 1 0 0 0 
4 0 0 95 1 1 0 0 0 
4 0 0 95 1 1 0 0 0 
4 0 0 95 1 1 0 0 0 
4 0 0 95 1 1 0 0 0 
4 0 0 95 1 1 0 0 0 
5 0 0 94 1 1 0 0 0 
5 0 0 94 1 1 0 0 0 
5 0 0 94 1 1 0 0 0 
5 0 0 94 1 1 0 0 0 
5 0 0 94 1 1 0 0 0 
5 0 0 94 1 1 0 0 0 
5 0 0 94 1 1 0 0 0 
5 0 0 94 1 1 0 0 0 
5 0 0 94 1 1 0 0 0 
5 0 0 94 1 1 0 0 0 
5 0 0 94 1 1 0 0 0 
5 0 0 94 1 1 0 0 0 
5 0 0 94 1 1 0 0 0 
5 0 0 94 1 1 0 0 0 
5 0 0 94 1 1 0 0 0 
1 0 0 98 1 1 0 0 0 
1 0 0 98 1 1 0 0 0 
1 0 0 98 1 1 0 0 0 
1 0 0 98 1 1 0 0 0 
1 0 0 98 1 1 0 0 0 
1 0 0 98 1 1 0 0 0 
1 0 0 98 1 1 0 0 0 
5 0 0 94 1 1 0 0 0 
5 0 0 94 1 1 0 0 0 
5 0 0 94 1 1 0 0 0 
5 0 0 94 1 1 0 0 0 
5 0 0 94 1 1 0 0 0 
5 0 0 94 1 1 0 0 0 
5 0 0 94 1 1 0 0 0 
5 0 0 94 1 1 0 0 0 
5 0 0 94 1 1 0 0 0 
5 0 0 94 1 1 0 0 0 
11 0 0 88 1 1 0 0 0 
11 0 0 88 1 1 0 0 0 
11 0 0 88 1 1 0 0 0 
11 0 0 88 1 1 0 0 0 
11 0 0 88 1 1 0 0 0 
11 0 0 88 1 1 0 0 0 
11 0 0 88 1 1 0 0 0 
1 0 0 98 1 1 0 0 0 
1 0 0 98 1 1 0 0 0 
1 0 0 98 1 1 0 0 0 
1 0 0 98 1 1 0 0 0 
1 0 0 98 1 1 0 0 0 
1 0 0 98 1 1 0 0 0 
5 0 0 94 1 1 0 0 0 
5 0 0 94 1 1 0 0 0 
5 0 0 94 1 1 0 0 0 
5 0 0 94 1 1 0 0 0 
5 0 0 94 1 1 0 0 0 
5 0 0 94 1 1 0 0 0 
10 0 0 89 1 1 0 0 0 
10 0 0 89 1 1 0 0 0 
10 0 0 89 1 1 0 0 0 
10 0 0 89 1 1 0 0 0 
10 0 0 89 1 1 0 0 0 
10 0 0 89 1 1 0 0 0 
10 0 0 89 1 1 0 0 0 
4 0 0 95 1 1 0 0 0 
4 0 0 95 1 1 0 0 0 
4 0 0 95 1 1 0 0 0 
4 0 0 95 1 1 0 0 0 
4 0 0 95 1 1 0 0 0 
4 0 0 95 1 1 0 0 0 
4 0 0 95 1 1 0 0 0 
4 0 0 95 1 1 0 0 0 
4 0 0 95 1 1 0 0 0 
4 0 0 95 1 1 0 0 0 
11 0 0 88 1 1 0 0 0 
11 0 0 88 1 1 0 0 0 
11 0 0 88 1 1 0 0 0 
11 0 0 88 1 1 0 0 0 
11 0 0 88 1 1 0 0 0 
11 0 0 88 1 1 0 0 0 
1 0 0 98 1 1 0 0 0 
1 0 0 98 1 1 0 0 0 
1 0 0 98 1 1 0 0 0 
1 0 0 98 1 1 0 0 0 
1 0 0 98 1 1 0 0 0 
5 0 0 94 1 1 0 0 0 
5 0 0 94 1 1 0 0 0 
5 0 0 94 1 1 0 0 0 
5 0 0 94 1 1 0 0 0 
5 0 0 94 1 1 0 0 0 
5 0 0 94 1 1 0 0 0 
5 0 0 94 1 1 0 0 0 
5 0 0 94 1 1 0 0 0 
5 0 0 94 1 1 0 0 0 
5 0 0 94 1 1 0 0 0 
5 0 0 94 1 1 0 0 0 
5 0 0 94 1 1 0 0 0 
10 0 0 89 1 1 0 0 0 
10 0 0 89 1 1 0 0 0 
10 0 0 89 1 1 0 0 0 
10 0 0 89 1 1 0 0 0 
10 0 0 89 1 1 0 0 0 
10 0 0 89 1 1 0 0 0 
4 0 0 95 1 1 0 0 0 
4 0 0 95 1 1 0 0 0 
4 0 0 95 1 1 0 0 0 
4 0 0 95 1 1 0 0 0 
4 0 0 95 1 1 0 0 0 
4 0 0 95 1 1 0 0 0 
4 0 0 95 1 1 0 0 0 
4 0 0 95 1 1 0 0 0 
5 0 0 94 1 1 0 0 0 
5 0 0 94 1 1 0 0 0 
5 0 0 94 1 1 0 0 0 
5 0 0 94 1 1 0 0 0 
5 0 0 94 1 1 0 0 0 
5 0 0 94 1 1 0 0 0 
1 0 0 98 1 1 0 0 0 
1 0 0 98 1 1 0 0 0 
1 0 0 98 1 1 0 0 0 
1 0 0 98 1 1 0 0 0 
1 0 0 98 1 1 0 0 0 
1 0 0 98 1 1 0 0 0 
1 0 0 98 1 1 0 0 0 
1 0 0 98 1 1 0 0 0 
1 0 0 98 1 1 0 0 0 
1 0 0 98 1 1 0 0 0 
11 0 0 88 1 1 0 0 0 
11 0 0 88 1 1 0 0 0 
11 0 0 88 1 1 0 0 0 
11 0 0 88 1 1 0 0 0 
11 0 0 88 1 1 0 0 0 
5 0 0 94 1 1 0 0 0 
5 0 0 94 1 1 0 0 0 
5 0 0 94 1 1 0 0 0 
5 0 0 94 1 1 0 0 0 
5 0 0 94 1 1 0 0 0 
5 0 0 94 1 1 0 0 0 
5 0 0 94 1 1 0 0 0 
5 0 0 94 1 1 0 0 0 
5 0 0 94 1 1 0 0 0 
5 0 0 94 1 1 0 0 0 
5 0 0 94 1 1 0 0 0 
5 0 0 94 1 1 0 0 0 
4 0 0 95 1 1 0 0 0 
4 0 0 95 1 1 0 0 0 
4 0 0 95 1 1 0 0 0 
4 0 0 95 1 1 0 0 0 
4 0 0 95 1 1 0 0 0 
4 0 0 95 1 1 0 0 0 
4 0 0 95 1 1 0 0 0 
5 0 0 94 1 1 0 0 0 
5 0 0 94 1 1 0 0 0 
5 0 0 94 1 1 0 0 0 
5 0 0 94 1 1 0 0 0 
10 0 0 89 1 1 0 0 0 
10 0 0 89 1 1 0 0 0 
10 0 0 89 1 1 0 0 0 
10 0 0 89 1 1 0 0 0 
10 0 0 89 1 1 0 0 0 
10 0 0 89 1 1 0 0 0 
10 0 0 89 1 1 0 0 0 
10 0 0 89 1 1 0 0 0 
10 0 0 89 1 1 0 0 0 
10 0 0 89 1 1 0 0 0 
11 0 0 88 1 1 0 0 0 
11 0 0 88 1 1 0 0 0 
11 0 0 88 1 1 0 0 0 
11 0 0 88 1 1 0 0 0 
5 0 0 94 1 1 0 0 0 
5 0 0 94 1 1 0 0 0 
5 0 0 94 1 1 0 0 0 
5 0 0 94 1 1 0 0 0 
5 0 0 94 1 1 0 0 0 
5 0 0 94 1 1 0 0 0 
5 0 0 94 1 1 0 0 0 
5 0 0 94 1 1 0 0 0 
5 0 0 94 1 1 0 0 0 
5 0 0 94 1 1 0 0 0 
5 0 0 94 1 1 0 0 0 
5 0 0 94 1 1 0 0 0 
5 0 0 94 1 1 0 0 0 
5 0 0 94 1 1 0 0 0 
5 0 0 94 1 1 0 0 0 
5 0 0 94 1 1 0 0 0 
5 0 0 94 1 1 0 0 0 
5 0 0 94 1 1 0 0 0 
5 0 0 94 1 1 0 0 0 
5 0 0 94 1 1 0 0 0 
11 0 0 88 1 1 0 0 0 
11 0 0 88 1 1 0 0 0 
11 0 0 88 1 1 0 0 0 
5 0 0 94 1 1 0 0 0 
5 0 0 94 1 1 0 0 0 
5 0 0 94 1 1 0 0 0 
10 0 0 89 1 1 0 0 0 
10 0 0 89 1 1 0 0 0 
10 0 0 89 1 1 0 0 0 
10 0 0 89 1 1 0 0 0 
10 0 0 89 1 1 0 0 0 
5 0 0 94 1 1 0 0 0 
5 0 0 94 1 1 0 0 0 
5 0 0 94 1 1 0 0 0 
5 0 0 94 1 1 0 0 0 
5 0 0 94 1 1 0 0 0 
1 0 0 98 1 1 0 0 0 
1 0 0 98 1 1 0 0 0 
1 0 0 98 1 1 0 0 0 
1 0 0 98 1 1 0 0 0 
10 0 0 89 1 1 0 0 0 
10 0 0 89 1 1 0 0 0 
10 0 0 89 1 1 0 0 0 
10 0 0 89 1 1 0 0 0 
4 0 0 93 3 1 0 0 0 
4 0 0 93 3 1 0 0 0 
4 0 0 93 3 1 0 0 0 
11 0 0 86 3 1 0 0 0 
11 0 0 86 3 1 0 0 0 
11 0 0 86 3 1 0 0 0 
5 0 0 92 3 1 0 0 0 
5 0 0 92 3 1 0 0 0 
5 0 0 92 3 1 0 0 0 
5 0 0 92 3 1 0 0 0 
5 0 0 92 3 1 0 0 0 
5 0 0 92 3 1 0 0 0 
5 0 0 92 3 1 0 0 0 
5 0 0 92 3 1 0 0 0 
5 0 0 92 3 1 0 0 0 
10 0 0 87 3 1 0 0 0 
10 0 0 87 3 1 0 0 0 
10 0 0 87 3 1 0 0 0 
1 0 0 96 3 1 0 0 0 
1 0 0 96 3 1 0 0 0 
1 0 0 96 3 1 0 0 0 
4 0 0 95 1 1 0 0 0 
4 0 0 95 1 1 0 0 0 
4 0 0 95 1 1 0 0 0 
11 0 0 88 1 1 0 0 0 
11 0 0 88 1 1 0 0 0 
11 0 0 88 1 1 0 0 0 
5 0 0 94 1 1 0 0 0 
5 0 0 94 1 1 0 0 0 
5 0 0 94 1 1 0 0 0 
5 0 0 94 1 1 0 0 0 
5 0 0 94 1 1 0 0 0 
5 0 0 94 1 1 0 0 0 
5 0 0 94 1 1 0 0 0 
5 0 0 94 1 1 0 0 0 
5 0 0 94 1 1 0 0 0 
10 0 0 89 1 1 0 0 0 
10 0 0 89 1 1 0 0 0 
10 0 0 89 1 1 0 0 0 
1 0 0 98 1 1 0 0 0 
1 0 0 98 1 1 0 0 0 
1 0 0 1 98 1 0 0 0 
4 0 0 93 3 1 0 0 0 
4 0 0 93 3 1 0 0 0 
11 0 0 86 3 1 0 0 0 
11 0 0 86 3 1 0 0 0 
5 0 0 92 3 1 0 0 0 
5 0 0 92 3 1 0 0 0 
5 0 0 92 3 1 0 0 0 
5 0 0 92 3 1 0 0 0 
5 0 0 92 3 1 0 0 0 
5 0 0 92 3 1 0 0 0 
10 0 0 87 3 1 0 0 0 
10 0 0 87 3 1 0 0 0 
1 0 0 96 3 1 0 0 0 
1 0 0 96 3 1 0 0 0 
4 0 0 93 3 1 0 0 0 
5 0 0 92 3 1 0 0 0 
10 0 0 87 3 1 0 0 0 
5 0 0 92 3 1 0 0 0 
5 0 0 92 3 1 0 0 0 
1 0 0 96 3 1 0 0 0 
11 0 0 86 3 1 0 0 0 
4 0 0 95 1 1 0 0 0 
4 0 0 95 1 1 0 0 0 
11 0 0 88 1 1 0 0 0 
11 0 0 88 1 1 0 0 0 
5 0 0 94 1 1 0 0 0 
5 0 0 94 1 1 0 0 0 
5 0 0 94 1 1 0 0 0 
5 0 0 94 1 1 0 0 0 
5 0 0 94 1 1 0 0 0 
5 0 0 94 1 1 0 0 0 
10 0 0 89 1 1 0 0 0 
10 0 0 89 1 1 0 0 0 
1 0 0 98 1 1 0 0 0 
1 0 0 1 98 1 0 0 0 
4 0 0 93 3 1 0 0 0 
11 0 0 86 3 1 0 0 0 
5 0 0 92 3 1 0 0 0 
5 0 0 92 3 1 0 0 0 
5 0 0 92 3 1 0 0 0 
10 0 0 87 3 1 0 0 0 
1 0 0 96 3 1 0 0 0 
1 0 0 96 3 1 0 0 0 
5 0 0 92 3 1 0 0 0 
5 0 0 92 3 1 0 0 0 
10 0 0 87 3 1 0 0 0 
4 0 0 93 3 1 0 0 0 
5 0 0 92 3 1 0 0 0 
1 0 0 96 3 1 0 0 0 
5 0 0 92 3 1 0 0 0 
4 0 0 93 3 1 0 0 0 
5 0 0 92 3 1 0 0 0 
5 0 0 92 3 1 0 0 0 
10 0 0 87 3 1 0 0 0 
11 0 0 86 3 1 0 0 0 
11 0 0 86 3 1 0 0 0 
4 0 0 95 1 1 0 0 0 
11 0 0 88 1 1 0 0 0 
5 0 0 94 1 1 0 0 0 
5 0 0 94 1 1 0 0 0 
5 0 0 94 1 1 0 0 0 
10 0 0 89 1 1 0 0 0 
1 0 0 98 1 1 0 0 0 
5 0 0 94 1 1 0 0 0 
5 0 0 94 1 1 0 0 0 
10 0 0 89 1 1 0 0 0 
4 0 0 95 1 1 0 0 0 
5 0 0 94 1 1 0 0 0 
11 0 0 88 1 1 0 0 0 
5 0 0 94 1 1 0 0 0 
4 0 0 95 1 1 0 0 0 
10 0 0 89 1 1 0 0 0 
5 0 0 94 1 1 0 0 0 
5 0 0 94 1 1 0 0 0 
11 0 0 88 1 1 0 0 0 
1 0 0 1 98 1 0 0 0 
4 0 0 93 3 1 0 0 0 
4 0 0 93 3 1 0 0 0 
4 0 0 93 3 1 0 0 0 
11 0 0 86 3 1 0 0 0 
11 0 0 86 3 1 0 0 0 
11 0 0 86 3 1 0 0 0 
5 0 0 92 3 1 0 0 0 
5 0 0 92 3 1 0 0 0 
5 0 0 92 3 1 0 0 0 
5 0 0 92 3 1 0 0 0 
5 0 0 92 3 1 0 0 0 
5 0 0 92 3 1 0 0 0 
5 0 0 92 3 1 0 0 0 
5 0 0 92 3 1 0 0 0 
5 0 0 92 3 1 0 0 0 
10 0 0 87 3 1 0 0 0 
10 0 0 87 3 1 0 0 0 
10 0 0 87 3 1 0 0 0 
1 0 0 96 3 1 0 0 0 
1 0 0 96 3 1 0 0 0 
1 0 0 96 3 1 0 0 0 
4 0 0 95 1 1 0 0 0 
4 0 0 95 1 1 0 0 0 
4 0 0 95 1 1 0 0 0 
11 0 0 88 1 1 0 0 0 
11 0 0 88 1 1 0 0 0 
11 0 0 88 1 1 0 0 0 
5 0 0 94 1 1 0 0 0 
5 0 0 94 1 1 0 0 0 
5 0 0 94 1 1 0 0 0 
5 0 0 94 1 1 0 0 0 
5 0 0 94 1 1 0 0 0 
5 0 0 94 1 1 0 0 0 
5 0 0 94 1 1 0 0 0 
5 0 0 94 1 1 0 0 0 
5 0 0 94 1 1 0 0 0 
10 0 0 89 1 1 0 0 0 
10 0 0 89 1 1 0 0 0 
10 0 0 89 1 1 0 0 0 
1 0 0 98 1 1 0 0 0 
1 0 0 98 1 1 0 0 0 
1 0 0 1 98 1 0 0 0 
4 0 0 92 4 1 0 0 0 
11 0 0 85 4 1 0 0 0 
5 0 0 91 4 1 0 0 0 
5 0 0 91 4 1 0 0 0 
5 0 0 91 4 1 0 0 0 
10 0 0 86 4 1 0 0 0 
1 0 0 95 4 1 0 0 0 
4 0 0 92 4 1 0 0 0 
4 0 0 92 4 1 0 0 0 
11 0 0 85 4 1 0 0 0 
11 0 0 85 4 1 0 0 0 
5 0 0 91 4 1 0 0 0 
5 0 0 91 4 1 0 0 0 
5 0 0 91 4 1 0 0 0 
5 0 0 91 4 1 0 0 0 
5 0 0 91 4 1 0 0 0 
5 0 0 91 4 1 0 0 0 
10 0 0 86 4 1 0 0 0 
10 0 0 86 4 1 0 0 0 
1 0 0 95 4 1 0 0 0 
5 0 0 91 4 1 0 0 0 
10 0 0 86 4 1 0 0 0 
4 0 0 92 4 1 0 0 0 
5 0 0 91 4 1 0 0 0 
5 0 0 91 4 1 0 0 0 
11 0 0 85 4 1 0 0 0 
1 0 0 1 98 1 0 0 0 
4 0 0 92 4 1 0 0 0 
11 0 0 85 4 1 0 0 0 
5 0 0 91 4 1 0 0 0 
5 0 0 91 4 1 0 0 0 
5 0 0 91 4 1 0 0 0 
10 0 0 86 4 1 0 0 0 
1 0 0 95 4 1 0 0 0 
5 0 0 91 4 1 0 0 0 
5 0 0 91 4 1 0 0 0 
10 0 0 86 4 1 0 0 0 
4 0 0 92 4 1 0 0 0 
5 0 0 91 4 1 0 0 0 
5 0 0 91 4 1 0 0 0 
10 0 0 86 4 1 0 0 0 
4 0 0 92 4 1 0 0 0 
5 0 0 91 4 1 0 0 0 
5 0 0 91 4 1 0 0 0 
1 0 0 95 4 1 0 0 0 
11 0 0 85 4 1 0 0 0 
11 0 0 85 4 1 0 0 0 
1 0 0 1 98 1 0 0 0 
4 0 0 92 4 1 0 0 0 
4 0 0 92 4 1 0 0 0 
4 0 0 92 4 1 0 0 0 
11 0 0 85 4 1 0 0 0 
11 0 0 85 4 1 0 0 0 
11 0 0 85 4 1 0 0 0 
5 0 0 91 4 1 0 0 0 
5 0 0 91 4 1 0 0 0 
5 0 0 91 4 1 0 0 0 
5 0 0 91 4 1 0 0 0 
5 0 0 91 4 1 0 0 0 
5 0 0 91 4 1 0 0 0 
5 0 0 91 4 1 0 0 0 
5 0 0 91 4 1 0 0 0 
5 0 0 91 4 1 0 0 0 
10 0 0 86 4 1 0 0 0 
10 0 0 86 4 1 0 0 0 
10 0 0 86 4 1 0 0 0 
1 0 0 95 4 1 0 0 0 
1 0 0 95 4 1 0 0 0 
1 0 0 1 98 1 0 0 0 
4 0 0 93 3 1 0 0 0 
4 0 0 95 1 1 0 0 0 
4 0 0 93 3 1 0 0 0 
4 0 0 95 1 1 0 0 0 
4 0 0 93 3 1 0 0 0 
4 0 0 95 1 1 0 0 0 
4 0 0 93 3 1 0 0 0 
4 0 0 95 1 1 0 0 0 
4 0 0 93 3 1 0 0 0 
4 0 0 95 1 1 0 0 0 
4 0 0 93 3 1 0 0 0 
4 0 0 95 1 1 0 0 0 
4 0 0 93 3 1 0 0 0 
4 0 0 95 1 1 0 0 0 
4 0 0 93 3 1 0 0 0 
4 0 0 95 1 1 0 0 0 
4 0 0 93 3 1 0 0 0 
4 0 0 95 1 1 0 0 0 
4 0 0 93 3 1 0 0 0 
4 0 0 95 1 1 0 0 0 
4 0 0 93 3 1 0 0 0 
4 0 0 95 1 1 0 0 0 
4 0 0 93 3 1 0 0 0 
4 0 0 95 1 1 0 0 0 
4 0 0 93 3 1 0 0 0 
4 0 0 95 1 1 0 0 0 
4 0 0 93 3 1 0 0 0 
4 0 0 95 1 1 0 0 0 
4 0 0 93 3 1 0 0 0 
4 0 0 95 1 1 0 0 0 
4 0 0 93 3 1 0 0 0 
4 0 0 95 1 1 0 0 0 
11 0 0 86 3 1 0 0 0 
11 0 0 88 1 1 0 0 0 
11 0 0 86 3 1 0 0 0 
11 0 0 88 1 1 0 0 0 
11 0 0 86 3 1 0 0 0 
11 0 0 88 1 1 0 0 0 
11 0 0 86 3 1 0 0 0 
11 0 0 88 1 1 0 0 0 
11 0 0 86 3 1 0 0 0 
11 0 0 88 1 1 0 0 0 
11 0 0 86 3 1 0 0 0 
11 0 0 88 1 1 0 0 0 
11 0 0 86 3 1 0 0 0 
11 0 0 88 1 1 0 0 0 
11 0 0 86 3 1 0 0 0 
11 0 0 88 1 1 0 0 0 
11 0 0 86 3 1 0 0 0 
11 0 0 88 1 1 0 0 0 
11 0 0 86 3 1 0 0 0 
11 0 0 88 1 1 0 0 0 
11 0 0 86 3 1 0 0 0 
11 0 0 88 1 1 0 0 0 
11 0 0 86 3 1 0 0 0 
11 0 0 88 1 1 0 0 0 
11 0 0 86 3 1 0 0 0 
11 0 0 88 1 1 0 0 0 
11 0 0 86 3 1 0 0 0 
11 0 0 88 1 1 0 0 0 
11 0 0 86 3 1 0 0 0 
11 0 0 88 1 1 0 0 0 
11 0 0 86 3 1 0 0 0 
11 0 0 88 1 1 0 0 0 
4 0 0 93 3 1 0 0 0 
4 0 0 95 1 1 0 0 0 
5 0 0 92 3 1 0 0 0 
5 0 0 94 1 1 0 0 0 
5 0 0 92 3 1 0 0 0 
5 0 0 94 1 1 0 0 0 
5 0 0 92 3 1 0 0 0 
5 0 0 94 1 1 0 0 0 
5 0 0 92 3 1 0 0 0 
5 0 0 94 1 1 0 0 0 
4 0 0 93 3 1 0 0 0 
4 0 0 95 1 1 0 0 0 
5 0 0 92 3 1 0 0 0 
5 0 0 94 1 1 0 0 0 
5 0 0 92 3 1 0 0 0 
5 0 0 94 1 1 0 0 0 
5 0 0 92 3 1 0 0 0 
5 0 0 94 1 1 0 0 0 
5 0 0 92 3 1 0 0 0 
5 0 0 94 1 1 0 0 0 
4 0 0 93 3 1 0 0 0 
4 0 0 95 1 1 0 0 0 
5 0 0 92 3 1 0 0 0 
5 0 0 94 1 1 0 0 0 
5 0 0 92 3 1 0 0 0 
5 0 0 94 1 1 0 0 0 
5 0 0 92 3 1 0 0 0 
5 0 0 94 1 1 0 0 0 
5 0 0 92 3 1 0 0 0 
5 0 0 94 1 1 0 0 0 
4 0 0 93 3 1 0 0 0 
4 0 0 95 1 1 0 0 0 
5 0 0 92 3 1 0 0 0 
5 0 0 94 1 1 0 0 0 
5 0 0 92 3 1 0 0 0 
5 0 0 94 1 1 0 0 0 
5 0 0 92 3 1 0 0 0 
5 0 0 94 1 1 0 0 0 
5 0 0 92 3 1 0 0 0 
5 0 0 94 1 1 0 0 0 
4 0 0 93 3 1 0 0 0 
4 0 0 95 1 1 0 0 0 
5 0 0 92 3 1 0 0 0 
5 0 0 94 1 1 0 0 0 
5 0 0 92 3 1 0 0 0 
5 0 0 94 1 1 0 0 0 
5 0 0 92 3 1 0 0 0 
5 0 0 94 1 1 0 0 0 
5 0 0 92 3 1 0 0 0 
5 0 0 94 1 1 0 0 0 
4 0 0 93 3 1 0 0 0 
4 0 0 95 1 1 0 0 0 
5 0 0 92 3 1 0 0 0 
5 0 0 94 1 1 0 0 0 
5 0 0 92 3 1 0 0 0 
5 0 0 94 1 1 0 0 0 
5 0 0 92 3 1 0 0 0 
5 0 0 94 1 1 0 0 0 
5 0 0 92 3 1 0 0 0 
5 0 0 94 1 1 0 0 0 
4 0 0 93 3 1 0 0 0 
4 0 0 95 1 1 0 0 0 
5 0 0 92 3 1 0 0 0 
5 0 0 94 1 1 0 0 0 
5 0 0 92 3 1 0 0 0 
5 0 0 94 1 1 0 0 0 
5 0 0 92 3 1 0 0 0 
5 0 0 94 1 1 0 0 0 
5 0 0 92 3 1 0 0 0 
5 0 0 94 1 1 0 0 0 
4 0 0 93 3 1 0 0 0 
4 0 0 95 1 1 0 0 0 
5 0 0 92 3 1 0 0 0 
5 0 0 94 1 1 0 0 0 
5 0 0 92 3 1 0 0 0 
5 0 0 94 1 1 0 0 0 
5 0 0 92 3 1 0 0 0 
5 0 0 94 1 1 0 0 0 
5 0 0 92 3 1 0 0 0 
5 0 0 94 1 1 0 0 0 
4 0 0 93 3 1 0 0 0 
4 0 0 95 1 1 0 0 0 
5 0 0 92 3 1 0 0 0 
5 0 0 94 1 1 0 0 0 
5 0 0 92 3 1 0 0 0 
5 0 0 94 1 1 0 0 0 
5 0 0 92 3 1 0 0 0 
5 0 0 94 1 1 0 0 0 
5 0 0 92 3 1 0 0 0 
5 0 0 94 1 1 0 0 0 
4 0 0 93 3 1 0 0 0 
4 0 0 95 1 1 0 0 0 
5 0 0 92 3 1 0 0 0 
5 0 0 94 1 1 0 0 0 
5 0 0 92 3 1 0 0 0 
5 0 0 94 1 1 0 0 0 
5 0 0 92 3 1 0 0 0 
5 0 0 94 1 1 0 0 0 
5 0 0 92 3 1 0 0 0 
5 0 0 94 1 1 0 0 0 
4 0 0 93 3 1 0 0 0 
4 0 0 95 1 1 0 0 0 
5 0 0 92 3 1 0 0 0 
5 0 0 94 1 1 0 0 0 
5 0 0 92 3 1 0 0 0 
5 0 0 94 1 1 0 0 0 
5 0 0 92 3 1 0 0 0 
5 0 0 94 1 1 0 0 0 
5 0 0 92 3 1 0 0 0 
5 0 0 94 1 1 0 0 0 
4 0 0 93 3 1 0 0 0 
4 0 0 95 1 1 0 0 0 
5 0 0 92 3 1 0 0 0 
5 0 0 94 1 1 0 0 0 
5 0 0 92 3 1 0 0 0 
5 0 0 94 1 1 0 0 0 
5 0 0 92 3 1 0 0 0 
5 0 0 94 1 1 0 0 0 
5 0 0 92 3 1 0 0 0 
5 0 0 94 1 1 0 0 0 
8 0 0 89 3 1 0 0 0 
8 0 0 91 1 1 0 0 0 
10 0 0 87 3 1 0 0 0 
10 0 0 89 1 1 0 0 0 
10 0 0 87 3 1 0 0 0 
10 0 0 89 1 1 0 0 0 
10 0 0 87 3 1 0 0 0 
10 0 0 89 1 1 0 0 0 
10 0 0 87 3 1 0 0 0 
10 0 0 89 1 1 0 0 0 
8 0 0 89 3 1 0 0 0 
8 0 0 91 1 1 0 0 0 
10 0 0 87 3 1 0 0 0 
10 0 0 89 1 1 0 0 0 
10 0 0 87 3 1 0 0 0 
10 0 0 89 1 1 0 0 0 
10 0 0 87 3 1 0 0 0 
10 0 0 89 1 1 0 0 0 
10 0 0 87 3 1 0 0 0 
10 0 0 89 1 1 0 0 0 
8 0 0 89 3 1 0 0 0 
8 0 0 91 1 1 0 0 0 
10 0 0 87 3 1 0 0 0 
10 0 0 89 1 1 0 0 0 
10 0 0 87 3 1 0 0 0 
10 0 0 89 1 1 0 0 0 
10 0 0 87 3 1 0 0 0 
10 0 0 89 1 1 0 0 0 
10 0 0 87 3 1 0 0 0 
10 0 0 89 1 1 0 0 0 
8 0 0 89 3 1 0 0 0 
8 0 0 91 1 1 0 0 0 
10 0 0 87 3 1 0 0 0 
10 0 0 89 1 1 0 0 0 
10 0 0 87 3 1 0 0 0 
10 0 0 89 1 1 0 0 0 
10 0 0 87 3 1 0 0 0 
10 0 0 89 1 1 0 0 0 
10 0 0 87 3 1 0 0 0 
10 0 0 89 1 1 0 0 0 
1 0 0 96 3 1 0 0 0 
1 0 0 1 98 1 0 0 0 
1 0 0 96 3 1 0 0 0 
1 0 0 1 98 1 0 0 0 
1 0 0 96 3 1 0 0 0 
1 0 0 1 98 1 0 0 0 
1 0 0 96 3 1 0 0 0 
1 0 0 1 98 1 0 0 0 
1 0 0 96 3 1 0 0 0 
1 0 0 1 98 1 0 0 0 
1 0 0 96 3 1 0 0 0 
1 0 0 1 98 1 0 0 0 
1 0 0 96 3 1 0 0 0 
1 0 0 1 98 1 0 0 0 
1 0 0 96 3 1 0 0 0 
1 0 0 1 98 1 0 0 0 
1 0 0 96 3 1 0 0 0 
1 0 0 1 98 1 0 0 0 
1 0 0 96 3 1 0 0 0 
1 0 0 1 98 1 0 0 0 
1 0 0 96 3 1 0 0 0 
1 0 0 1 98 1 0 0 0 
1 0 0 96 3 1 0 0 0 
1 0 0 1 98 1 0 0 0 
1 0 0 96 3 1 0 0 0 
1 0 0 1 98 1 0 0 0 
1 0 0 96 3 1 0 0 0 
1 0 0 1 98 1 0 0 0 
1 0 0 96 3 1 0 0 0 
1 0 0 1 98 1 0 0 0 
1 0 0 96 3 1 0 0 0 
1 0 0 1 98 1 0 0 0 
4 0 0 92 3 1 0 0 1 
4 0 0 94 1 1 0 0 1 
11 0 0 85 3 1 0 0 1 
11 0 0 87 1 1 0 0 1 
5 0 0 91 3 1 0 0 1 
5 0 0 93 1 1 0 0 1 
5 0 0 91 3 1 0 0 1 
5 0 0 93 1 1 0 0 1 
5 0 0 91 3 1 0 0 1 
5 0 0 93 1 1 0 0 1 
10 0 0 86 3 1 0 0 1 
10 0 0 88 1 1 0 0 1 
1 0 0 95 3 1 0 0 1 
1 0 0 97 1 1 0 0 1 
4 0 0 92 3 1 0 0 1 
4 0 0 94 1 1 0 0 1 
11 0 0 85 3 1 0 0 1 
11 0 0 87 1 1 0 0 1 
5 0 0 91 3 1 0 0 1 
5 0 0 93 1 1 0 0 1 
5 0 0 91 3 1 0 0 1 
5 0 0 93 1 1 0 0 1 
5 0 0 91 3 1 0 0 1 
5 0 0 93 1 1 0 0 1 
10 0 0 86 3 1 0 0 1 
10 0 0 88 1 1 0 0 1 
1 0 0 95 3 1 0 0 1 
1 0 0 97 1 1 0 0 1 
4 0 0 92 3 1 0 0 1 
4 0 0 94 1 1 0 0 1 
11 0 0 85 3 1 0 0 1 
11 0 0 87 1 1 0 0 1 
5 0 0 91 3 1 0 0 1 
5 0 0 93 1 1 0 0 1 
5 0 0 91 3 1 0 0 1 
5 0 0 93 1 1 0 0 1 
5 0 0 91 3 1 0 0 1 
5 0 0 93 1 1 0 0 1 
10 0 0 86 3 1 0 0 1 
10 0 0 88 1 1 0 0 1 
1 0 0 95 3 1 0 0 1 
1 0 0 97 1 1 0 0 1 
4 0 0 92 3 1 0 0 1 
4 0 0 94 1 1 0 0 1 
11 0 0 85 3 1 0 0 1 
11 0 0 87 1 1 0 0 1 
5 0 0 91 3 1 0 0 1 
5 0 0 93 1 1 0 0 1 
5 0 0 91 3 1 0 0 1 
5 0 0 93 1 1 0 0 1 
5 0 0 91 3 1 0 0 1 
5 0 0 93 1 1 0 0 1 
10 0 0 86 3 1 0 0 1 
10 0 0 88 1 1 0 0 1 
1 0 0 95 3 1 0 0 1 
1 0 0 97 1 1 0 0 1 
4 0 0 92 3 1 0 0 1 
4 0 0 94 1 1 0 0 1 
11 0 0 85 3 1 0 0 1 
11 0 0 87 1 1 0 0 1 
5 0 0 91 3 1 0 0 1 
5 0 0 93 1 1 0 0 1 
5 0 0 91 3 1 0 0 1 
5 0 0 93 1 1 0 0 1 
5 0 0 91 3 1 0 0 1 
5 0 0 93 1 1 0 0 1 
10 0 0 86 3 1 0 0 1 
10 0 0 88 1 1 0 0 1 
1 0 0 95 3 1 0 0 1 
1 0 0 97 1 1 0 0 1 
4 0 0 92 3 1 0 0 1 
4 0 0 94 1 1 0 0 1 
11 0 0 85 3 1 0 0 1 
11 0 0 87 1 1 0 0 1 
5 0 0 91 3 1 0 0 1 
5 0 0 93 1 1 0 0 1 
5 0 0 91 3 1 0 0 1 
5 0 0 93 1 1 0 0 1 
5 0 0 91 3 1 0 0 1 
5 0 0 93 1 1 0 0 1 
10 0 0 86 3 1 0 0 1 
10 0 0 88 1 1 0 0 1 
1 0 0 95 3 1 0 0 1 
1 0 0 97 1 1 0 0 1 
4 0 0 93 3 1 0 0 0 
4 0 0 95 1 1 0 0 0 
4 0 0 93 3 1 0 0 0 
4 0 0 95 1 1 0 0 0 
4 0 0 93 3 1 0 0 0 
4 0 0 95 1 1 0 0 0 
4 0 0 93 3 1 0 0 0 
4 0 0 95 1 1 0 0 0 
4 0 0 93 3 1 0 0 0 
4 0 0 95 1 1 0 0 0 
4 0 0 93 3 1 0 0 0 
4 0 0 95 1 1 0 0 0 
4 0 0 93 3 1 0 0 0 
4 0 0 95 1 1 0 0 0 
4 0 0 93 3 1 0 0 0 
4 0 0 95 1 1 0 0 0 
4 0 0 93 3 1 0 0 0 
4 0 0 95 1 1 0 0 0 
4 0 0 93 3 1 0 0 0 
4 0 0 95 1 1 0 0 0 
4 0 0 93 3 1 0 0 0 
4 0 0 95 1 1 0 0 0 
4 0 0 93 3 1 0 0 0 
4 0 0 95 1 1 0 0 0 
4 0 0 93 3 1 0 0 0 
4 0 0 95 1 1 0 0 0 
4 0 0 93 3 1 0 0 0 
4 0 0 95 1 1 0 0 0 
4 0 0 93 3 1 0 0 0 
4 0 0 95 1 1 0 0 0 
4 0 0 93 3 1 0 0 0 
4 0 0 95 1 1 0 0 0 
4 0 0 93 3 1 0 0 0 
4 0 0 95 1 1 0 0 0 
4 0 0 93 3 1 0 0 0 
4 0 0 95 1 1 0 0 0 
4 0 0 93 3 1 0 0 0 
4 0 0 95 1 1 0 0 0 
4 0 0 93 3 1 0 0 0 
4 0 0 95 1 1 0 0 0 
4 0 0 93 3 1 0 0 0 
4 0 0 95 1 1 0 0 0 
4 0 0 93 3 1 0 0 0 
4 0 0 95 1 1 0 0 0 
4 0 0 93 3 1 0 0 0 
4 0 0 95 1 1 0 0 0 
4 0 0 93 3 1 0 0 0 
4 0 0 95 1 1 0 0 0 
11 0 0 86 3 1 0 0 0 
11 0 0 88 1 1 0 0 0 
11 0 0 86 3 1 0 0 0 
11 0 0 88 1 1 0 0 0 
11 0 0 86 3 1 0 0 0 
11 0 0 88 1 1 0 0 0 
11 0 0 86 3 1 0 0 0 
11 0 0 88 1 1 0 0 0 
11 0 0 86 3 1 0 0 0 
11 0 0 88 1 1 0 0 0 
11 0 0 86 3 1 0 0 0 
11 0 0 88 1 1 0 0 0 
11 0 0 86 3 1 0 0 0 
11 0 0 88 1 1 0 0 0 
11 0 0 86 3 1 0 0 0 
11 0 0 88 1 1 0 0 0 
11 0 0 86 3 1 0 0 0 
11 0 0 88 1 1 0 0 0 
11 0 0 86 3 1 0 0 0 
11 0 0 88 1 1 0 0 0 
11 0 0 86 3 1 0 0 0 
11 0 0 88 1 1 0 0 0 
11 0 0 86 3 1 0 0 0 
11 0 0 88 1 1 0 0 0 
11 0 0 86 3 1 0 0 0 
11 0 0 88 1 1 0 0 0 
11 0 0 86 3 1 0 0 0 
11 0 0 88 1 1 0 0 0 
11 0 0 86 3 1 0 0 0 
11 0 0 88 1 1 0 0 0 
11 0 0 86 3 1 0 0 0 
11 0 0 88 1 1 0 0 0 
11 0 0 86 3 1 0 0 0 
11 0 0 88 1 1 0 0 0 
11 0 0 86 3 1 0 0 0 
11 0 0 88 1 1 0 0 0 
11 0 0 86 3 1 0 0 0 
11 0 0 88 1 1 0 0 0 
11 0 0 86 3 1 0 0 0 
11 0 0 88 1 1 0 0 0 
11 0 0 86 3 1 0 0 0 
11 0 0 88 1 1 0 0 0 
11 0 0 86 3 1 0 0 0 
11 0 0 88 1 1 0 0 0 
11 0 0 86 3 1 0 0 0 
11 0 0 88 1 1 0 0 0 
11 0 0 86 3 1 0 0 0 
11 0 0 88 1 1 0 0 0 
4 0 0 93 3 1 0 0 0 
4 0 0 95 1 1 0 0 0 
4 0 0 93 3 1 0 0 0 
4 0 0 95 1 1 0 0 0 
4 0 0 93 3 1 0 0 0 
4 0 0 95 1 1 0 0 0 
4 0 0 93 3 1 0 0 0 
4 0 0 95 1 1 0 0 0 
5 0 0 92 3 1 0 0 0 
5 0 0 94 1 1 0 0 0 
5 0 0 92 3 1 0 0 0 
5 0 0 94 1 1 0 0 0 
5 0 0 92 3 1 0 0 0 
5 0 0 94 1 1 0 0 0 
5 0 0 92 3 1 0 0 0 
5 0 0 94 1 1 0 0 0 
5 0 0 92 3 1 0 0 0 
5 0 0 94 1 1 0 0 0 
5 0 0 92 3 1 0 0 0 
5 0 0 94 1 1 0 0 0 
4 0 0 93 3 1 0 0 0 
4 0 0 95 1 1 0 0 0 
4 0 0 93 3 1 0 0 0 
4 0 0 95 1 1 0 0 0 
4 0 0 93 3 1 0 0 0 
4 0 0 95 1 1 0 0 0 
4 0 0 93 3 1 0 0 0 
4 0 0 95 1 1 0 0 0 
5 0 0 92 3 1 0 0 0 
5 0 0 94 1 1 0 0 0 
5 0 0 92 3 1 0 0 0 
5 0 0 94 1 1 0 0 0 
5 0 0 92 3 1 0 0 0 
5 0 0 94 1 1 0 0 0 
5 0 0 92 3 1 0 0 0 
5 0 0 94 1 1 0 0 0 
5 0 0 92 3 1 0 0 0 
5 0 0 94 1 1 0 0 0 
5 0 0 92 3 1 0 0 0 
5 0 0 94 1 1 0 0 0 
4 0 0 93 3 1 0 0 0 
4 0 0 95 1 1 0 0 0 
4 0 0 93 3 1 0 0 0 
4 0 0 95 1 1 0 0 0 
4 0 0 93 3 1 0 0 0 
4 0 0 95 1 1 0 0 0 
4 0 0 93 3 1 0 0 0 
4 0 0 95 1 1 0 0 0 
5 0 0 92 3 1 0 0 0 
5 0 0 94 1 1 0 0 0 
5 0 0 92 3 1 0 0 0 
5 0 0 94 1 1 0 0 0 
5 0 0 92 3 1 0 0 0 
5 0 0 94 1 1 0 0 0 
5 0 0 92 3 1 0 0 0 
5 0 0 94 1 1 0 0 0 
5 0 0 92 3 1 0 0 0 
5 0 0 94 1 1 0 0 0 
5 0 0 92 3 1 0 0 0 
5 0 0 94 1 1 0 0 0 
4 0 0 93 3 1 0 0 0 
4 0 0 95 1 1 0 0 0 
4 0 0 93 3 1 0 0 0 
4 0 0 95 1 1 0 0 0 
4 0 0 93 3 1 0 0 0 
4 0 0 95 1 1 0 0 0 
4 0 0 93 3 1 0 0 0 
4 0 0 95 1 1 0 0 0 
5 0 0 92 3 1 0 0 0 
5 0 0 94 1 1 0 0 0 
5 0 0 92 3 1 0 0 0 
5 0 0 94 1 1 0 0 0 
5 0 0 92 3 1 0 0 0 
5 0 0 94 1 1 0 0 0 
5 0 0 92 3 1 0 0 0 
5 0 0 94 1 1 0 0 0 
5 0 0 92 3 1 0 0 0 
5 0 0 94 1 1 0 0 0 
5 0 0 92 3 1 0 0 0 
5 0 0 94 1 1 0 0 0 
4 0 0 93 3 1 0 0 0 
4 0 0 95 1 1 0 0 0 
4 0 0 93 3 1 0 0 0 
4 0 0 95 1 1 0 0 0 
4 0 0 93 3 1 0 0 0 
4 0 0 95 1 1 0 0 0 
4 0 0 93 3 1 0 0 0 
4 0 0 95 1 1 0 0 0 
5 0 0 92 3 1 0 0 0 
5 0 0 94 1 1 0 0 0 
5 0 0 92 3 1 0 0 0 
5 0 0 94 1 1 0 0 0 
5 0 0 92 3 1 0 0 0 
5 0 0 94 1 1 0 0 0 
5 0 0 92 3 1 0 0 0 
5 0 0 94 1 1 0 0 0 
5 0 0 92 3 1 0 0 0 
5 0 0 94 1 1 0 0 0 
5 0 0 92 3 1 0 0 0 
5 0 0 94 1 1 0 0 0 
4 0 0 93 3 1 0 0 0 
4 0 0 95 1 1 0 0 0 
4 0 0 93 3 1 0 0 0 
4 0 0 95 1 1 0 0 0 
4 0 0 93 3 1 0 0 0 
4 0 0 95 1 1 0 0 0 
4 0 0 93 3 1 0 0 0 
4 0 0 95 1 1 0 0 0 
5 0 0 92 3 1 0 0 0 
5 0 0 94 1 1 0 0 0 
5 0 0 92 3 1 0 0 0 
5 0 0 94 1 1 0 0 0 
5 0 0 92 3 1 0 0 0 
5 0 0 94 1 1 0 0 0 
5 0 0 92 3 1 0 0 0 
5 0 0 94 1 1 0 0 0 
5 0 0 92 3 1 0 0 0 
5 0 0 94 1 1 0 0 0 
5 0 0 92 3 1 0 0 0 
5 0 0 94 1 1 0 0 0 
4 0 0 93 3 1 0 0 0 
4 0 0 95 1 1 0 0 0 
4 0 0 93 3 1 0 0 0 
4 0 0 95 1 1 0 0 0 
4 0 0 93 3 1 0 0 0 
4 0 0 95 1 1 0 0 0 
4 0 0 93 3 1 0 0 0 
4 0 0 95 1 1 0 0 0 
5 0 0 92 3 1 0 0 0 
5 0 0 94 1 1 0 0 0 
5 0 0 92 3 1 0 0 0 
5 0 0 94 1 1 0 0 0 
5 0 0 92 3 1 0 0 0 
5 0 0 94 1 1 0 0 0 
5 0 0 92 3 1 0 0 0 
5 0 0 94 1 1 0 0 0 
5 0 0 92 3 1 0 0 0 
5 0 0 94 1 1 0 0 0 
5 0 0 92 3 1 0 0 0 
5 0 0 94 1 1 0 0 0 
4 0 0 93 3 1 0 0 0 
4 0 0 95 1 1 0 0 0 
4 0 0 93 3 1 0 0 0 
4 0 0 95 1 1 0 0 0 
4 0 0 93 3 1 0 0 0 
4 0 0 95 1 1 0 0 0 
4 0 0 93 3 1 0 0 0 
4 0 0 95 1 1 0 0 0 
5 0 0 92 3 1 0 0 0 
5 0 0 94 1 1 0 0 0 
5 0 0 92 3 1 0 0 0 
5 0 0 94 1 1 0 0 0 
5 0 0 92 3 1 0 0 0 
5 0 0 94 1 1 0 0 0 
5 0 0 92 3 1 0 0 0 
5 0 0 94 1 1 0 0 0 
5 0 0 92 3 1 0 0 0 
5 0 0 94 1 1 0 0 0 
5 0 0 92 3 1 0 0 0 
5 0 0 94 1 1 0 0 0 
4 0 0 93 3 1 0 0 0 
4 0 0 95 1 1 0 0 0 
4 0 0 93 3 1 0 0 0 
4 0 0 95 1 1 0 0 0 
4 0 0 93 3 1 0 0 0 
4 0 0 95 1 1 0 0 0 
4 0 0 93 3 1 0 0 0 
4 0 0 95 1 1 0 0 0 
5 0 0 92 3 1 0 0 0 
5 0 0 94 1 1 0 0 0 
5 0 0 92 3 1 0 0 0 
5 0 0 94 1 1 0 0 0 
5 0 0 92 3 1 0 0 0 
5 0 0 94 1 1 0 0 0 
5 0 0 92 3 1 0 0 0 
5 0 0 94 1 1 0 0 0 
5 0 0 92 3 1 0 0 0 
5 0 0 94 1 1 0 0 0 
5 0 0 92 3 1 0 0 0 
5 0 0 94 1 1 0 0 0 
4 0 0 93 3 1 0 0 0 
4 0 0 95 1 1 0 0 0 
4 0 0 93 3 1 0 0 0 
4 0 0 95 1 1 0 0 0 
4 0 0 93 3 1 0 0 0 
4 0 0 95 1 1 0 0 0 
4 0 0 93 3 1 0 0 0 
4 0 0 95 1 1 0 0 0 
5 0 0 92 3 1 0 0 0 
5 0 0 94 1 1 0 0 0 
5 0 0 92 3 1 0 0 0 
5 0 0 94 1 1 0 0 0 
5 0 0 92 3 1 0 0 0 
5 0 0 94 1 1 0 0 0 
5 0 0 92 3 1 0 0 0 
5 0 0 94 1 1 0 0 0 
5 0 0 92 3 1 0 0 0 
5 0 0 94 1 1 0 0 0 
5 0 0 92 3 1 0 0 0 
5 0 0 94 1 1 0 0 0 
4 0 0 93 3 1 0 0 0 
4 0 0 95 1 1 0 0 0 
4 0 0 93 3 1 0 0 0 
4 0 0 95 1 1 0 0 0 
4 0 0 93 3 1 0 0 0 
4 0 0 95 1 1 0 0 0 
4 0 0 93 3 1 0 0 0 
4 0 0 95 1 1 0 0 0 
5 0 0 92 3 1 0 0 0 
5 0 0 94 1 1 0 0 0 
5 0 0 92 3 1 0 0 0 
5 0 0 94 1 1 0 0 0 
5 0 0 92 3 1 0 0 0 
5 0 0 94 1 1 0 0 0 
5 0 0 92 3 1 0 0 0 
5 0 0 94 1 1 0 0 0 
5 0 0 92 3 1 0 0 0 
5 0 0 94 1 1 0 0 0 
5 0 0 92 3 1 0 0 0 
5 0 0 94 1 1 0 0 0 
4 0 0 93 3 1 0 0 0 
4 0 0 95 1 1 0 0 0 
4 0 0 93 3 1 0 0 0 
4 0 0 95 1 1 0 0 0 
4 0 0 93 3 1 0 0 0 
4 0 0 95 1 1 0 0 0 
4 0 0 93 3 1 0 0 0 
4 0 0 95 1 1 0 0 0 
5 0 0 92 3 1 0 0 0 
5 0 0 94 1 1 0 0 0 
5 0 0 92 3 1 0 0 0 
5 0 0 94 1 1 0 0 0 
5 0 0 92 3 1 0 0 0 
5 0 0 94 1 1 0 0 0 
5 0 0 92 3 1 0 0 0 
5 0 0 94 1 1 0 0 0 
5 0 0 92 3 1 0 0 0 
5 0 0 94 1 1 0 0 0 
5 0 0 92 3 1 0 0 0 
5 0 0 94 1 1 0 0 0 
8 0 0 89 3 1 0 0 0 
8 0 0 91 1 1 0 0 0 
8 0 0 89 3 1 0 0 0 
8 0 0 91 1 1 0 0 0 
8 0 0 89 3 1 0 0 0 
8 0 0 91 1 1 0 0 0 
8 0 0 89 3 1 0 0 0 
8 0 0 91 1 1 0 0 0 
10 0 0 87 3 1 0 0 0 
10 0 0 89 1 1 0 0 0 
10 0 0 87 3 1 0 0 0 
10 0 0 89 1 1 0 0 0 
10 0 0 87 3 1 0 0 0 
10 0 0 89 1 1 0 0 0 
10 0 0 87 3 1 0 0 0 
10 0 0 89 1 1 0 0 0 
10 0 0 87 3 1 0 0 0 
10 0 0 89 1 1 0 0 0 
10 0 0 87 3 1 0 0 0 
10 0 0 89 1 1 0 0 0 
8 0 0 89 3 1 0 0 0 
8 0 0 91 1 1 0 0 0 
8 0 0 89 3 1 0 0 0 
8 0 0 91 1 1 0 0 0 
8 0 0 89 3 1 0 0 0 
8 0 0 91 1 1 0 0 0 
8 0 0 89 3 1 0 0 0 
8 0 0 91 1 1 0 0 0 
10 0 0 87 3 1 0 0 0 
10 0 0 89 1 1 0 0 0 
10 0 0 87 3 1 0 0 0 
10 0 0 89 1 1 0 0 0 
10 0 0 87 3 1 0 0 0 
10 0 0 89 1 1 0 0 0 
10 0 0 87 3 1 0 0 0 
10 0 0 89 1 1 0 0 0 
10 0 0 87 3 1 0 0 0 
10 0 0 89 1 1 0 0 0 
10 0 0 87 3 1 0 0 0 
10 0 0 89 1 1 0 0 0 
8 0 0 89 3 1 0 0 0 
8 0 0 91 1 1 0 0 0 
8 0 0 89 3 1 0 0 0 
8 0 0 91 1 1 0 0 0 
8 0 0 89 3 1 0 0 0 
8 0 0 91 1 1 0 0 0 
8 0 0 89 3 1 0 0 0 
8 0 0 91 1 1 0 0 0 
10 0 0 87 3 1 0 0 0 
10 0 0 89 1 1 0 0 0 
10 0 0 87 3 1 0 0 0 
10 0 0 89 1 1 0 0 0 
10 0 0 87 3 1 0 0 0 
10 0 0 89 1 1 0 0 0 
10 0 0 87 3 1 0 0 0 
10 0 0 89 1 1 0 0 0 
10 0 0 87 3 1 0 0 0 
10 0 0 89 1 1 0 0 0 
10 0 0 87 3 1 0 0 0 
10 0 0 89 1 1 0 0 0 
8 0 0 89 3 1 0 0 0 
8 0 0 91 1 1 0 0 0 
8 0 0 89 3 1 0 0 0 
8 0 0 91 1 1 0 0 0 
8 0 0 89 3 1 0 0 0 
8 0 0 91 1 1 0 0 0 
8 0 0 89 3 1 0 0 0 
8 0 0 91 1 1 0 0 0 
10 0 0 87 3 1 0 0 0 
10 0 0 89 1 1 0 0 0 
10 0 0 87 3 1 0 0 0 
10 0 0 89 1 1 0 0 0 
10 0 0 87 3 1 0 0 0 
10 0 0 89 1 1 0 0 0 
10 0 0 87 3 1 0 0 0 
10 0 0 89 1 1 0 0 0 
10 0 0 87 3 1 0 0 0 
10 0 0 89 1 1 0 0 0 
10 0 0 87 3 1 0 0 0 
10 0 0 89 1 1 0 0 0 
1 0 0 96 3 1 0 0 0 
1 0 0 1 98 1 0 0 0 
1 0 0 96 3 1 0 0 0 
1 0 0 1 98 1 0 0 0 
1 0 0 96 3 1 0 0 0 
1 0 0 1 98 1 0 0 0 
1 0 0 96 3 1 0 0 0 
1 0 0 1 98 1 0 0 0 
1 0 0 96 3 1 0 0 0 
1 0 0 1 98 1 0 0 0 
1 0 0 96 3 1 0 0 0 
1 0 0 1 98 1 0 0 0 
1 0 0 96 3 1 0 0 0 
1 0 0 1 98 1 0 0 0 
1 0 0 96 3 1 0 0 0 
1 0 0 1 98 1 0 0 0 
1 0 0 96 3 1 0 0 0 
1 0 0 1 98 1 0 0 0 
1 0 0 96 3 1 0 0 0 
1 0 0 1 98 1 0 0 0 
1 0 0 96 3 1 0 0 0 
1 0 0 1 98 1 0 0 0 
1 0 0 96 3 1 0 0 0 
1 0 0 1 98 1 0 0 0 
1 0 0 96 3 1 0 0 0 
1 0 0 1 98 1 0 0 0 
1 0 0 96 3 1 0 0 0 
1 0 0 1 98 1 0 0 0 
1 0 0 96 3 1 0 0 0 
1 0 0 1 98 1 0 0 0 
1 0 0 96 3 1 0 0 0 
1 0 0 1 98 1 0 0 0 
1 0 0 96 3 1 0 0 0 
1 0 0 1 98 1 0 0 0 
1 0 0 96 3 1 0 0 0 
1 0 0 1 98 1 0 0 0 
1 0 0 96 3 1 0 0 0 
1 0 0 1 98 1 0 0 0 
1 0 0 96 3 1 0 0 0 
1 0 0 1 98 1 0 0 0 
1 0 0 96 3 1 0 0 0 
1 0 0 1 98 1 0 0 0 
1 0 0 96 3 1 0 0 0 
1 0 0 1 98 1 0 0 0 
1 0 0 96 3 1 0 0 0 
1 0 0 1 98 1 0 0 0 
1 0 0 96 3 1 0 0 0 
1 0 0 1 98 1 0 0 0 
4 0 0 92 3 1 0 0 1 
4 0 0 94 1 1 0 0 1 
4 0 0 92 3 1 0 0 1 
4 0 0 94 1 1 0 0 1 
4 0 0 92 3 1 0 0 1 
4 0 0 94 1 1 0 0 1 
4 0 0 92 3 1 0 0 1 
4 0 0 94 1 1 0 0 1 
11 0 0 85 3 1 0 0 1 
11 0 0 87 1 1 0 0 1 
11 0 0 85 3 1 0 0 1 
11 0 0 87 1 1 0 0 1 
11 0 0 85 3 1 0 0 1 
11 0 0 87 1 1 0 0 1 
11 0 0 85 3 1 0 0 1 
11 0 0 87 1 1 0 0 1 
5 0 0 91 3 1 0 0 1 
5 0 0 93 1 1 0 0 1 
5 0 0 91 3 1 0 0 1 
5 0 0 93 1 1 0 0 1 
5 0 0 91 3 1 0 0 1 
5 0 0 93 1 1 0 0 1 
5 0 0 91 3 1 0 0 1 
5 0 0 93 1 1 0 0 1 
5 0 0 91 3 1 0 0 1 
5 0 0 93 1 1 0 0 1 
5 0 0 91 3 1 0 0 1 
5 0 0 93 1 1 0 0 1 
5 0 0 91 3 1 0 0 1 
5 0 0 93 1 1 0 0 1 
5 0 0 91 3 1 0 0 1 
5 0 0 93 1 1 0 0 1 
5 0 0 91 3 1 0 0 1 
5 0 0 93 1 1 0 0 1 
5 0 0 91 3 1 0 0 1 
5 0 0 93 1 1 0 0 1 
5 0 0 91 3 1 0 0 1 
5 0 0 93 1 1 0 0 1 
5 0 0 91 3 1 0 0 1 
5 0 0 93 1 1 0 0 1 
10 0 0 86 3 1 0 0 1 
10 0 0 88 1 1 0 0 1 
10 0 0 86 3 1 0 0 1 
10 0 0 88 1 1 0 0 1 
10 0 0 86 3 1 0 0 1 
10 0 0 88 1 1 0 0 1 
10 0 0 86 3 1 0 0 1 
10 0 0 88 1 1 0 0 1 
1 0 0 95 3 1 0 0 1 
1 0 0 97 1 1 0 0 1 
1 0 0 95 3 1 0 0 1 
1 0 0 97 1 1 0 0 1 
1 0 0 95 3 1 0 0 1 
1 0 0 97 1 1 0 0 1 
1 0 0 95 3 1 0 0 1 
1 0 0 97 1 1 0 0 1 
4 0 0 92 3 1 0 0 1 
4 0 0 94 1 1 0 0 1 
4 0 0 92 3 1 0 0 1 
4 0 0 94 1 1 0 0 1 
4 0 0 92 3 1 0 0 1 
4 0 0 94 1 1 0 0 1 
4 0 0 92 3 1 0 0 1 
4 0 0 94 1 1 0 0 1 
11 0 0 85 3 1 0 0 1 
11 0 0 87 1 1 0 0 1 
11 0 0 85 3 1 0 0 1 
11 0 0 87 1 1 0 0 1 
11 0 0 85 3 1 0 0 1 
11 0 0 87 1 1 0 0 1 
11 0 0 85 3 1 0 0 1 
11 0 0 87 1 1 0 0 1 
5 0 0 91 3 1 0 0 1 
5 0 0 93 1 1 0 0 1 
5 0 0 91 3 1 0 0 1 
5 0 0 93 1 1 0 0 1 
5 0 0 91 3 1 0 0 1 
5 0 0 93 1 1 0 0 1 
5 0 0 91 3 1 0 0 1 
5 0 0 93 1 1 0 0 1 
5 0 0 91 3 1 0 0 1 
5 0 0 93 1 1 0 0 1 
5 0 0 91 3 1 0 0 1 
5 0 0 93 1 1 0 0 1 
5 0 0 91 3 1 0 0 1 
5 0 0 93 1 1 0 0 1 
5 0 0 91 3 1 0 0 1 
5 0 0 93 1 1 0 0 1 
5 0 0 91 3 1 0 0 1 
5 0 0 93 1 1 0 0 1 
5 0 0 91 3 1 0 0 1 
5 0 0 93 1 1 0 0 1 
5 0 0 91 3 1 0 0 1 
5 0 0 93 1 1 0 0 1 
5 0 0 91 3 1 0 0 1 
5 0 0 93 1 1 0 0 1 
10 0 0 86 3 1 0 0 1 
10 0 0 88 1 1 0 0 1 
10 0 0 86 3 1 0 0 1 
10 0 0 88 1 1 0 0 1 
10 0 0 86 3 1 0 0 1 
10 0 0 88 1 1 0 0 1 
10 0 0 86 3 1 0 0 1 
10 0 0 88 1 1 0 0 1 
1 0 0 95 3 1 0 0 1 
1 0 0 97 1 1 0 0 1 
1 0 0 95 3 1 0 0 1 
1 0 0 97 1 1 0 0 1 
1 0 0 95 3 1 0 0 1 
1 0 0 97 1 1 0 0 1 
1 0 0 95 3 1 0 0 1 
1 0 0 97 1 1 0 0 1 
4 0 0 92 3 1 0 0 1 
4 0 0 94 1 1 0 0 1 
4 0 0 92 3 1 0 0 1 
4 0 0 94 1 1 0 0 1 
4 0 0 92 3 1 0 0 1 
4 0 0 94 1 1 0 0 1 
4 0 0 92 3 1 0 0 1 
4 0 0 94 1 1 0 0 1 
11 0 0 85 3 1 0 0 1 
11 0 0 87 1 1 0 0 1 
11 0 0 85 3 1 0 0 1 
11 0 0 87 1 1 0 0 1 
11 0 0 85 3 1 0 0 1 
11 0 0 87 1 1 0 0 1 
11 0 0 85 3 1 0 0 1 
11 0 0 87 1 1 0 0 1 
5 0 0 91 3 1 0 0 1 
5 0 0 93 1 1 0 0 1 
5 0 0 91 3 1 0 0 1 
5 0 0 93 1 1 0 0 1 
5 0 0 91 3 1 0 0 1 
5 0 0 93 1 1 0 0 1 
5 0 0 91 3 1 0 0 1 
5 0 0 93 1 1 0 0 1 
5 0 0 91 3 1 0 0 1 
5 0 0 93 1 1 0 0 1 
5 0 0 91 3 1 0 0 1 
5 0 0 93 1 1 0 0 1 
5 0 0 91 3 1 0 0 1 
5 0 0 93 1 1 0 0 1 
5 0 0 91 3 1 0 0 1 
5 0 0 93 1 1 0 0 1 
5 0 0 91 3 1 0 0 1 
5 0 0 93 1 1 0 0 1 
5 0 0 91 3 1 0 0 1 
5 0 0 93 1 1 0 0 1 
5 0 0 91 3 1 0 0 1 
5 0 0 93 1 1 0 0 1 
5 0 0 91 3 1 0 0 1 
5 0 0 93 1 1 0 0 1 
10 0 0 86 3 1 0 0 1 
10 0 0 88 1 1 0 0 1 
10 0 0 86 3 1 0 0 1 
10 0 0 88 1 1 0 0 1 
10 0 0 86 3 1 0 0 1 
10 0 0 88 1 1 0 0 1 
10 0 0 86 3 1 0 0 1 
10 0 0 88 1 1 0 0 1 
1 0 0 95 3 1 0 0 1 
1 0 0 97 1 1 0 0 1 
1 0 0 95 3 1 0 0 1 
1 0 0 97 1 1 0 0 1 
1 0 0 95 3 1 0 0 1 
1 0 0 97 1 1 0 0 1 
1 0 0 95 3 1 0 0 1 
1 0 0 97 1 1 0 0 1 
4 0 0 92 3 1 0 0 1 
4 0 0 94 1 1 0 0 1 
4 0 0 92 3 1 0 0 1 
4 0 0 94 1 1 0 0 1 
4 0 0 92 3 1 0 0 1 
4 0 0 94 1 1 0 0 1 
4 0 0 92 3 1 0 0 1 
4 0 0 94 1 1 0 0 1 
11 0 0 85 3 1 0 0 1 
11 0 0 87 1 1 0 0 1 
11 0 0 85 3 1 0 0 1 
11 0 0 87 1 1 0 0 1 
11 0 0 85 3 1 0 0 1 
11 0 0 87 1 1 0 0 1 
11 0 0 85 3 1 0 0 1 
11 0 0 87 1 1 0 0 1 
5 0 0 91 3 1 0 0 1 
5 0 0 93 1 1 0 0 1 
5 0 0 91 3 1 0 0 1 
5 0 0 93 1 1 0 0 1 
5 0 0 91 3 1 0 0 1 
5 0 0 93 1 1 0 0 1 
5 0 0 91 3 1 0 0 1 
5 0 0 93 1 1 0 0 1 
5 0 0 91 3 1 0 0 1 
5 0 0 93 1 1 0 0 1 
5 0 0 91 3 1 0 0 1 
5 0 0 93 1 1 0 0 1 
5 0 0 91 3 1 0 0 1 
5 0 0 93 1 1 0 0 1 
5 0 0 91 3 1 0 0 1 
5 0 0 93 1 1 0 0 1 
5 0 0 91 3 1 0 0 1 
5 0 0 93 1 1 0 0 1 
5 0 0 91 3 1 0 0 1 
5 0 0 93 1 1 0 0 1 
5 0 0 91 3 1 0 0 1 
5 0 0 93 1 1 0 0 1 
5 0 0 91 3 1 0 0 1 
5 0 0 93 1 1 0 0 1 
10 0 0 86 3 1 0 0 1 
10 0 0 88 1 1 0 0 1 
10 0 0 86 3 1 0 0 1 
10 0 0 88 1 1 0 0 1 
10 0 0 86 3 1 0 0 1 
10 0 0 88 1 1 0 0 1 
10 0 0 86 3 1 0 0 1 
10 0 0 88 1 1 0 0 1 
1 0 0 95 3 1 0 0 1 
1 0 0 97 1 1 0 0 1 
1 0 0 95 3 1 0 0 1 
1 0 0 97 1 1 0 0 1 
1 0 0 95 3 1 0 0 1 
1 0 0 97 1 1 0 0 1 
1 0 0 95 3 1 0 0 1 
1 0 0 97 1 1 0 0 1 
4 0 0 92 3 1 0 0 1 
4 0 0 94 1 1 0 0 1 
4 0 0 92 3 1 0 0 1 
4 0 0 94 1 1 0 0 1 
4 0 0 92 3 1 0 0 1 
4 0 0 94 1 1 0 0 1 
4 0 0 92 3 1 0 0 1 
4 0 0 94 1 1 0 0 1 
11 0 0 85 3 1 0 0 1 
11 0 0 87 1 1 0 0 1 
11 0 0 85 3 1 0 0 1 
11 0 0 87 1 1 0 0 1 
11 0 0 85 3 1 0 0 1 
11 0 0 87 1 1 0 0 1 
11 0 0 85 3 1 0 0 1 
11 0 0 87 1 1 0 0 1 
5 0 0 91 3 1 0 0 1 
5 0 0 93 1 1 0 0 1 
5 0 0 91 3 1 0 0 1 
5 0 0 93 1 1 0 0 1 
5 0 0 91 3 1 0 0 1 
5 0 0 93 1 1 0 0 1 
5 0 0 91 3 1 0 0 1 
5 0 0 93 1 1 0 0 1 
5 0 0 91 3 1 0 0 1 
5 0 0 93 1 1 0 0 1 
5 0 0 91 3 1 0 0 1 
5 0 0 93 1 1 0 0 1 
5 0 0 91 3 1 0 0 1 
5 0 0 93 1 1 0 0 1 
5 0 0 91 3 1 0 0 1 
5 0 0 93 1 1 0 0 1 
5 0 0 91 3 1 0 0 1 
5 0 0 93 1 1 0 0 1 
5 0 0 91 3 1 0 0 1 
5 0 0 93 1 1 0 0 1 
5 0 0 91 3 1 0 0 1 
5 0 0 93 1 1 0 0 1 
5 0 0 91 3 1 0 0 1 
5 0 0 93 1 1 0 0 1 
10 0 0 86 3 1 0 0 1 
10 0 0 88 1 1 0 0 1 
10 0 0 86 3 1 0 0 1 
10 0 0 88 1 1 0 0 1 
10 0 0 86 3 1 0 0 1 
10 0 0 88 1 1 0 0 1 
10 0 0 86 3 1 0 0 1 
10 0 0 88 1 1 0 0 1 
1 0 0 95 3 1 0 0 1 
1 0 0 97 1 1 0 0 1 
1 0 0 95 3 1 0 0 1 
1 0 0 97 1 1 0 0 1 
1 0 0 95 3 1 0 0 1 
1 0 0 97 1 1 0 0 1 
1 0 0 95 3 1 0 0 1 
1 0 0 97 1 1 0 0 1 
4 0 0 92 3 1 0 0 1 
4 0 0 94 1 1 0 0 1 
4 0 0 92 3 1 0 0 1 
4 0 0 94 1 1 0 0 1 
4 0 0 92 3 1 0 0 1 
4 0 0 94 1 1 0 0 1 
4 0 0 92 3 1 0 0 1 
4 0 0 94 1 1 0 0 1 
11 0 0 85 3 1 0 0 1 
11 0 0 87 1 1 0 0 1 
11 0 0 85 3 1 0 0 1 
11 0 0 87 1 1 0 0 1 
11 0 0 85 3 1 0 0 1 
11 0 0 87 1 1 0 0 1 
11 0 0 85 3 1 0 0 1 
11 0 0 87 1 1 0 0 1 
5 0 0 91 3 1 0 0 1 
5 0 0 93 1 1 0 0 1 
5 0 0 91 3 1 0 0 1 
5 0 0 93 1 1 0 0 1 
5 0 0 91 3 1 0 0 1 
5 0 0 93 1 1 0 0 1 
5 0 0 91 3 1 0 0 1 
5 0 0 93 1 1 0 0 1 
5 0 0 91 3 1 0 0 1 
5 0 0 93 1 1 0 0 1 
5 0 0 91 3 1 0 0 1 
5 0 0 93 1 1 0 0 1 
5 0 0 91 3 1 0 0 1 
5 0 0 93 1 1 0 0 1 
5 0 0 91 3 1 0 0 1 
5 0 0 93 1 1 0 0 1 
5 0 0 91 3 1 0 0 1 
5 0 0 93 1 1 0 0 1 
5 0 0 91 3 1 0 0 1 
5 0 0 93 1 1 0 0 1 
5 0 0 91 3 1 0 0 1 
5 0 0 93 1 1 0 0 1 
5 0 0 91 3 1 0 0 1 
5 0 0 93 1 1 0 0 1 
10 0 0 86 3 1 0 0 1 
10 0 0 88 1 1 0 0 1 
10 0 0 86 3 1 0 0 1 
10 0 0 88 1 1 0 0 1 
10 0 0 86 3 1 0 0 1 
10 0 0 88 1 1 0 0 1 
10 0 0 86 3 1 0 0 1 
10 0 0 88 1 1 0 0 1 
1 0 0 95 3 1 0 0 1 
1 0 0 97 1 1 0 0 1 
1 0 0 95 3 1 0 0 1 
1 0 0 97 1 1 0 0 1 
1 0 0 95 3 1 0 0 1 
1 0 0 97 1 1 0 0 1 
1 0 0 95 3 1 0 0 1 
1 0 0 97 1 1 0 0 1 
4 0 0 92 4 1 0 0 0 
4 0 0 92 4 1 0 0 0 
4 0 0 92 4 1 0 0 0 
11 0 0 85 4 1 0 0 0 
11 0 0 85 4 1 0 0 0 
11 0 0 85 4 1 0 0 0 
5 0 0 91 4 1 0 0 0 
5 0 0 91 4 1 0 0 0 
5 0 0 91 4 1 0 0 0 
5 0 0 91 4 1 0 0 0 
5 0 0 91 4 1 0 0 0 
5 0 0 91 4 1 0 0 0 
5 0 0 91 4 1 0 0 0 
5 0 0 91 4 1 0 0 0 
5 0 0 91 4 1 0 0 0 
10 0 0 86 4 1 0 0 0 
10 0 0 86 4 1 0 0 0 
10 0 0 86 4 1 0 0 0 
1 0 0 95 4 1 0 0 0 
1 0 0 95 4 1 0 0 0 
1 0 0 1 98 1 0 0 0 
4 0 0 95 1 1 0 0 0 
11 0 0 88 1 1 0 0 0 
5 0 0 94 1 1 0 0 0 
5 0 0 94 1 1 0 0 0 
5 0 0 94 1 1 0 0 0 
10 0 0 89 1 1 0 0 0 
1 0 0 98 1 1 0 0 0 
1 0 0 17 68 15 0 0 0 
4 0 0 95 1 1 0 0 0 
11 0 0 88 1 1 0 0 0 
5 0 0 94 1 1 0 0 0 
5 0 0 94 1 1 0 0 0 
5 0 0 94 1 1 0 0 0 
10 0 0 89 1 1 0 0 0 
1 0 0 98 1 1 0 0 0 
4 0 0 93 3 1 0 0 0 
11 0 0 86 3 1 0 0 0 
5 0 0 92 3 1 0 0 0 
5 0 0 92 3 1 0 0 0 
5 0 0 92 3 1 0 0 0 
10 0 0 87 3 1 0 0 0 
1 0 0 96 3 1 0 0 0 
4 0 0 95 1 1 0 0 0 
11 0 0 88 1 1 0 0 0 
5 0 0 94 1 1 0 0 0 
5 0 0 94 1 1 0 0 0 
5 0 0 94 1 1 0 0 0 
10 0 0 89 1 1 0 0 0 
1 0 0 98 1 1 0 0 0 
4 0 0 93 3 1 0 0 0 
11 0 0 86 3 1 0 0 0 
5 0 0 92 3 1 0 0 0 
5 0 0 92 3 1 0 0 0 
5 0 0 92 3 1 0 0 0 
10 0 0 87 3 1 0 0 0 
1 0 0 96 3 1 0 0 0 
4 0 0 95 1 1 0 0 0 
11 0 0 88 1 1 0 0 0 
5 0 0 94 1 1 0 0 0 
5 0 0 94 1 1 0 0 0 
5 0 0 94 1 1 0 0 0 
10 0 0 89 1 1 0 0 0 
1 0 0 98 1 1 0 0 0 
4 0 0 93 3 1 0 0 0 
11 0 0 86 3 1 0 0 0 
5 0 0 92 3 1 0 0 0 
5 0 0 92 3 1 0 0 0 
5 0 0 92 3 1 0 0 0 
10 0 0 87 3 1 0 0 0 
1 0 0 96 3 1 0 0 0 
4 0 0 95 1 1 0 0 0 
11 0 0 88 1 1 0 0 0 
5 0 0 94 1 1 0 0 0 
5 0 0 94 1 1 0 0 0 
5 0 0 94 1 1 0 0 0 
10 0 0 89 1 1 0 0 0 
1 0 0 98 1 1 0 0 0 
4 0 0 93 3 1 0 0 0 
11 0 0 86 3 1 0 0 0 
5 0 0 92 3 1 0 0 0 
5 0 0 92 3 1 0 0 0 
5 0 0 92 3 1 0 0 0 
10 0 0 87 3 1 0 0 0 
1 0 0 96 3 1 0 0 0 
4 0 0 95 1 1 0 0 0 
11 0 0 88 1 1 0 0 0 
5 0 0 94 1 1 0 0 0 
5 0 0 94 1 1 0 0 0 
5 0 0 94 1 1 0 0 0 
10 0 0 89 1 1 0 0 0 
1 0 0 98 1 1 0 0 0 
4 0 0 93 3 1 0 0 0 
11 0 0 86 3 1 0 0 0 
5 0 0 92 3 1 0 0 0 
5 0 0 92 3 1 0 0 0 
5 0 0 92 3 1 0 0 0 
10 0 0 87 3 1 0 0 0 
1 0 0 96 3 1 0 0 0 
4 0 0 95 1 1 0 0 0 
11 0 0 88 1 1 0 0 0 
5 0 0 94 1 1 0 0 0 
5 0 0 94 1 1 0 0 0 
5 0 0 94 1 1 0 0 0 
10 0 0 89 1 1 0 0 0 
1 0 0 98 1 1 0 0 0 
4 0 0 93 3 1 0 0 0 
11 0 0 86 3 1 0 0 0 
5 0 0 92 3 1 0 0 0 
5 0 0 92 3 1 0 0 0 
5 0 0 92 3 1 0 0 0 
10 0 0 87 3 1 0 0 0 
1 0 0 96 3 1 0 0 0 
4 0 0 95 1 1 0 0 0 
11 0 0 88 1 1 0 0 0 
5 0 0 94 1 1 0 0 0 
5 0 0 94 1 1 0 0 0 
5 0 0 94 1 1 0 0 0 
10 0 0 89 1 1 0 0 0 
1 0 0 98 1 1 0 0 0 
5 0 0 63 18 15 0 0 0 
5 0 0 63 18 15 0 0 0 
5 0 0 63 18 15 0 0 0 
5 0 0 63 18 15 0 0 0 
5 0 0 63 18 15 0 0 0 
5 0 0 63 18 15 0 0 0 
4 0 0 93 3 1 0 0 0 
11 0 0 86 3 1 0 0 0 
5 0 0 92 3 1 0 0 0 
5 0 0 92 3 1 0 0 0 
5 0 0 92 3 1 0 0 0 
10 0 0 87 3 1 0 0 0 
1 0 0 96 3 1 0 0 0 
4 0 0 95 1 1 0 0 0 
11 0 0 88 1 1 0 0 0 
5 0 0 94 1 1 0 0 0 
5 0 0 94 1 1 0 0 0 
5 0 0 94 1 1 0 0 0 
10 0 0 89 1 1 0 0 0 
1 0 0 98 1 1 0 0 0 
4 0 0 93 3 1 0 0 0 
11 0 0 86 3 1 0 0 0 
5 0 0 92 3 1 0 0 0 
5 0 0 92 3 1 0 0 0 
5 0 0 92 3 1 0 0 0 
10 0 0 87 3 1 0 0 0 
1 0 0 96 3 1 0 0 0 
4 0 0 95 1 1 0 0 0 
11 0 0 88 1 1 0 0 0 
5 0 0 94 1 1 0 0 0 
5 0 0 94 1 1 0 0 0 
5 0 0 94 1 1 0 0 0 
10 0 0 89 1 1 0 0 0 
1 0 0 98 1 1 0 0 0 
4 0 0 93 3 1 0 0 0 
11 0 0 86 3 1 0 0 0 
5 0 0 92 3 1 0 0 0 
5 0 0 92 3 1 0 0 0 
5 0 0 92 3 1 0 0 0 
10 0 0 87 3 1 0 0 0 
1 0 0 96 3 1 0 0 0 
4 0 0 95 1 1 0 0 0 
11 0 0 88 1 1 0 0 0 
5 0 0 94 1 1 0 0 0 
5 0 0 94 1 1 0 0 0 
5 0 0 94 1 1 0 0 0 
10 0 0 89 1 1 0 0 0 
1 0 0 98 1 1 0 0 0 
4 0 0 93 3 1 0 0 0 
11 0 0 86 3 1 0 0 0 
5 0 0 92 3 1 0 0 0 
5 0 0 92 3 1 0 0 0 
5 0 0 92 3 1 0 0 0 
10 0 0 87 3 1 0 0 0 
1 0 0 96 3 1 0 0 0 
4 0 0 95 1 1 0 0 0 
11 0 0 88 1 1 0 0 0 
5 0 0 94 1 1 0 0 0 
5 0 0 94 1 1 0 0 0 
5 0 0 94 1 1 0 0 0 
10 0 0 89 1 1 0 0 0 
1 0 0 98 1 1 0 0 0 
4 0 0 93 3 1 0 0 0 
11 0 0 86 3 1 0 0 0 
5 0 0 92 3 1 0 0 0 
5 0 0 92 3 1 0 0 0 
5 0 0 92 3 1 0 0 0 
10 0 0 87 3 1 0 0 0 
1 0 0 96 3 1 0 0 0 
4 0 0 93 3 1 0 0 0 
11 0 0 86 3 1 0 0 0 
5 0 0 92 3 1 0 0 0 
5 0 0 92 3 1 0 0 0 
5 0 0 92 3 1 0 0 0 
10 0 0 87 3 1 0 0 0 
1 0 0 96 3 1 0 0 0 
4 0 0 95 1 1 0 0 0 
11 0 0 88 1 1 0 0 0 
5 0 0 94 1 1 0 0 0 
5 0 0 94 1 1 0 0 0 
5 0 0 94 1 1 0 0 0 
10 0 0 89 1 1 0 0 0 
1 0 0 98 1 1 0 0 0 
4 0 0 93 3 1 0 0 0 
11 0 0 86 3 1 0 0 0 
5 0 0 92 3 1 0 0 0 
5 0 0 92 3 1 0 0 0 
5 0 0 92 3 1 0 0 0 
10 0 0 87 3 1 0 0 0 
1 0 0 96 3 1 0 0 0 
4 0 0 95 1 1 0 0 0 
11 0 0 88 1 1 0 0 0 
5 0 0 94 1 1 0 0 0 
5 0 0 94 1 1 0 0 0 
5 0 0 94 1 1 0 0 0 
10 0 0 89 1 1 0 0 0 
1 0 0 98 1 1 0 0 0 
4 0 0 95 1 1 0 0 0 
4 0 0 95 1 1 0 0 0 
4 0 0 95 1 1 0 0 0 
11 0 0 88 1 1 0 0 0 
11 0 0 88 1 1 0 0 0 
11 0 0 88 1 1 0 0 0 
5 0 0 94 1 1 0 0 0 
5 0 0 94 1 1 0 0 0 
5 0 0 94 1 1 0 0 0 
5 0 0 94 1 1 0 0 0 
5 0 0 94 1 1 0 0 0 
5 0 0 94 1 1 0 0 0 
5 0 0 94 1 1 0 0 0 
5 0 0 94 1 1 0 0 0 
5 0 0 94 1 1 0 0 0 
10 0 0 89 1 1 0 0 0 
10 0 0 89 1 1 0 0 0 
10 0 0 89 1 1 0 0 0 
1 0 0 98 1 1 0 0 0 
1 0 0 98 1 1 0 0 0 
1 0 0 1 98 1 0 0 0 
1 0 0 17 68 15 0 0 0 
1 0 0 17 68 15 0 0 0 
3 0 0 15 68 15 0 0 0 
2 0 0 16 66 15 0 0 2 
4 0 0 95 1 1 0 0 0 
4 0 0 95 1 1 0 0 0 
4 0 0 95 1 1 0 0 0 
11 0 0 88 1 1 0 0 0 
11 0 0 88 1 1 0 0 0 
11 0 0 88 1 1 0 0 0 
5 0 0 94 1 1 0 0 0 
5 0 0 94 1 1 0 0 0 
5 0 0 94 1 1 0 0 0 
5 0 0 94 1 1 0 0 0 
5 0 0 94 1 1 0 0 0 
5 0 0 94 1 1 0 0 0 
5 0 0 94 1 1 0 0 0 
5 0 0 94 1 1 0 0 0 
5 0 0 94 1 1 0 0 0 
10 0 0 89 1 1 0 0 0 
10 0 0 89 1 1 0 0 0 
10 0 0 89 1 1 0 0 0 
1 0 0 98 1 1 0 0 0 
1 0 0 98 1 1 0 0 0 
1 0 0 1 98 1 0 0 0 
4 0 0 93 3 1 0 0 0 
4 0 0 93 3 1 0 0 0 
4 0 0 93 3 1 0 0 0 
11 0 0 86 3 1 0 0 0 
11 0 0 86 3 1 0 0 0 
11 0 0 86 3 1 0 0 0 
5 0 0 92 3 1 0 0 0 
5 0 0 92 3 1 0 0 0 
5 0 0 92 3 1 0 0 0 
5 0 0 92 3 1 0 0 0 
5 0 0 92 3 1 0 0 0 
5 0 0 92 3 1 0 0 0 
5 0 0 92 3 1 0 0 0 
5 0 0 92 3 1 0 0 0 
5 0 0 92 3 1 0 0 0 
10 0 0 87 3 1 0 0 0 
10 0 0 87 3 1 0 0 0 
10 0 0 87 3 1 0 0 0 
1 0 0 96 3 1 0 0 0 
1 0 0 96 3 1 0 0 0 
1 0 0 96 3 1 0 0 0 
4 0 0 95 1 1 0 0 0 
4 0 0 95 1 1 0 0 0 
4 0 0 95 1 1 0 0 0 
11 0 0 88 1 1 0 0 0 
11 0 0 88 1 1 0 0 0 
11 0 0 88 1 1 0 0 0 
5 0 0 94 1 1 0 0 0 
5 0 0 94 1 1 0 0 0 
5 0 0 94 1 1 0 0 0 
5 0 0 94 1 1 0 0 0 
5 0 0 94 1 1 0 0 0 
5 0 0 94 1 1 0 0 0 
5 0 0 94 1 1 0 0 0 
5 0 0 94 1 1 0 0 0 
5 0 0 94 1 1 0 0 0 
10 0 0 89 1 1 0 0 0 
10 0 0 89 1 1 0 0 0 
10 0 0 89 1 1 0 0 0 
1 0 0 98 1 1 0 0 0 
1 0 0 98 1 1 0 0 0 
1 0 0 1 98 1 0 0 0 
4 0 0 93 3 1 0 0 0 
4 0 0 93 3 1 0 0 0 
4 0 0 93 3 1 0 0 0 
11 0 0 86 3 1 0 0 0 
11 0 0 86 3 1 0 0 0 
11 0 0 86 3 1 0 0 0 
5 0 0 92 3 1 0 0 0 
5 0 0 92 3 1 0 0 0 
5 0 0 92 3 1 0 0 0 
5 0 0 92 3 1 0 0 0 
5 0 0 92 3 1 0 0 0 
5 0 0 92 3 1 0 0 0 
5 0 0 92 3 1 0 0 0 
5 0 0 92 3 1 0 0 0 
5 0 0 92 3 1 0 0 0 
10 0 0 87 3 1 0 0 0 
10 0 0 87 3 1 0 0 0 
10 0 0 87 3 1 0 0 0 
1 0 0 96 3 1 0 0 0 
1 0 0 96 3 1 0 0 0 
1 0 0 96 3 1 0 0 0 
4 0 0 95 1 1 0 0 0 
4 0 0 95 1 1 0 0 0 
4 0 0 95 1 1 0 0 0 
11 0 0 88 1 1 0 0 0 
11 0 0 88 1 1 0 0 0 
11 0 0 88 1 1 0 0 0 
5 0 0 94 1 1 0 0 0 
5 0 0 94 1 1 0 0 0 
5 0 0 94 1 1 0 0 0 
5 0 0 94 1 1 0 0 0 
5 0 0 94 1 1 0 0 0 
5 0 0 94 1 1 0 0 0 
5 0 0 94 1 1 0 0 0 
5 0 0 94 1 1 0 0 0 
5 0 0 94 1 1 0 0 0 
10 0 0 89 1 1 0 0 0 
10 0 0 89 1 1 0 0 0 
10 0 0 89 1 1 0 0 0 
1 0 0 98 1 1 0 0 0 
1 0 0 98 1 1 0 0 0 
1 0 0 1 98 1 0 0 0 
4 0 0 93 3 1 0 0 0 
4 0 0 93 3 1 0 0 0 
4 0 0 93 3 1 0 0 0 
11 0 0 86 3 1 0 0 0 
11 0 0 86 3 1 0 0 0 
11 0 0 86 3 1 0 0 0 
5 0 0 92 3 1 0 0 0 
5 0 0 92 3 1 0 0 0 
5 0 0 92 3 1 0 0 0 
5 0 0 92 3 1 0 0 0 
5 0 0 92 3 1 0 0 0 
5 0 0 92 3 1 0 0 0 
5 0 0 92 3 1 0 0 0 
5 0 0 92 3 1 0 0 0 
5 0 0 92 3 1 0 0 0 
10 0 0 87 3 1 0 0 0 
10 0 0 87 3 1 0 0 0 
10 0 0 87 3 1 0 0 0 
1 0 0 96 3 1 0 0 0 
1 0 0 96 3 1 0 0 0 
1 0 0 96 3 1 0 0 0 
4 0 0 95 1 1 0 0 0 
4 0 0 95 1 1 0 0 0 
4 0 0 95 1 1 0 0 0 
11 0 0 88 1 1 0 0 0 
11 0 0 88 1 1 0 0 0 
11 0 0 88 1 1 0 0 0 
5 0 0 94 1 1 0 0 0 
5 0 0 94 1 1 0 0 0 
5 0 0 94 1 1 0 0 0 
5 0 0 94 1 1 0 0 0 
5 0 0 94 1 1 0 0 0 
5 0 0 94 1 1 0 0 0 
5 0 0 94 1 1 0 0 0 
5 0 0 94 1 1 0 0 0 
5 0 0 94 1 1 0 0 0 
10 0 0 89 1 1 0 0 0 
10 0 0 89 1 1 0 0 0 
10 0 0 89 1 1 0 0 0 
1 0 0 98 1 1 0 0 0 
1 0 0 98 1 1 0 0 0 
1 0 0 1 98 1 0 0 0 
4 0 0 93 3 1 0 0 0 
4 0 0 93 3 1 0 0 0 
4 0 0 93 3 1 0 0 0 
11 0 0 86 3 1 0 0 0 
11 0 0 86 3 1 0 0 0 
11 0 0 86 3 1 0 0 0 
5 0 0 92 3 1 0 0 0 
5 0 0 92 3 1 0 0 0 
5 0 0 92 3 1 0 0 0 
5 0 0 92 3 1 0 0 0 
5 0 0 92 3 1 0 0 0 
5 0 0 92 3 1 0 0 0 
5 0 0 92 3 1 0 0 0 
5 0 0 92 3 1 0 0 0 
5 0 0 92 3 1 0 0 0 
10 0 0 87 3 1 0 0 0 
10 0 0 87 3 1 0 0 0 
10 0 0 87 3 1 0 0 0 
1 0 0 96 3 1 0 0 0 
1 0 0 96 3 1 0 0 0 
1 0 0 96 3 1 0 0 0 
4 0 0 95 1 1 0 0 0 
4 0 0 95 1 1 0 0 0 
4 0 0 95 1 1 0 0 0 
11 0 0 88 1 1 0 0 0 
11 0 0 88 1 1 0 0 0 
11 0 0 88 1 1 0 0 0 
5 0 0 94 1 1 0 0 0 
5 0 0 94 1 1 0 0 0 
5 0 0 94 1 1 0 0 0 
5 0 0 94 1 1 0 0 0 
5 0 0 94 1 1 0 0 0 
5 0 0 94 1 1 0 0 0 
5 0 0 94 1 1 0 0 0 
5 0 0 94 1 1 0 0 0 
5 0 0 94 1 1 0 0 0 
10 0 0 89 1 1 0 0 0 
10 0 0 89 1 1 0 0 0 
10 0 0 89 1 1 0 0 0 
1 0 0 98 1 1 0 0 0 
1 0 0 98 1 1 0 0 0 
1 0 0 1 98 1 0 0 0 
4 0 0 93 3 1 0 0 0 
4 0 0 93 3 1 0 0 0 
4 0 0 93 3 1 0 0 0 
11 0 0 86 3 1 0 0 0 
11 0 0 86 3 1 0 0 0 
11 0 0 86 3 1 0 0 0 
5 0 0 92 3 1 0 0 0 
5 0 0 92 3 1 0 0 0 
5 0 0 92 3 1 0 0 0 
5 0 0 92 3 1 0 0 0 
5 0 0 92 3 1 0 0 0 
5 0 0 92 3 1 0 0 0 
5 0 0 92 3 1 0 0 0 
5 0 0 92 3 1 0 0 0 
5 0 0 92 3 1 0 0 0 
10 0 0 87 3 1 0 0 0 
10 0 0 87 3 1 0 0 0 
10 0 0 87 3 1 0 0 0 
1 0 0 96 3 1 0 0 0 
1 0 0 96 3 1 0 0 0 
1 0 0 96 3 1 0 0 0 
4 0 0 95 1 1 0 0 0 
4 0 0 95 1 1 0 0 0 
4 0 0 95 1 1 0 0 0 
11 0 0 88 1 1 0 0 0 
11 0 0 88 1 1 0 0 0 
11 0 0 88 1 1 0 0 0 
5 0 0 94 1 1 0 0 0 
5 0 0 94 1 1 0 0 0 
5 0 0 94 1 1 0 0 0 
5 0 0 94 1 1 0 0 0 
5 0 0 94 1 1 0 0 0 
5 0 0 94 1 1 0 0 0 
5 0 0 94 1 1 0 0 0 
5 0 0 94 1 1 0 0 0 
5 0 0 94 1 1 0 0 0 
10 0 0 89 1 1 0 0 0 
10 0 0 89 1 1 0 0 0 
10 0 0 89 1 1 0 0 0 
1 0 0 98 1 1 0 0 0 
1 0 0 98 1 1 0 0 0 
1 0 0 1 98 1 0 0 0 
4 0 0 93 3 1 0 0 0 
4 0 0 93 3 1 0 0 0 
4 0 0 93 3 1 0 0 0 
11 0 0 86 3 1 0 0 0 
11 0 0 86 3 1 0 0 0 
11 0 0 86 3 1 0 0 0 
5 0 0 92 3 1 0 0 0 
5 0 0 92 3 1 0 0 0 
5 0 0 92 3 1 0 0 0 
5 0 0 92 3 1 0 0 0 
5 0 0 92 3 1 0 0 0 
5 0 0 92 3 1 0 0 0 
5 0 0 92 3 1 0 0 0 
5 0 0 92 3 1 0 0 0 
5 0 0 92 3 1 0 0 0 
10 0 0 87 3 1 0 0 0 
10 0 0 87 3 1 0 0 0 
10 0 0 87 3 1 0 0 0 
1 0 0 96 3 1 0 0 0 
1 0 0 96 3 1 0 0 0 
1 0 0 96 3 1 0 0 0 
4 0 0 95 1 1 0 0 0 
4 0 0 95 1 1 0 0 0 
4 0 0 95 1 1 0 0 0 
11 0 0 88 1 1 0 0 0 
11 0 0 88 1 1 0 0 0 
11 0 0 88 1 1 0 0 0 
5 0 0 94 1 1 0 0 0 
5 0 0 94 1 1 0 0 0 
5 0 0 94 1 1 0 0 0 
5 0 0 94 1 1 0 0 0 
5 0 0 94 1 1 0 0 0 
5 0 0 94 1 1 0 0 0 
5 0 0 94 1 1 0 0 0 
5 0 0 94 1 1 0 0 0 
5 0 0 94 1 1 0 0 0 
10 0 0 89 1 1 0 0 0 
10 0 0 89 1 1 0 0 0 
10 0 0 89 1 1 0 0 0 
1 0 0 98 1 1 0 0 0 
1 0 0 98 1 1 0 0 0 
1 0 0 1 98 1 0 0 0 
5 0 0 63 18 15 0 0 0 
5 0 0 63 18 15 0 0 0 
5 0 0 63 18 15 0 0 0 
5 0 0 63 18 15 0 0 0 
5 0 0 63 18 15 0 0 0 
5 0 0 63 18 15 0 0 0 
5 0 0 63 18 15 0 0 0 
5 0 0 63 18 15 0 0 0 
5 0 0 63 18 15 0 0 0 
1 0 0 67 18 15 0 0 0 
9 0 0 57 18 15 0 0 2 
9 0 0 59 18 15 0 0 0 
5 0 0 63 18 15 0 0 0 
5 0 0 63 18 15 0 0 0 
5 0 0 63 18 15 0 0 0 
5 0 0 63 18 15 0 0 0 
5 0 0 63 18 15 0 0 0 
5 0 0 63 18 15 0 0 0 
5 0 0 63 18 15 0 0 0 
5 0 0 63 18 15 0 0 0 
5 0 0 63 18 15 0 0 0 
1 0 0 67 18 15 0 0 0 
9 0 0 57 18 15 0 0 2 
9 0 0 59 18 15 0 0 0 
4 0 0 93 3 1 0 0 0 
4 0 0 93 3 1 0 0 0 
4 0 0 93 3 1 0 0 0 
11 0 0 86 3 1 0 0 0 
11 0 0 86 3 1 0 0 0 
11 0 0 86 3 1 0 0 0 
5 0 0 92 3 1 0 0 0 
5 0 0 92 3 1 0 0 0 
5 0 0 92 3 1 0 0 0 
5 0 0 92 3 1 0 0 0 
5 0 0 92 3 1 0 0 0 
5 0 0 92 3 1 0 0 0 
5 0 0 92 3 1 0 0 0 
5 0 0 92 3 1 0 0 0 
5 0 0 92 3 1 0 0 0 
10 0 0 87 3 1 0 0 0 
10 0 0 87 3 1 0 0 0 
10 0 0 87 3 1 0 0 0 
1 0 0 96 3 1 0 0 0 
1 0 0 96 3 1 0 0 0 
1 0 0 96 3 1 0 0 0 
4 0 0 95 1 1 0 0 0 
4 0 0 95 1 1 0 0 0 
4 0 0 95 1 1 0 0 0 
11 0 0 88 1 1 0 0 0 
11 0 0 88 1 1 0 0 0 
11 0 0 88 1 1 0 0 0 
5 0 0 94 1 1 0 0 0 
5 0 0 94 1 1 0 0 0 
5 0 0 94 1 1 0 0 0 
5 0 0 94 1 1 0 0 0 
5 0 0 94 1 1 0 0 0 
5 0 0 94 1 1 0 0 0 
5 0 0 94 1 1 0 0 0 
5 0 0 94 1 1 0 0 0 
5 0 0 94 1 1 0 0 0 
10 0 0 89 1 1 0 0 0 
10 0 0 89 1 1 0 0 0 
10 0 0 89 1 1 0 0 0 
1 0 0 98 1 1 0 0 0 
1 0 0 98 1 1 0 0 0 
1 0 0 1 98 1 0 0 0 
4 0 0 93 3 1 0 0 0 
4 0 0 93 3 1 0 0 0 
4 0 0 93 3 1 0 0 0 
11 0 0 86 3 1 0 0 0 
11 0 0 86 3 1 0 0 0 
11 0 0 86 3 1 0 0 0 
5 0 0 92 3 1 0 0 0 
5 0 0 92 3 1 0 0 0 
5 0 0 92 3 1 0 0 0 
5 0 0 92 3 1 0 0 0 
5 0 0 92 3 1 0 0 0 
5 0 0 92 3 1 0 0 0 
5 0 0 92 3 1 0 0 0 
5 0 0 92 3 1 0 0 0 
5 0 0 92 3 1 0 0 0 
10 0 0 87 3 1 0 0 0 
10 0 0 87 3 1 0 0 0 
10 0 0 87 3 1 0 0 0 
1 0 0 96 3 1 0 0 0 
1 0 0 96 3 1 0 0 0 
1 0 0 96 3 1 0 0 0 
4 0 0 95 1 1 0 0 0 
4 0 0 95 1 1 0 0 0 
4 0 0 95 1 1 0 0 0 
11 0 0 88 1 1 0 0 0 
11 0 0 88 1 1 0 0 0 
11 0 0 88 1 1 0 0 0 
5 0 0 94 1 1 0 0 0 
5 0 0 94 1 1 0 0 0 
5 0 0 94 1 1 0 0 0 
5 0 0 94 1 1 0 0 0 
5 0 0 94 1 1 0 0 0 
5 0 0 94 1 1 0 0 0 
5 0 0 94 1 1 0 0 0 
5 0 0 94 1 1 0 0 0 
5 0 0 94 1 1 0 0 0 
10 0 0 89 1 1 0 0 0 
10 0 0 89 1 1 0 0 0 
10 0 0 89 1 1 0 0 0 
1 0 0 98 1 1 0 0 0 
1 0 0 98 1 1 0 0 0 
1 0 0 1 98 1 0 0 0 
4 0 0 93 3 1 0 0 0 
4 0 0 93 3 1 0 0 0 
4 0 0 93 3 1 0 0 0 
11 0 0 86 3 1 0 0 0 
11 0 0 86 3 1 0 0 0 
11 0 0 86 3 1 0 0 0 
5 0 0 92 3 1 0 0 0 
5 0 0 92 3 1 0 0 0 
5 0 0 92 3 1 0 0 0 
5 0 0 92 3 1 0 0 0 
5 0 0 92 3 1 0 0 0 
5 0 0 92 3 1 0 0 0 
5 0 0 92 3 1 0 0 0 
5 0 0 92 3 1 0 0 0 
5 0 0 92 3 1 0 0 0 
10 0 0 87 3 1 0 0 0 
10 0 0 87 3 1 0 0 0 
10 0 0 87 3 1 0 0 0 
1 0 0 96 3 1 0 0 0 
1 0 0 96 3 1 0 0 0 
1 0 0 96 3 1 0 0 0 
4 0 0 95 1 1 0 0 0 
4 0 0 95 1 1 0 0 0 
4 0 0 95 1 1 0 0 0 
11 0 0 88 1 1 0 0 0 
11 0 0 88 1 1 0 0 0 
11 0 0 88 1 1 0 0 0 
5 0 0 94 1 1 0 0 0 
5 0 0 94 1 1 0 0 0 
5 0 0 94 1 1 0 0 0 
5 0 0 94 1 1 0 0 0 
5 0 0 94 1 1 0 0 0 
5 0 0 94 1 1 0 0 0 
5 0 0 94 1 1 0 0 0 
5 0 0 94 1 1 0 0 0 
5 0 0 94 1 1 0 0 0 
10 0 0 89 1 1 0 0 0 
10 0 0 89 1 1 0 0 0 
10 0 0 89 1 1 0 0 0 
1 0 0 98 1 1 0 0 0 
1 0 0 98 1 1 0 0 0 
1 0 0 1 98 1 0 0 0 
4 0 0 93 3 1 0 0 0 
4 0 0 93 3 1 0 0 0 
4 0 0 93 3 1 0 0 0 
11 0 0 86 3 1 0 0 0 
11 0 0 86 3 1 0 0 0 
11 0 0 86 3 1 0 0 0 
5 0 0 92 3 1 0 0 0 
5 0 0 92 3 1 0 0 0 
5 0 0 92 3 1 0 0 0 
5 0 0 92 3 1 0 0 0 
5 0 0 92 3 1 0 0 0 
5 0 0 92 3 1 0 0 0 
5 0 0 92 3 1 0 0 0 
5 0 0 92 3 1 0 0 0 
5 0 0 92 3 1 0 0 0 
10 0 0 87 3 1 0 0 0 
10 0 0 87 3 1 0 0 0 
10 0 0 87 3 1 0 0 0 
1 0 0 96 3 1 0 0 0 
1 0 0 96 3 1 0 0 0 
1 0 0 96 3 1 0 0 0 
4 0 0 95 1 1 0 0 0 
4 0 0 95 1 1 0 0 0 
4 0 0 95 1 1 0 0 0 
11 0 0 88 1 1 0 0 0 
11 0 0 88 1 1 0 0 0 
11 0 0 88 1 1 0 0 0 
5 0 0 94 1 1 0 0 0 
5 0 0 94 1 1 0 0 0 
5 0 0 94 1 1 0 0 0 
5 0 0 94 1 1 0 0 0 
5 0 0 94 1 1 0 0 0 
5 0 0 94 1 1 0 0 0 
5 0 0 94 1 1 0 0 0 
5 0 0 94 1 1 0 0 0 
5 0 0 94 1 1 0 0 0 
10 0 0 89 1 1 0 0 0 
10 0 0 89 1 1 0 0 0 
10 0 0 89 1 1 0 0 0 
1 0 0 98 1 1 0 0 0 
1 0 0 98 1 1 0 0 0 
1 0 0 1 98 1 0 0 0 
4 0 0 93 3 1 0 0 0 
4 0 0 93 3 1 0 0 0 
4 0 0 93 3 1 0 0 0 
11 0 0 86 3 1 0 0 0 
11 0 0 86 3 1 0 0 0 
11 0 0 86 3 1 0 0 0 
5 0 0 92 3 1 0 0 0 
5 0 0 92 3 1 0 0 0 
5 0 0 92 3 1 0 0 0 
5 0 0 92 3 1 0 0 0 
5 0 0 92 3 1 0 0 0 
5 0 0 92 3 1 0 0 0 
5 0 0 92 3 1 0 0 0 
5 0 0 92 3 1 0 0 0 
5 0 0 92 3 1 0 0 0 
10 0 0 87 3 1 0 0 0 
10 0 0 87 3 1 0 0 0 
10 0 0 87 3 1 0 0 0 
1 0 0 96 3 1 0 0 0 
1 0 0 96 3 1 0 0 0 
1 0 0 96 3 1 0 0 0 
4 0 0 93 3 1 0 0 0 
4 0 0 93 3 1 0 0 0 
4 0 0 93 3 1 0 0 0 
11 0 0 86 3 1 0 0 0 
11 0 0 86 3 1 0 0 0 
11 0 0 86 3 1 0 0 0 
5 0 0 92 3 1 0 0 0 
5 0 0 92 3 1 0 0 0 
5 0 0 92 3 1 0 0 0 
5 0 0 92 3 1 0 0 0 
5 0 0 92 3 1 0 0 0 
5 0 0 92 3 1 0 0 0 
5 0 0 92 3 1 0 0 0 
5 0 0 92 3 1 0 0 0 
5 0 0 92 3 1 0 0 0 
10 0 0 87 3 1 0 0 0 
10 0 0 87 3 1 0 0 0 
10 0 0 87 3 1 0 0 0 
1 0 0 96 3 1 0 0 0 
1 0 0 96 3 1 0 0 0 
1 0 0 96 3 1 0 0 0 
4 0 0 95 1 1 0 0 0 
4 0 0 95 1 1 0 0 0 
4 0 0 95 1 1 0 0 0 
11 0 0 88 1 1 0 0 0 
11 0 0 88 1 1 0 0 0 
11 0 0 88 1 1 0 0 0 
5 0 0 94 1 1 0 0 0 
5 0 0 94 1 1 0 0 0 
5 0 0 94 1 1 0 0 0 
5 0 0 94 1 1 0 0 0 
5 0 0 94 1 1 0 0 0 
5 0 0 94 1 1 0 0 0 
5 0 0 94 1 1 0 0 0 
5 0 0 94 1 1 0 0 0 
5 0 0 94 1 1 0 0 0 
10 0 0 89 1 1 0 0 0 
10 0 0 89 1 1 0 0 0 
10 0 0 89 1 1 0 0 0 
1 0 0 98 1 1 0 0 0 
1 0 0 98 1 1 0 0 0 
1 0 0 1 98 1 0 0 0 
4 0 0 93 3 1 0 0 0 
4 0 0 93 3 1 0 0 0 
4 0 0 93 3 1 0 0 0 
11 0 0 86 3 1 0 0 0 
11 0 0 86 3 1 0 0 0 
11 0 0 86 3 1 0 0 0 
5 0 0 92 3 1 0 0 0 
5 0 0 92 3 1 0 0 0 
5 0 0 92 3 1 0 0 0 
5 0 0 92 3 1 0 0 0 
5 0 0 92 3 1 0 0 0 
5 0 0 92 3 1 0 0 0 
5 0 0 92 3 1 0 0 0 
5 0 0 92 3 1 0 0 0 
5 0 0 92 3 1 0 0 0 
10 0 0 87 3 1 0 0 0 
10 0 0 87 3 1 0 0 0 
10 0 0 87 3 1 0 0 0 
1 0 0 96 3 1 0 0 0 
1 0 0 96 3 1 0 0 0 
1 0 0 96 3 1 0 0 0 
4 0 0 95 1 1 0 0 0 
4 0 0 95 1 1 0 0 0 
4 0 0 95 1 1 0 0 0 
11 0 0 88 1 1 0 0 0 
11 0 0 88 1 1 0 0 0 
11 0 0 88 1 1 0 0 0 
5 0 0 94 1 1 0 0 0 
5 0 0 94 1 1 0 0 0 
5 0 0 94 1 1 0 0 0 
5 0 0 94 1 1 0 0 0 
5 0 0 94 1 1 0 0 0 
5 0 0 94 1 1 0 0 0 
5 0 0 94 1 1 0 0 0 
5 0 0 94 1 1 0 0 0 
5 0 0 94 1 1 0 0 0 
10 0 0 89 1 1 0 0 0 
10 0 0 89 1 1 0 0 0 
10 0 0 89 1 1 0 0 0 
1 0 0 98 1 1 0 0 0 
1 0 0 98 1 1 0 0 0 
1 0 0 1 98 1 0 0 0 
4 0 0 95 1 1 0 0 0 
4 0 0 95 1 1 0 0 0 
11 0 0 88 1 1 0 0 0 
11 0 0 88 1 1 0 0 0 
5 0 0 94 1 1 0 0 0 
5 0 0 94 1 1 0 0 0 
5 0 0 94 1 1 0 0 0 
5 0 0 94 1 1 0 0 0 
5 0 0 94 1 1 0 0 0 
5 0 0 94 1 1 0 0 0 
10 0 0 89 1 1 0 0 0 
10 0 0 89 1 1 0 0 0 
1 0 0 98 1 1 0 0 0 
1 0 0 1 98 1 0 0 0 
1 0 0 17 68 15 0 0 0 
1 0 0 17 68 15 0 0 0 
2 0 0 16 66 15 0 0 2 
3 0 0 15 68 15 0 0 0 
4 0 0 95 1 1 0 0 0 
4 0 0 95 1 1 0 0 0 
11 0 0 88 1 1 0 0 0 
11 0 0 88 1 1 0 0 0 
5 0 0 94 1 1 0 0 0 
5 0 0 94 1 1 0 0 0 
5 0 0 94 1 1 0 0 0 
5 0 0 94 1 1 0 0 0 
5 0 0 94 1 1 0 0 0 
5 0 0 94 1 1 0 0 0 
10 0 0 89 1 1 0 0 0 
10 0 0 89 1 1 0 0 0 
1 0 0 98 1 1 0 0 0 
1 0 0 1 98 1 0 0 0 
4 0 0 93 3 1 0 0 0 
4 0 0 93 3 1 0 0 0 
11 0 0 86 3 1 0 0 0 
11 0 0 86 3 1 0 0 0 
5 0 0 92 3 1 0 0 0 
5 0 0 92 3 1 0 0 0 
5 0 0 92 3 1 0 0 0 
5 0 0 92 3 1 0 0 0 
5 0 0 92 3 1 0 0 0 
5 0 0 92 3 1 0 0 0 
10 0 0 87 3 1 0 0 0 
10 0 0 87 3 1 0 0 0 
1 0 0 96 3 1 0 0 0 
1 0 0 96 3 1 0 0 0 
4 0 0 93 3 1 0 0 0 
5 0 0 92 3 1 0 0 0 
10 0 0 87 3 1 0 0 0 
5 0 0 92 3 1 0 0 0 
5 0 0 92 3 1 0 0 0 
1 0 0 96 3 1 0 0 0 
11 0 0 86 3 1 0 0 0 
4 0 0 95 1 1 0 0 0 
4 0 0 95 1 1 0 0 0 
11 0 0 88 1 1 0 0 0 
11 0 0 88 1 1 0 0 0 
5 0 0 94 1 1 0 0 0 
5 0 0 94 1 1 0 0 0 
5 0 0 94 1 1 0 0 0 
5 0 0 94 1 1 0 0 0 
5 0 0 94 1 1 0 0 0 
5 0 0 94 1 1 0 0 0 
10 0 0 89 1 1 0 0 0 
10 0 0 89 1 1 0 0 0 
1 0 0 98 1 1 0 0 0 
1 0 0 1 98 1 0 0 0 
4 0 0 93 3 1 0 0 0 
4 0 0 93 3 1 0 0 0 
11 0 0 86 3 1 0 0 0 
11 0 0 86 3 1 0 0 0 
5 0 0 92 3 1 0 0 0 
5 0 0 92 3 1 0 0 0 
5 0 0 92 3 1 0 0 0 
5 0 0 92 3 1 0 0 0 
5 0 0 92 3 1 0 0 0 
5 0 0 92 3 1 0 0 0 
10 0 0 87 3 1 0 0 0 
10 0 0 87 3 1 0 0 0 
1 0 0 96 3 1 0 0 0 
1 0 0 96 3 1 0 0 0 
4 0 0 93 3 1 0 0 0 
5 0 0 92 3 1 0 0 0 
10 0 0 87 3 1 0 0 0 
5 0 0 92 3 1 0 0 0 
5 0 0 92 3 1 0 0 0 
1 0 0 96 3 1 0 0 0 
11 0 0 86 3 1 0 0 0 
4 0 0 95 1 1 0 0 0 
4 0 0 95 1 1 0 0 0 
11 0 0 88 1 1 0 0 0 
11 0 0 88 1 1 0 0 0 
5 0 0 94 1 1 0 0 0 
5 0 0 94 1 1 0 0 0 
5 0 0 94 1 1 0 0 0 
5 0 0 94 1 1 0 0 0 
5 0 0 94 1 1 0 0 0 
5 0 0 94 1 1 0 0 0 
10 0 0 89 1 1 0 0 0 
10 0 0 89 1 1 0 0 0 
1 0 0 98 1 1 0 0 0 
1 0 0 1 98 1 0 0 0 
4 0 0 93 3 1 0 0 0 
4 0 0 93 3 1 0 0 0 
11 0 0 86 3 1 0 0 0 
11 0 0 86 3 1 0 0 0 
5 0 0 92 3 1 0 0 0 
5 0 0 92 3 1 0 0 0 
5 0 0 92 3 1 0 0 0 
5 0 0 92 3 1 0 0 0 
5 0 0 92 3 1 0 0 0 
5 0 0 92 3 1 0 0 0 
10 0 0 87 3 1 0 0 0 
10 0 0 87 3 1 0 0 0 
1 0 0 96 3 1 0 0 0 
1 0 0 96 3 1 0 0 0 
4 0 0 93 3 1 0 0 0 
5 0 0 92 3 1 0 0 0 
10 0 0 87 3 1 0 0 0 
5 0 0 92 3 1 0 0 0 
5 0 0 92 3 1 0 0 0 
1 0 0 96 3 1 0 0 0 
11 0 0 86 3 1 0 0 0 
4 0 0 95 1 1 0 0 0 
4 0 0 95 1 1 0 0 0 
11 0 0 88 1 1 0 0 0 
11 0 0 88 1 1 0 0 0 
5 0 0 94 1 1 0 0 0 
5 0 0 94 1 1 0 0 0 
5 0 0 94 1 1 0 0 0 
5 0 0 94 1 1 0 0 0 
5 0 0 94 1 1 0 0 0 
5 0 0 94 1 1 0 0 0 
10 0 0 89 1 1 0 0 0 
10 0 0 89 1 1 0 0 0 
1 0 0 98 1 1 0 0 0 
1 0 0 1 98 1 0 0 0 
4 0 0 93 3 1 0 0 0 
4 0 0 93 3 1 0 0 0 
11 0 0 86 3 1 0 0 0 
11 0 0 86 3 1 0 0 0 
5 0 0 92 3 1 0 0 0 
5 0 0 92 3 1 0 0 0 
5 0 0 92 3 1 0 0 0 
5 0 0 92 3 1 0 0 0 
5 0 0 92 3 1 0 0 0 
5 0 0 92 3 1 0 0 0 
10 0 0 87 3 1 0 0 0 
10 0 0 87 3 1 0 0 0 
1 0 0 96 3 1 0 0 0 
1 0 0 96 3 1 0 0 0 
4 0 0 93 3 1 0 0 0 
5 0 0 92 3 1 0 0 0 
10 0 0 87 3 1 0 0 0 
5 0 0 92 3 1 0 0 0 
5 0 0 92 3 1 0 0 0 
1 0 0 96 3 1 0 0 0 
11 0 0 86 3 1 0 0 0 
4 0 0 95 1 1 0 0 0 
4 0 0 95 1 1 0 0 0 
11 0 0 88 1 1 0 0 0 
11 0 0 88 1 1 0 0 0 
5 0 0 94 1 1 0 0 0 
5 0 0 94 1 1 0 0 0 
5 0 0 94 1 1 0 0 0 
5 0 0 94 1 1 0 0 0 
5 0 0 94 1 1 0 0 0 
5 0 0 94 1 1 0 0 0 
10 0 0 89 1 1 0 0 0 
10 0 0 89 1 1 0 0 0 
1 0 0 98 1 1 0 0 0 
1 0 0 1 98 1 0 0 0 
4 0 0 93 3 1 0 0 0 
4 0 0 93 3 1 0 0 0 
11 0 0 86 3 1 0 0 0 
11 0 0 86 3 1 0 0 0 
5 0 0 92 3 1 0 0 0 
5 0 0 92 3 1 0 0 0 
5 0 0 92 3 1 0 0 0 
5 0 0 92 3 1 0 0 0 
5 0 0 92 3 1 0 0 0 
5 0 0 92 3 1 0 0 0 
10 0 0 87 3 1 0 0 0 
10 0 0 87 3 1 0 0 0 
1 0 0 96 3 1 0 0 0 
1 0 0 96 3 1 0 0 0 
4 0 0 93 3 1 0 0 0 
5 0 0 92 3 1 0 0 0 
10 0 0 87 3 1 0 0 0 
5 0 0 92 3 1 0 0 0 
5 0 0 92 3 1 0 0 0 
1 0 0 96 3 1 0 0 0 
11 0 0 86 3 1 0 0 0 
4 0 0 95 1 1 0 0 0 
4 0 0 95 1 1 0 0 0 
11 0 0 88 1 1 0 0 0 
11 0 0 88 1 1 0 0 0 
5 0 0 94 1 1 0 0 0 
5 0 0 94 1 1 0 0 0 
5 0 0 94 1 1 0 0 0 
5 0 0 94 1 1 0 0 0 
5 0 0 94 1 1 0 0 0 
5 0 0 94 1 1 0 0 0 
10 0 0 89 1 1 0 0 0 
10 0 0 89 1 1 0 0 0 
1 0 0 98 1 1 0 0 0 
1 0 0 1 98 1 0 0 0 
4 0 0 93 3 1 0 0 0 
4 0 0 93 3 1 0 0 0 
11 0 0 86 3 1 0 0 0 
11 0 0 86 3 1 0 0 0 
5 0 0 92 3 1 0 0 0 
5 0 0 92 3 1 0 0 0 
5 0 0 92 3 1 0 0 0 
5 0 0 92 3 1 0 0 0 
5 0 0 92 3 1 0 0 0 
5 0 0 92 3 1 0 0 0 
10 0 0 87 3 1 0 0 0 
10 0 0 87 3 1 0 0 0 
1 0 0 96 3 1 0 0 0 
1 0 0 96 3 1 0 0 0 
4 0 0 93 3 1 0 0 0 
5 0 0 92 3 1 0 0 0 
10 0 0 87 3 1 0 0 0 
5 0 0 92 3 1 0 0 0 
5 0 0 92 3 1 0 0 0 
1 0 0 96 3 1 0 0 0 
11 0 0 86 3 1 0 0 0 
4 0 0 95 1 1 0 0 0 
4 0 0 95 1 1 0 0 0 
11 0 0 88 1 1 0 0 0 
11 0 0 88 1 1 0 0 0 
5 0 0 94 1 1 0 0 0 
5 0 0 94 1 1 0 0 0 
5 0 0 94 1 1 0 0 0 
5 0 0 94 1 1 0 0 0 
5 0 0 94 1 1 0 0 0 
5 0 0 94 1 1 0 0 0 
10 0 0 89 1 1 0 0 0 
10 0 0 89 1 1 0 0 0 
1 0 0 98 1 1 0 0 0 
1 0 0 1 98 1 0 0 0 
5 0 0 63 18 15 0 0 0 
5 0 0 63 18 15 0 0 0 
5 0 0 63 18 15 0 0 0 
5 0 0 63 18 15 0 0 0 
5 0 0 63 18 15 0 0 0 
5 0 0 63 18 15 0 0 0 
5 0 0 63 18 15 0 0 0 
5 0 0 63 18 15 0 0 0 
5 0 0 63 18 15 0 0 0 
5 0 0 63 18 15 0 0 0 
5 0 0 63 18 15 0 0 0 
5 0 0 63 18 15 0 0 0 
5 0 0 63 18 15 0 0 0 
5 0 0 63 18 15 0 0 0 
5 0 0 63 18 15 0 0 0 
5 0 0 63 18 15 0 0 0 
5 0 0 63 18 15 0 0 0 
5 0 0 63 18 15 0 0 0 
4 0 0 93 3 1 0 0 0 
4 0 0 93 3 1 0 0 0 
11 0 0 86 3 1 0 0 0 
11 0 0 86 3 1 0 0 0 
5 0 0 92 3 1 0 0 0 
5 0 0 92 3 1 0 0 0 
5 0 0 92 3 1 0 0 0 
5 0 0 92 3 1 0 0 0 
5 0 0 92 3 1 0 0 0 
5 0 0 92 3 1 0 0 0 
10 0 0 87 3 1 0 0 0 
10 0 0 87 3 1 0 0 0 
1 0 0 96 3 1 0 0 0 
1 0 0 96 3 1 0 0 0 
4 0 0 93 3 1 0 0 0 
5 0 0 92 3 1 0 0 0 
10 0 0 87 3 1 0 0 0 
5 0 0 92 3 1 0 0 0 
5 0 0 92 3 1 0 0 0 
1 0 0 96 3 1 0 0 0 
11 0 0 86 3 1 0 0 0 
4 0 0 95 1 1 0 0 0 
4 0 0 95 1 1 0 0 0 
11 0 0 88 1 1 0 0 0 
11 0 0 88 1 1 0 0 0 
5 0 0 94 1 1 0 0 0 
5 0 0 94 1 1 0 0 0 
5 0 0 94 1 1 0 0 0 
5 0 0 94 1 1 0 0 0 
5 0 0 94 1 1 0 0 0 
5 0 0 94 1 1 0 0 0 
10 0 0 89 1 1 0 0 0 
10 0 0 89 1 1 0 0 0 
1 0 0 98 1 1 0 0 0 
1 0 0 1 98 1 0 0 0 
4 0 0 93 3 1 0 0 0 
4 0 0 93 3 1 0 0 0 
11 0 0 86 3 1 0 0 0 
11 0 0 86 3 1 0 0 0 
5 0 0 92 3 1 0 0 0 
5 0 0 92 3 1 0 0 0 
5 0 0 92 3 1 0 0 0 
5 0 0 92 3 1 0 0 0 
5 0 0 92 3 1 0 0 0 
5 0 0 92 3 1 0 0 0 
10 0 0 87 3 1 0 0 0 
10 0 0 87 3 1 0 0 0 
1 0 0 96 3 1 0 0 0 
1 0 0 96 3 1 0 0 0 
4 0 0 93 3 1 0 0 0 
5 0 0 92 3 1 0 0 0 
10 0 0 87 3 1 0 0 0 
5 0 0 92 3 1 0 0 0 
5 0 0 92 3 1 0 0 0 
1 0 0 96 3 1 0 0 0 
11 0 0 86 3 1 0 0 0 
4 0 0 95 1 1 0 0 0 
4 0 0 95 1 1 0 0 0 
11 0 0 88 1 1 0 0 0 
11 0 0 88 1 1 0 0 0 
5 0 0 94 1 1 0 0 0 
5 0 0 94 1 1 0 0 0 
5 0 0 94 1 1 0 0 0 
5 0 0 94 1 1 0 0 0 
5 0 0 94 1 1 0 0 0 
5 0 0 94 1 1 0 0 0 
10 0 0 89 1 1 0 0 0 
10 0 0 89 1 1 0 0 0 
1 0 0 98 1 1 0 0 0 
1 0 0 1 98 1 0 0 0 
4 0 0 93 3 1 0 0 0 
4 0 0 93 3 1 0 0 0 
11 0 0 86 3 1 0 0 0 
11 0 0 86 3 1 0 0 0 
5 0 0 92 3 1 0 0 0 
5 0 0 92 3 1 0 0 0 
5 0 0 92 3 1 0 0 0 
5 0 0 92 3 1 0 0 0 
5 0 0 92 3 1 0 0 0 
5 0 0 92 3 1 0 0 0 
10 0 0 87 3 1 0 0 0 
10 0 0 87 3 1 0 0 0 
1 0 0 96 3 1 0 0 0 
1 0 0 96 3 1 0 0 0 
4 0 0 93 3 1 0 0 0 
5 0 0 92 3 1 0 0 0 
10 0 0 87 3 1 0 0 0 
5 0 0 92 3 1 0 0 0 
5 0 0 92 3 1 0 0 0 
1 0 0 96 3 1 0 0 0 
11 0 0 86 3 1 0 0 0 
4 0 0 95 1 1 0 0 0 
4 0 0 95 1 1 0 0 0 
11 0 0 88 1 1 0 0 0 
11 0 0 88 1 1 0 0 0 
5 0 0 94 1 1 0 0 0 
5 0 0 94 1 1 0 0 0 
5 0 0 94 1 1 0 0 0 
5 0 0 94 1 1 0 0 0 
5 0 0 94 1 1 0 0 0 
5 0 0 94 1 1 0 0 0 
10 0 0 89 1 1 0 0 0 
10 0 0 89 1 1 0 0 0 
1 0 0 98 1 1 0 0 0 
1 0 0 1 98 1 0 0 0 
4 0 0 93 3 1 0 0 0 
4 0 0 93 3 1 0 0 0 
11 0 0 86 3 1 0 0 0 
11 0 0 86 3 1 0 0 0 
5 0 0 92 3 1 0 0 0 
5 0 0 92 3 1 0 0 0 
5 0 0 92 3 1 0 0 0 
5 0 0 92 3 1 0 0 0 
5 0 0 92 3 1 0 0 0 
5 0 0 92 3 1 0 0 0 
10 0 0 87 3 1 0 0 0 
10 0 0 87 3 1 0 0 0 
1 0 0 96 3 1 0 0 0 
1 0 0 96 3 1 0 0 0 
4 0 0 93 3 1 0 0 0 
5 0 0 92 3 1 0 0 0 
10 0 0 87 3 1 0 0 0 
5 0 0 92 3 1 0 0 0 
5 0 0 92 3 1 0 0 0 
1 0 0 96 3 1 0 0 0 
11 0 0 86 3 1 0 0 0 
4 0 0 95 1 1 0 0 0 
4 0 0 95 1 1 0 0 0 
11 0 0 88 1 1 0 0 0 
11 0 0 88 1 1 0 0 0 
5 0 0 94 1 1 0 0 0 
5 0 0 94 1 1 0 0 0 
5 0 0 94 1 1 0 0 0 
5 0 0 94 1 1 0 0 0 
5 0 0 94 1 1 0 0 0 
5 0 0 94 1 1 0 0 0 
10 0 0 89 1 1 0 0 0 
10 0 0 89 1 1 0 0 0 
1 0 0 98 1 1 0 0 0 
1 0 0 1 98 1 0 0 0 
4 0 0 93 3 1 0 0 0 
4 0 0 93 3 1 0 0 0 
11 0 0 86 3 1 0 0 0 
11 0 0 86 3 1 0 0 0 
5 0 0 92 3 1 0 0 0 
5 0 0 92 3 1 0 0 0 
5 0 0 92 3 1 0 0 0 
5 0 0 92 3 1 0 0 0 
5 0 0 92 3 1 0 0 0 
5 0 0 92 3 1 0 0 0 
10 0 0 87 3 1 0 0 0 
10 0 0 87 3 1 0 0 0 
1 0 0 96 3 1 0 0 0 
1 0 0 96 3 1 0 0 0 
4 0 0 93 3 1 0 0 0 
5 0 0 92 3 1 0 0 0 
10 0 0 87 3 1 0 0 0 
5 0 0 92 3 1 0 0 0 
5 0 0 92 3 1 0 0 0 
1 0 0 96 3 1 0 0 0 
11 0 0 86 3 1 0 0 0 
4 0 0 93 3 1 0 0 0 
4 0 0 93 3 1 0 0 0 
11 0 0 86 3 1 0 0 0 
11 0 0 86 3 1 0 0 0 
5 0 0 92 3 1 0 0 0 
5 0 0 92 3 1 0 0 0 
5 0 0 92 3 1 0 0 0 
5 0 0 92 3 1 0 0 0 
5 0 0 92 3 1 0 0 0 
5 0 0 92 3 1 0 0 0 
10 0 0 87 3 1 0 0 0 
10 0 0 87 3 1 0 0 0 
1 0 0 96 3 1 0 0 0 
1 0 0 96 3 1 0 0 0 
4 0 0 93 3 1 0 0 0 
5 0 0 92 3 1 0 0 0 
10 0 0 87 3 1 0 0 0 
5 0 0 92 3 1 0 0 0 
5 0 0 92 3 1 0 0 0 
1 0 0 96 3 1 0 0 0 
11 0 0 86 3 1 0 0 0 
4 0 0 95 1 1 0 0 0 
4 0 0 95 1 1 0 0 0 
11 0 0 88 1 1 0 0 0 
11 0 0 88 1 1 0 0 0 
5 0 0 94 1 1 0 0 0 
5 0 0 94 1 1 0 0 0 
5 0 0 94 1 1 0 0 0 
5 0 0 94 1 1 0 0 0 
5 0 0 94 1 1 0 0 0 
5 0 0 94 1 1 0 0 0 
10 0 0 89 1 1 0 0 0 
10 0 0 89 1 1 0 0 0 
1 0 0 98 1 1 0 0 0 
1 0 0 1 98 1 0 0 0 
4 0 0 93 3 1 0 0 0 
4 0 0 93 3 1 0 0 0 
11 0 0 86 3 1 0 0 0 
11 0 0 86 3 1 0 0 0 
5 0 0 92 3 1 0 0 0 
5 0 0 92 3 1 0 0 0 
5 0 0 92 3 1 0 0 0 
5 0 0 92 3 1 0 0 0 
5 0 0 92 3 1 0 0 0 
5 0 0 92 3 1 0 0 0 
10 0 0 87 3 1 0 0 0 
10 0 0 87 3 1 0 0 0 
1 0 0 96 3 1 0 0 0 
1 0 0 96 3 1 0 0 0 
4 0 0 93 3 1 0 0 0 
5 0 0 92 3 1 0 0 0 
10 0 0 87 3 1 0 0 0 
5 0 0 92 3 1 0 0 0 
5 0 0 92 3 1 0 0 0 
1 0 0 96 3 1 0 0 0 
11 0 0 86 3 1 0 0 0 
4 0 0 95 1 1 0 0 0 
4 0 0 95 1 1 0 0 0 
11 0 0 88 1 1 0 0 0 
11 0 0 88 1 1 0 0 0 
5 0 0 94 1 1 0 0 0 
5 0 0 94 1 1 0 0 0 
5 0 0 94 1 1 0 0 0 
5 0 0 94 1 1 0 0 0 
5 0 0 94 1 1 0 0 0 
5 0 0 94 1 1 0 0 0 
10 0 0 89 1 1 0 0 0 
10 0 0 89 1 1 0 0 0 
1 0 0 98 1 1 0 0 0 
1 0 0 1 98 1 0 0 0 
4 0 0 95 1 1 0 0 0 
11 0 0 88 1 1 0 0 0 
5 0 0 94 1 1 0 0 0 
5 0 0 94 1 1 0 0 0 
5 0 0 94 1 1 0 0 0 
10 0 0 89 1 1 0 0 0 
1 0 0 98 1 1 0 0 0 
5 0 0 94 1 1 0 0 0 
5 0 0 94 1 1 0 0 0 
10 0 0 89 1 1 0 0 0 
4 0 0 95 1 1 0 0 0 
5 0 0 94 1 1 0 0 0 
11 0 0 88 1 1 0 0 0 
5 0 0 94 1 1 0 0 0 
4 0 0 95 1 1 0 0 0 
10 0 0 89 1 1 0 0 0 
5 0 0 94 1 1 0 0 0 
5 0 0 94 1 1 0 0 0 
11 0 0 88 1 1 0 0 0 
1 0 0 1 98 1 0 0 0 
1 0 0 17 68 15 0 0 0 
2 0 0 16 66 15 0 0 2 
1 0 0 17 68 15 0 0 0 
3 0 0 15 68 15 0 0 0 
4 0 0 95 1 1 0 0 0 
11 0 0 88 1 1 0 0 0 
5 0 0 94 1 1 0 0 0 
5 0 0 94 1 1 0 0 0 
5 0 0 94 1 1 0 0 0 
10 0 0 89 1 1 0 0 0 
1 0 0 98 1 1 0 0 0 
5 0 0 94 1 1 0 0 0 
5 0 0 94 1 1 0 0 0 
10 0 0 89 1 1 0 0 0 
4 0 0 95 1 1 0 0 0 
5 0 0 94 1 1 0 0 0 
11 0 0 88 1 1 0 0 0 
5 0 0 94 1 1 0 0 0 
4 0 0 95 1 1 0 0 0 
10 0 0 89 1 1 0 0 0 
5 0 0 94 1 1 0 0 0 
5 0 0 94 1 1 0 0 0 
11 0 0 88 1 1 0 0 0 
1 0 0 1 98 1 0 0 0 
4 0 0 93 3 1 0 0 0 
11 0 0 86 3 1 0 0 0 
5 0 0 92 3 1 0 0 0 
5 0 0 92 3 1 0 0 0 
5 0 0 92 3 1 0 0 0 
10 0 0 87 3 1 0 0 0 
1 0 0 96 3 1 0 0 0 
1 0 0 96 3 1 0 0 0 
5 0 0 92 3 1 0 0 0 
5 0 0 92 3 1 0 0 0 
10 0 0 87 3 1 0 0 0 
4 0 0 93 3 1 0 0 0 
5 0 0 92 3 1 0 0 0 
1 0 0 96 3 1 0 0 0 
5 0 0 92 3 1 0 0 0 
4 0 0 93 3 1 0 0 0 
5 0 0 92 3 1 0 0 0 
5 0 0 92 3 1 0 0 0 
10 0 0 87 3 1 0 0 0 
11 0 0 86 3 1 0 0 0 
11 0 0 86 3 1 0 0 0 
4 0 0 95 1 1 0 0 0 
11 0 0 88 1 1 0 0 0 
5 0 0 94 1 1 0 0 0 
5 0 0 94 1 1 0 0 0 
5 0 0 94 1 1 0 0 0 
10 0 0 89 1 1 0 0 0 
1 0 0 98 1 1 0 0 0 
5 0 0 94 1 1 0 0 0 
5 0 0 94 1 1 0 0 0 
10 0 0 89 1 1 0 0 0 
4 0 0 95 1 1 0 0 0 
5 0 0 94 1 1 0 0 0 
11 0 0 88 1 1 0 0 0 
5 0 0 94 1 1 0 0 0 
4 0 0 95 1 1 0 0 0 
10 0 0 89 1 1 0 0 0 
5 0 0 94 1 1 0 0 0 
5 0 0 94 1 1 0 0 0 
11 0 0 88 1 1 0 0 0 
1 0 0 1 98 1 0 0 0 
4 0 0 93 3 1 0 0 0 
11 0 0 86 3 1 0 0 0 
5 0 0 92 3 1 0 0 0 
5 0 0 92 3 1 0 0 0 
5 0 0 92 3 1 0 0 0 
10 0 0 87 3 1 0 0 0 
1 0 0 96 3 1 0 0 0 
1 0 0 96 3 1 0 0 0 
5 0 0 92 3 1 0 0 0 
5 0 0 92 3 1 0 0 0 
10 0 0 87 3 1 0 0 0 
4 0 0 93 3 1 0 0 0 
5 0 0 92 3 1 0 0 0 
1 0 0 96 3 1 0 0 0 
5 0 0 92 3 1 0 0 0 
4 0 0 93 3 1 0 0 0 
5 0 0 92 3 1 0 0 0 
5 0 0 92 3 1 0 0 0 
10 0 0 87 3 1 0 0 0 
11 0 0 86 3 1 0 0 0 
11 0 0 86 3 1 0 0 0 
4 0 0 95 1 1 0 0 0 
11 0 0 88 1 1 0 0 0 
5 0 0 94 1 1 0 0 0 
5 0 0 94 1 1 0 0 0 
5 0 0 94 1 1 0 0 0 
10 0 0 89 1 1 0 0 0 
1 0 0 98 1 1 0 0 0 
5 0 0 94 1 1 0 0 0 
5 0 0 94 1 1 0 0 0 
10 0 0 89 1 1 0 0 0 
4 0 0 95 1 1 0 0 0 
5 0 0 94 1 1 0 0 0 
11 0 0 88 1 1 0 0 0 
5 0 0 94 1 1 0 0 0 
4 0 0 95 1 1 0 0 0 
10 0 0 89 1 1 0 0 0 
5 0 0 94 1 1 0 0 0 
5 0 0 94 1 1 0 0 0 
11 0 0 88 1 1 0 0 0 
1 0 0 1 98 1 0 0 0 
4 0 0 93 3 1 0 0 0 
11 0 0 86 3 1 0 0 0 
5 0 0 92 3 1 0 0 0 
5 0 0 92 3 1 0 0 0 
5 0 0 92 3 1 0 0 0 
10 0 0 87 3 1 0 0 0 
1 0 0 96 3 1 0 0 0 
1 0 0 96 3 1 0 0 0 
5 0 0 92 3 1 0 0 0 
5 0 0 92 3 1 0 0 0 
10 0 0 87 3 1 0 0 0 
4 0 0 93 3 1 0 0 0 
5 0 0 92 3 1 0 0 0 
1 0 0 96 3 1 0 0 0 
5 0 0 92 3 1 0 0 0 
4 0 0 93 3 1 0 0 0 
5 0 0 92 3 1 0 0 0 
5 0 0 92 3 1 0 0 0 
10 0 0 87 3 1 0 0 0 
11 0 0 86 3 1 0 0 0 
11 0 0 86 3 1 0 0 0 
4 0 0 95 1 1 0 0 0 
11 0 0 88 1 1 0 0 0 
5 0 0 94 1 1 0 0 0 
5 0 0 94 1 1 0 0 0 
5 0 0 94 1 1 0 0 0 
10 0 0 89 1 1 0 0 0 
1 0 0 98 1 1 0 0 0 
5 0 0 94 1 1 0 0 0 
5 0 0 94 1 1 0 0 0 
10 0 0 89 1 1 0 0 0 
4 0 0 95 1 1 0 0 0 
5 0 0 94 1 1 0 0 0 
11 0 0 88 1 1 0 0 0 
5 0 0 94 1 1 0 0 0 
4 0 0 95 1 1 0 0 0 
10 0 0 89 1 1 0 0 0 
5 0 0 94 1 1 0 0 0 
5 0 0 94 1 1 0 0 0 
11 0 0 88 1 1 0 0 0 
1 0 0 1 98 1 0 0 0 
4 0 0 93 3 1 0 0 0 
11 0 0 86 3 1 0 0 0 
5 0 0 92 3 1 0 0 0 
5 0 0 92 3 1 0 0 0 
5 0 0 92 3 1 0 0 0 
10 0 0 87 3 1 0 0 0 
1 0 0 96 3 1 0 0 0 
1 0 0 96 3 1 0 0 0 
5 0 0 92 3 1 0 0 0 
5 0 0 92 3 1 0 0 0 
10 0 0 87 3 1 0 0 0 
4 0 0 93 3 1 0 0 0 
5 0 0 92 3 1 0 0 0 
1 0 0 96 3 1 0 0 0 
5 0 0 92 3 1 0 0 0 
4 0 0 93 3 1 0 0 0 
5 0 0 92 3 1 0 0 0 
5 0 0 92 3 1 0 0 0 
10 0 0 87 3 1 0 0 0 
11 0 0 86 3 1 0 0 0 
11 0 0 86 3 1 0 0 0 
4 0 0 95 1 1 0 0 0 
11 0 0 88 1 1 0 0 0 
5 0 0 94 1 1 0 0 0 
5 0 0 94 1 1 0 0 0 
5 0 0 94 1 1 0 0 0 
10 0 0 89 1 1 0 0 0 
1 0 0 98 1 1 0 0 0 
5 0 0 94 1 1 0 0 0 
5 0 0 94 1 1 0 0 0 
10 0 0 89 1 1 0 0 0 
4 0 0 95 1 1 0 0 0 
5 0 0 94 1 1 0 0 0 
11 0 0 88 1 1 0 0 0 
5 0 0 94 1 1 0 0 0 
4 0 0 95 1 1 0 0 0 
10 0 0 89 1 1 0 0 0 
5 0 0 94 1 1 0 0 0 
5 0 0 94 1 1 0 0 0 
11 0 0 88 1 1 0 0 0 
1 0 0 1 98 1 0 0 0 
4 0 0 93 3 1 0 0 0 
11 0 0 86 3 1 0 0 0 
5 0 0 92 3 1 0 0 0 
5 0 0 92 3 1 0 0 0 
5 0 0 92 3 1 0 0 0 
10 0 0 87 3 1 0 0 0 
1 0 0 96 3 1 0 0 0 
1 0 0 96 3 1 0 0 0 
5 0 0 92 3 1 0 0 0 
5 0 0 92 3 1 0 0 0 
10 0 0 87 3 1 0 0 0 
4 0 0 93 3 1 0 0 0 
5 0 0 92 3 1 0 0 0 
1 0 0 96 3 1 0 0 0 
5 0 0 92 3 1 0 0 0 
4 0 0 93 3 1 0 0 0 
5 0 0 92 3 1 0 0 0 
5 0 0 92 3 1 0 0 0 
10 0 0 87 3 1 0 0 0 
11 0 0 86 3 1 0 0 0 
11 0 0 86 3 1 0 0 0 
4 0 0 95 1 1 0 0 0 
11 0 0 88 1 1 0 0 0 
5 0 0 94 1 1 0 0 0 
5 0 0 94 1 1 0 0 0 
5 0 0 94 1 1 0 0 0 
10 0 0 89 1 1 0 0 0 
1 0 0 98 1 1 0 0 0 
5 0 0 94 1 1 0 0 0 
5 0 0 94 1 1 0 0 0 
10 0 0 89 1 1 0 0 0 
4 0 0 95 1 1 0 0 0 
5 0 0 94 1 1 0 0 0 
11 0 0 88 1 1 0 0 0 
5 0 0 94 1 1 0 0 0 
4 0 0 95 1 1 0 0 0 
10 0 0 89 1 1 0 0 0 
5 0 0 94 1 1 0 0 0 
5 0 0 94 1 1 0 0 0 
11 0 0 88 1 1 0 0 0 
1 0 0 1 98 1 0 0 0 
4 0 0 93 3 1 0 0 0 
11 0 0 86 3 1 0 0 0 
5 0 0 92 3 1 0 0 0 
5 0 0 92 3 1 0 0 0 
5 0 0 92 3 1 0 0 0 
10 0 0 87 3 1 0 0 0 
1 0 0 96 3 1 0 0 0 
1 0 0 96 3 1 0 0 0 
5 0 0 92 3 1 0 0 0 
5 0 0 92 3 1 0 0 0 
10 0 0 87 3 1 0 0 0 
4 0 0 93 3 1 0 0 0 
5 0 0 92 3 1 0 0 0 
1 0 0 96 3 1 0 0 0 
5 0 0 92 3 1 0 0 0 
4 0 0 93 3 1 0 0 0 
5 0 0 92 3 1 0 0 0 
5 0 0 92 3 1 0 0 0 
10 0 0 87 3 1 0 0 0 
11 0 0 86 3 1 0 0 0 
11 0 0 86 3 1 0 0 0 
4 0 0 95 1 1 0 0 0 
11 0 0 88 1 1 0 0 0 
5 0 0 94 1 1 0 0 0 
5 0 0 94 1 1 0 0 0 
5 0 0 94 1 1 0 0 0 
10 0 0 89 1 1 0 0 0 
1 0 0 98 1 1 0 0 0 
5 0 0 94 1 1 0 0 0 
5 0 0 94 1 1 0 0 0 
10 0 0 89 1 1 0 0 0 
4 0 0 95 1 1 0 0 0 
5 0 0 94 1 1 0 0 0 
11 0 0 88 1 1 0 0 0 
5 0 0 94 1 1 0 0 0 
4 0 0 95 1 1 0 0 0 
10 0 0 89 1 1 0 0 0 
5 0 0 94 1 1 0 0 0 
5 0 0 94 1 1 0 0 0 
11 0 0 88 1 1 0 0 0 
1 0 0 1 98 1 0 0 0 
5 0 0 63 18 15 0 0 0 
5 0 0 63 18 15 0 0 0 
5 0 0 63 18 15 0 0 0 
5 0 0 63 18 15 0 0 0 
5 0 0 63 18 15 0 0 0 
5 0 0 63 18 15 0 0 0 
5 0 0 63 18 15 0 0 0 
5 0 0 63 18 15 0 0 0 
5 0 0 63 18 15 0 0 0 
5 0 0 63 18 15 0 0 0 
5 0 0 63 18 15 0 0 0 
5 0 0 63 18 15 0 0 0 
5 0 0 63 18 15 0 0 0 
5 0 0 63 18 15 0 0 0 
5 0 0 63 18 15 0 0 0 
5 0 0 63 18 15 0 0 0 
5 0 0 63 18 15 0 0 0 
5 0 0 63 18 15 0 0 0 
4 0 0 93 3 1 0 0 0 
11 0 0 86 3 1 0 0 0 
5 0 0 92 3 1 0 0 0 
5 0 0 92 3 1 0 0 0 
5 0 0 92 3 1 0 0 0 
10 0 0 87 3 1 0 0 0 
1 0 0 96 3 1 0 0 0 
1 0 0 96 3 1 0 0 0 
5 0 0 92 3 1 0 0 0 
5 0 0 92 3 1 0 0 0 
10 0 0 87 3 1 0 0 0 
4 0 0 93 3 1 0 0 0 
5 0 0 92 3 1 0 0 0 
1 0 0 96 3 1 0 0 0 
5 0 0 92 3 1 0 0 0 
4 0 0 93 3 1 0 0 0 
5 0 0 92 3 1 0 0 0 
5 0 0 92 3 1 0 0 0 
10 0 0 87 3 1 0 0 0 
11 0 0 86 3 1 0 0 0 
11 0 0 86 3 1 0 0 0 
4 0 0 95 1 1 0 0 0 
11 0 0 88 1 1 0 0 0 
5 0 0 94 1 1 0 0 0 
5 0 0 94 1 1 0 0 0 
5 0 0 94 1 1 0 0 0 
10 0 0 89 1 1 0 0 0 
1 0 0 98 1 1 0 0 0 
5 0 0 94 1 1 0 0 0 
5 0 0 94 1 1 0 0 0 
10 0 0 89 1 1 0 0 0 
4 0 0 95 1 1 0 0 0 
5 0 0 94 1 1 0 0 0 
11 0 0 88 1 1 0 0 0 
5 0 0 94 1 1 0 0 0 
4 0 0 95 1 1 0 0 0 
10 0 0 89 1 1 0 0 0 
5 0 0 94 1 1 0 0 0 
5 0 0 94 1 1 0 0 0 
11 0 0 88 1 1 0 0 0 
1 0 0 1 98 1 0 0 0 
4 0 0 93 3 1 0 0 0 
11 0 0 86 3 1 0 0 0 
5 0 0 92 3 1 0 0 0 
5 0 0 92 3 1 0 0 0 
5 0 0 92 3 1 0 0 0 
10 0 0 87 3 1 0 0 0 
1 0 0 96 3 1 0 0 0 
1 0 0 96 3 1 0 0 0 
5 0 0 92 3 1 0 0 0 
5 0 0 92 3 1 0 0 0 
10 0 0 87 3 1 0 0 0 
4 0 0 93 3 1 0 0 0 
5 0 0 92 3 1 0 0 0 
1 0 0 96 3 1 0 0 0 
5 0 0 92 3 1 0 0 0 
4 0 0 93 3 1 0 0 0 
5 0 0 92 3 1 0 0 0 
5 0 0 92 3 1 0 0 0 
10 0 0 87 3 1 0 0 0 
11 0 0 86 3 1 0 0 0 
11 0 0 86 3 1 0 0 0 
4 0 0 95 1 1 0 0 0 
11 0 0 88 1 1 0 0 0 
5 0 0 94 1 1 0 0 0 
5 0 0 94 1 1 0 0 0 
5 0 0 94 1 1 0 0 0 
10 0 0 89 1 1 0 0 0 
1 0 0 98 1 1 0 0 0 
5 0 0 94 1 1 0 0 0 
5 0 0 94 1 1 0 0 0 
10 0 0 89 1 1 0 0 0 
4 0 0 95 1 1 0 0 0 
5 0 0 94 1 1 0 0 0 
11 0 0 88 1 1 0 0 0 
5 0 0 94 1 1 0 0 0 
4 0 0 95 1 1 0 0 0 
10 0 0 89 1 1 0 0 0 
5 0 0 94 1 1 0 0 0 
5 0 0 94 1 1 0 0 0 
11 0 0 88 1 1 0 0 0 
1 0 0 1 98 1 0 0 0 
4 0 0 93 3 1 0 0 0 
11 0 0 86 3 1 0 0 0 
5 0 0 92 3 1 0 0 0 
5 0 0 92 3 1 0 0 0 
5 0 0 92 3 1 0 0 0 
10 0 0 87 3 1 0 0 0 
1 0 0 96 3 1 0 0 0 
1 0 0 96 3 1 0 0 0 
5 0 0 92 3 1 0 0 0 
5 0 0 92 3 1 0 0 0 
10 0 0 87 3 1 0 0 0 
4 0 0 93 3 1 0 0 0 
5 0 0 92 3 1 0 0 0 
1 0 0 96 3 1 0 0 0 
5 0 0 92 3 1 0 0 0 
4 0 0 93 3 1 0 0 0 
5 0 0 92 3 1 0 0 0 
5 0 0 92 3 1 0 0 0 
10 0 0 87 3 1 0 0 0 
11 0 0 86 3 1 0 0 0 
11 0 0 86 3 1 0 0 0 
4 0 0 95 1 1 0 0 0 
11 0 0 88 1 1 0 0 0 
5 0 0 94 1 1 0 0 0 
5 0 0 94 1 1 0 0 0 
5 0 0 94 1 1 0 0 0 
10 0 0 89 1 1 0 0 0 
1 0 0 98 1 1 0 0 0 
5 0 0 94 1 1 0 0 0 
5 0 0 94 1 1 0 0 0 
10 0 0 89 1 1 0 0 0 
4 0 0 95 1 1 0 0 0 
5 0 0 94 1 1 0 0 0 
11 0 0 88 1 1 0 0 0 
5 0 0 94 1 1 0 0 0 
4 0 0 95 1 1 0 0 0 
10 0 0 89 1 1 0 0 0 
5 0 0 94 1 1 0 0 0 
5 0 0 94 1 1 0 0 0 
11 0 0 88 1 1 0 0 0 
1 0 0 1 98 1 0 0 0 
4 0 0 93 3 1 0 0 0 
11 0 0 86 3 1 0 0 0 
5 0 0 92 3 1 0 0 0 
5 0 0 92 3 1 0 0 0 
5 0 0 92 3 1 0 0 0 
10 0 0 87 3 1 0 0 0 
1 0 0 96 3 1 0 0 0 
1 0 0 96 3 1 0 0 0 
5 0 0 92 3 1 0 0 0 
5 0 0 92 3 1 0 0 0 
10 0 0 87 3 1 0 0 0 
4 0 0 93 3 1 0 0 0 
5 0 0 92 3 1 0 0 0 
1 0 0 96 3 1 0 0 0 
5 0 0 92 3 1 0 0 0 
4 0 0 93 3 1 0 0 0 
5 0 0 92 3 1 0 0 0 
5 0 0 92 3 1 0 0 0 
10 0 0 87 3 1 0 0 0 
11 0 0 86 3 1 0 0 0 
11 0 0 86 3 1 0 0 0 
4 0 0 95 1 1 0 0 0 
11 0 0 88 1 1 0 0 0 
5 0 0 94 1 1 0 0 0 
5 0 0 94 1 1 0 0 0 
5 0 0 94 1 1 0 0 0 
10 0 0 89 1 1 0 0 0 
1 0 0 98 1 1 0 0 0 
5 0 0 94 1 1 0 0 0 
5 0 0 94 1 1 0 0 0 
10 0 0 89 1 1 0 0 0 
4 0 0 95 1 1 0 0 0 
5 0 0 94 1 1 0 0 0 
11 0 0 88 1 1 0 0 0 
5 0 0 94 1 1 0 0 0 
4 0 0 95 1 1 0 0 0 
10 0 0 89 1 1 0 0 0 
5 0 0 94 1 1 0 0 0 
5 0 0 94 1 1 0 0 0 
11 0 0 88 1 1 0 0 0 
1 0 0 1 98 1 0 0 0 
4 0 0 93 3 1 0 0 0 
11 0 0 86 3 1 0 0 0 
5 0 0 92 3 1 0 0 0 
5 0 0 92 3 1 0 0 0 
5 0 0 92 3 1 0 0 0 
10 0 0 87 3 1 0 0 0 
1 0 0 96 3 1 0 0 0 
1 0 0 96 3 1 0 0 0 
5 0 0 92 3 1 0 0 0 
5 0 0 92 3 1 0 0 0 
10 0 0 87 3 1 0 0 0 
4 0 0 93 3 1 0 0 0 
5 0 0 92 3 1 0 0 0 
1 0 0 96 3 1 0 0 0 
5 0 0 92 3 1 0 0 0 
4 0 0 93 3 1 0 0 0 
5 0 0 92 3 1 0 0 0 
5 0 0 92 3 1 0 0 0 
10 0 0 87 3 1 0 0 0 
11 0 0 86 3 1 0 0 0 
11 0 0 86 3 1 0 0 0 
4 0 0 93 3 1 0 0 0 
11 0 0 86 3 1 0 0 0 
5 0 0 92 3 1 0 0 0 
5 0 0 92 3 1 0 0 0 
5 0 0 92 3 1 0 0 0 
10 0 0 87 3 1 0 0 0 
1 0 0 96 3 1 0 0 0 
1 0 0 96 3 1 0 0 0 
5 0 0 92 3 1 0 0 0 
5 0 0 92 3 1 0 0 0 
10 0 0 87 3 1 0 0 0 
4 0 0 93 3 1 0 0 0 
5 0 0 92 3 1 0 0 0 
1 0 0 96 3 1 0 0 0 
5 0 0 92 3 1 0 0 0 
4 0 0 93 3 1 0 0 0 
5 0 0 92 3 1 0 0 0 
5 0 0 92 3 1 0 0 0 
10 0 0 87 3 1 0 0 0 
11 0 0 86 3 1 0 0 0 
11 0 0 86 3 1 0 0 0 
4 0 0 95 1 1 0 0 0 
11 0 0 88 1 1 0 0 0 
5 0 0 94 1 1 0 0 0 
5 0 0 94 1 1 0 0 0 
5 0 0 94 1 1 0 0 0 
10 0 0 89 1 1 0 0 0 
1 0 0 98 1 1 0 0 0 
5 0 0 94 1 1 0 0 0 
5 0 0 94 1 1 0 0 0 
10 0 0 89 1 1 0 0 0 
4 0 0 95 1 1 0 0 0 
5 0 0 94 1 1 0 0 0 
11 0 0 88 1 1 0 0 0 
5 0 0 94 1 1 0 0 0 
4 0 0 95 1 1 0 0 0 
10 0 0 89 1 1 0 0 0 
5 0 0 94 1 1 0 0 0 
5 0 0 94 1 1 0 0 0 
11 0 0 88 1 1 0 0 0 
1 0 0 1 98 1 0 0 0 
4 0 0 93 3 1 0 0 0 
11 0 0 86 3 1 0 0 0 
5 0 0 92 3 1 0 0 0 
5 0 0 92 3 1 0 0 0 
5 0 0 92 3 1 0 0 0 
10 0 0 87 3 1 0 0 0 
1 0 0 96 3 1 0 0 0 
1 0 0 96 3 1 0 0 0 
5 0 0 92 3 1 0 0 0 
5 0 0 92 3 1 0 0 0 
10 0 0 87 3 1 0 0 0 
4 0 0 93 3 1 0 0 0 
5 0 0 92 3 1 0 0 0 
1 0 0 96 3 1 0 0 0 
5 0 0 92 3 1 0 0 0 
4 0 0 93 3 1 0 0 0 
5 0 0 92 3 1 0 0 0 
5 0 0 92 3 1 0 0 0 
10 0 0 87 3 1 0 0 0 
11 0 0 86 3 1 0 0 0 
11 0 0 86 3 1 0 0 0 
4 0 0 95 1 1 0 0 0 
11 0 0 88 1 1 0 0 0 
5 0 0 94 1 1 0 0 0 
5 0 0 94 1 1 0 0 0 
5 0 0 94 1 1 0 0 0 
10 0 0 89 1 1 0 0 0 
1 0 0 98 1 1 0 0 0 
5 0 0 94 1 1 0 0 0 
5 0 0 94 1 1 0 0 0 
10 0 0 89 1 1 0 0 0 
4 0 0 95 1 1 0 0 0 
5 0 0 94 1 1 0 0 0 
11 0 0 88 1 1 0 0 0 
5 0 0 94 1 1 0 0 0 
4 0 0 95 1 1 0 0 0 
10 0 0 89 1 1 0 0 0 
5 0 0 94 1 1 0 0 0 
5 0 0 94 1 1 0 0 0 
11 0 0 88 1 1 0 0 0 
1 0 0 1 98 1 0 0 0 
4 0 0 95 1 1 0 0 0 
4 0 0 95 1 1 0 0 0 
4 0 0 95 1 1 0 0 0 
11 0 0 88 1 1 0 0 0 
11 0 0 88 1 1 0 0 0 
11 0 0 88 1 1 0 0 0 
5 0 0 94 1 1 0 0 0 
5 0 0 94 1 1 0 0 0 
5 0 0 94 1 1 0 0 0 
5 0 0 94 1 1 0 0 0 
5 0 0 94 1 1 0 0 0 
5 0 0 94 1 1 0 0 0 
5 0 0 94 1 1 0 0 0 
5 0 0 94 1 1 0 0 0 
5 0 0 94 1 1 0 0 0 
10 0 0 89 1 1 0 0 0 
10 0 0 89 1 1 0 0 0 
10 0 0 89 1 1 0 0 0 
1 0 0 98 1 1 0 0 0 
1 0 0 98 1 1 0 0 0 
1 0 0 1 98 1 0 0 0 
1 0 0 17 68 15 0 0 0 
1 0 0 17 68 15 0 0 0 
3 0 0 15 68 15 0 0 0 
2 0 0 16 66 15 0 0 2 
4 0 0 95 1 1 0 0 0 
4 0 0 95 1 1 0 0 0 
4 0 0 95 1 1 0 0 0 
11 0 0 88 1 1 0 0 0 
11 0 0 88 1 1 0 0 0 
11 0 0 88 1 1 0 0 0 
5 0 0 94 1 1 0 0 0 
5 0 0 94 1 1 0 0 0 
5 0 0 94 1 1 0 0 0 
5 0 0 94 1 1 0 0 0 
5 0 0 94 1 1 0 0 0 
5 0 0 94 1 1 0 0 0 
5 0 0 94 1 1 0 0 0 
5 0 0 94 1 1 0 0 0 
5 0 0 94 1 1 0 0 0 
10 0 0 89 1 1 0 0 0 
10 0 0 89 1 1 0 0 0 
10 0 0 89 1 1 0 0 0 
1 0 0 98 1 1 0 0 0 
1 0 0 98 1 1 0 0 0 
1 0 0 1 98 1 0 0 0 
4 0 0 93 3 1 0 0 0 
4 0 0 93 3 1 0 0 0 
4 0 0 93 3 1 0 0 0 
11 0 0 86 3 1 0 0 0 
11 0 0 86 3 1 0 0 0 
11 0 0 86 3 1 0 0 0 
5 0 0 92 3 1 0 0 0 
5 0 0 92 3 1 0 0 0 
5 0 0 92 3 1 0 0 0 
5 0 0 92 3 1 0 0 0 
5 0 0 92 3 1 0 0 0 
5 0 0 92 3 1 0 0 0 
5 0 0 92 3 1 0 0 0 
5 0 0 92 3 1 0 0 0 
5 0 0 92 3 1 0 0 0 
10 0 0 87 3 1 0 0 0 
10 0 0 87 3 1 0 0 0 
10 0 0 87 3 1 0 0 0 
1 0 0 96 3 1 0 0 0 
1 0 0 96 3 1 0 0 0 
1 0 0 96 3 1 0 0 0 
4 0 0 95 1 1 0 0 0 
4 0 0 95 1 1 0 0 0 
4 0 0 95 1 1 0 0 0 
11 0 0 88 1 1 0 0 0 
11 0 0 88 1 1 0 0 0 
11 0 0 88 1 1 0 0 0 
5 0 0 94 1 1 0 0 0 
5 0 0 94 1 1 0 0 0 
5 0 0 94 1 1 0 0 0 
5 0 0 94 1 1 0 0 0 
5 0 0 94 1 1 0 0 0 
5 0 0 94 1 1 0 0 0 
5 0 0 94 1 1 0 0 0 
5 0 0 94 1 1 0 0 0 
5 0 0 94 1 1 0 0 0 
10 0 0 89 1 1 0 0 0 
10 0 0 89 1 1 0 0 0 
10 0 0 89 1 1 0 0 0 
1 0 0 98 1 1 0 0 0 
1 0 0 98 1 1 0 0 0 
1 0 0 1 98 1 0 0 0 
4 0 0 93 3 1 0 0 0 
4 0 0 93 3 1 0 0 0 
4 0 0 93 3 1 0 0 0 
11 0 0 86 3 1 0 0 0 
11 0 0 86 3 1 0 0 0 
11 0 0 86 3 1 0 0 0 
5 0 0 92 3 1 0 0 0 
5 0 0 92 3 1 0 0 0 
5 0 0 92 3 1 0 0 0 
5 0 0 92 3 1 0 0 0 
5 0 0 92 3 1 0 0 0 
5 0 0 92 3 1 0 0 0 
5 0 0 92 3 1 0 0 0 
5 0 0 92 3 1 0 0 0 
5 0 0 92 3 1 0 0 0 
10 0 0 87 3 1 0 0 0 
10 0 0 87 3 1 0 0 0 
10 0 0 87 3 1 0 0 0 
1 0 0 96 3 1 0 0 0 
1 0 0 96 3 1 0 0 0 
1 0 0 96 3 1 0 0 0 
4 0 0 95 1 1 0 0 0 
4 0 0 95 1 1 0 0 0 
4 0 0 95 1 1 0 0 0 
11 0 0 88 1 1 0 0 0 
11 0 0 88 1 1 0 0 0 
11 0 0 88 1 1 0 0 0 
5 0 0 94 1 1 0 0 0 
5 0 0 94 1 1 0 0 0 
5 0 0 94 1 1 0 0 0 
5 0 0 94 1 1 0 0 0 
5 0 0 94 1 1 0 0 0 
5 0 0 94 1 1 0 0 0 
5 0 0 94 1 1 0 0 0 
5 0 0 94 1 1 0 0 0 
5 0 0 94 1 1 0 0 0 
10 0 0 89 1 1 0 0 0 
10 0 0 89 1 1 0 0 0 
10 0 0 89 1 1 0 0 0 
1 0 0 98 1 1 0 0 0 
1 0 0 98 1 1 0 0 0 
1 0 0 1 98 1 0 0 0 
4 0 0 93 3 1 0 0 0 
4 0 0 93 3 1 0 0 0 
4 0 0 93 3 1 0 0 0 
11 0 0 86 3 1 0 0 0 
11 0 0 86 3 1 0 0 0 
11 0 0 86 3 1 0 0 0 
5 0 0 92 3 1 0 0 0 
5 0 0 92 3 1 0 0 0 
5 0 0 92 3 1 0 0 0 
5 0 0 92 3 1 0 0 0 
5 0 0 92 3 1 0 0 0 
5 0 0 92 3 1 0 0 0 
5 0 0 92 3 1 0 0 0 
5 0 0 92 3 1 0 0 0 
5 0 0 92 3 1 0 0 0 
10 0 0 87 3 1 0 0 0 
10 0 0 87 3 1 0 0 0 
10 0 0 87 3 1 0 0 0 
1 0 0 96 3 1 0 0 0 
1 0 0 96 3 1 0 0 0 
1 0 0 96 3 1 0 0 0 
4 0 0 95 1 1 0 0 0 
4 0 0 95 1 1 0 0 0 
4 0 0 95 1 1 0 0 0 
11 0 0 88 1 1 0 0 0 
11 0 0 88 1 1 0 0 0 
11 0 0 88 1 1 0 0 0 
5 0 0 94 1 1 0 0 0 
5 0 0 94 1 1 0 0 0 
5 0 0 94 1 1 0 0 0 
5 0 0 94 1 1 0 0 0 
5 0 0 94 1 1 0 0 0 
5 0 0 94 1 1 0 0 0 
5 0 0 94 1 1 0 0 0 
5 0 0 94 1 1 0 0 0 
5 0 0 94 1 1 0 0 0 
10 0 0 89 1 1 0 0 0 
10 0 0 89 1 1 0 0 0 
10 0 0 89 1 1 0 0 0 
1 0 0 98 1 1 0 0 0 
1 0 0 98 1 1 0 0 0 
1 0 0 1 98 1 0 0 0 
4 0 0 93 3 1 0 0 0 
4 0 0 93 3 1 0 0 0 
4 0 0 93 3 1 0 0 0 
11 0 0 86 3 1 0 0 0 
11 0 0 86 3 1 0 0 0 
11 0 0 86 3 1 0 0 0 
5 0 0 92 3 1 0 0 0 
5 0 0 92 3 1 0 0 0 
5 0 0 92 3 1 0 0 0 
5 0 0 92 3 1 0 0 0 
5 0 0 92 3 1 0 0 0 
5 0 0 92 3 1 0 0 0 
5 0 0 92 3 1 0 0 0 
5 0 0 92 3 1 0 0 0 
5 0 0 92 3 1 0 0 0 
10 0 0 87 3 1 0 0 0 
10 0 0 87 3 1 0 0 0 
10 0 0 87 3 1 0 0 0 
1 0 0 96 3 1 0 0 0 
1 0 0 96 3 1 0 0 0 
1 0 0 96 3 1 0 0 0 
4 0 0 95 1 1 0 0 0 
4 0 0 95 1 1 0 0 0 
4 0 0 95 1 1 0 0 0 
11 0 0 88 1 1 0 0 0 
11 0 0 88 1 1 0 0 0 
11 0 0 88 1 1 0 0 0 
5 0 0 94 1 1 0 0 0 
5 0 0 94 1 1 0 0 0 
5 0 0 94 1 1 0 0 0 
5 0 0 94 1 1 0 0 0 
5 0 0 94 1 1 0 0 0 
5 0 0 94 1 1 0 0 0 
5 0 0 94 1 1 0 0 0 
5 0 0 94 1 1 0 0 0 
5 0 0 94 1 1 0 0 0 
10 0 0 89 1 1 0 0 0 
10 0 0 89 1 1 0 0 0 
10 0 0 89 1 1 0 0 0 
1 0 0 98 1 1 0 0 0 
1 0 0 98 1 1 0 0 0 
1 0 0 1 98 1 0 0 0 
4 0 0 93 3 1 0 0 0 
4 0 0 93 3 1 0 0 0 
4 0 0 93 3 1 0 0 0 
11 0 0 86 3 1 0 0 0 
11 0 0 86 3 1 0 0 0 
11 0 0 86 3 1 0 0 0 
5 0 0 92 3 1 0 0 0 
5 0 0 92 3 1 0 0 0 
5 0 0 92 3 1 0 0 0 
5 0 0 92 3 1 0 0 0 
5 0 0 92 3 1 0 0 0 
5 0 0 92 3 1 0 0 0 
5 0 0 92 3 1 0 0 0 
5 0 0 92 3 1 0 0 0 
5 0 0 92 3 1 0 0 0 
10 0 0 87 3 1 0 0 0 
10 0 0 87 3 1 0 0 0 
10 0 0 87 3 1 0 0 0 
1 0 0 96 3 1 0 0 0 
1 0 0 96 3 1 0 0 0 
1 0 0 96 3 1 0 0 0 
4 0 0 95 1 1 0 0 0 
4 0 0 95 1 1 0 0 0 
4 0 0 95 1 1 0 0 0 
11 0 0 88 1 1 0 0 0 
11 0 0 88 1 1 0 0 0 
11 0 0 88 1 1 0 0 0 
5 0 0 94 1 1 0 0 0 
5 0 0 94 1 1 0 0 0 
5 0 0 94 1 1 0 0 0 
5 0 0 94 1 1 0 0 0 
5 0 0 94 1 1 0 0 0 
5 0 0 94 1 1 0 0 0 
5 0 0 94 1 1 0 0 0 
5 0 0 94 1 1 0 0 0 
5 0 0 94 1 1 0 0 0 
10 0 0 89 1 1 0 0 0 
10 0 0 89 1 1 0 0 0 
10 0 0 89 1 1 0 0 0 
1 0 0 98 1 1 0 0 0 
1 0 0 98 1 1 0 0 0 
1 0 0 1 98 1 0 0 0 
4 0 0 93 3 1 0 0 0 
4 0 0 93 3 1 0 0 0 
4 0 0 93 3 1 0 0 0 
11 0 0 86 3 1 0 0 0 
11 0 0 86 3 1 0 0 0 
11 0 0 86 3 1 0 0 0 
5 0 0 92 3 1 0 0 0 
5 0 0 92 3 1 0 0 0 
5 0 0 92 3 1 0 0 0 
5 0 0 92 3 1 0 0 0 
5 0 0 92 3 1 0 0 0 
5 0 0 92 3 1 0 0 0 
5 0 0 92 3 1 0 0 0 
5 0 0 92 3 1 0 0 0 
5 0 0 92 3 1 0 0 0 
10 0 0 87 3 1 0 0 0 
10 0 0 87 3 1 0 0 0 
10 0 0 87 3 1 0 0 0 
1 0 0 96 3 1 0 0 0 
1 0 0 96 3 1 0 0 0 
1 0 0 96 3 1 0 0 0 
4 0 0 95 1 1 0 0 0 
4 0 0 95 1 1 0 0 0 
4 0 0 95 1 1 0 0 0 
11 0 0 88 1 1 0 0 0 
11 0 0 88 1 1 0 0 0 
11 0 0 88 1 1 0 0 0 
5 0 0 94 1 1 0 0 0 
5 0 0 94 1 1 0 0 0 
5 0 0 94 1 1 0 0 0 
5 0 0 94 1 1 0 0 0 
5 0 0 94 1 1 0 0 0 
5 0 0 94 1 1 0 0 0 
5 0 0 94 1 1 0 0 0 
5 0 0 94 1 1 0 0 0 
5 0 0 94 1 1 0 0 0 
10 0 0 89 1 1 0 0 0 
10 0 0 89 1 1 0 0 0 
10 0 0 89 1 1 0 0 0 
1 0 0 98 1 1 0 0 0 
1 0 0 98 1 1 0 0 0 
1 0 0 1 98 1 0 0 0 
5 0 0 63 18 15 0 0 0 
5 0 0 63 18 15 0 0 0 
5 0 0 63 18 15 0 0 0 
5 0 0 63 18 15 0 0 0 
5 0 0 63 18 15 0 0 0 
5 0 0 63 18 15 0 0 0 
5 0 0 63 18 15 0 0 0 
5 0 0 63 18 15 0 0 0 
5 0 0 63 18 15 0 0 0 
9 0 0 57 18 15 0 0 2 
9 0 0 59 18 15 0 0 0 
1 0 0 67 18 15 0 0 0 
5 0 0 63 18 15 0 0 0 
5 0 0 63 18 15 0 0 0 
5 0 0 63 18 15 0 0 0 
5 0 0 63 18 15 0 0 0 
5 0 0 63 18 15 0 0 0 
5 0 0 63 18 15 0 0 0 
5 0 0 63 18 15 0 0 0 
5 0 0 63 18 15 0 0 0 
5 0 0 63 18 15 0 0 0 
9 0 0 57 18 15 0 0 2 
9 0 0 59 18 15 0 0 0 
1 0 0 67 18 15 0 0 0 
4 0 0 93 3 1 0 0 0 
4 0 0 93 3 1 0 0 0 
4 0 0 93 3 1 0 0 0 
11 0 0 86 3 1 0 0 0 
11 0 0 86 3 1 0 0 0 
11 0 0 86 3 1 0 0 0 
5 0 0 92 3 1 0 0 0 
5 0 0 92 3 1 0 0 0 
5 0 0 92 3 1 0 0 0 
5 0 0 92 3 1 0 0 0 
5 0 0 92 3 1 0 0 0 
5 0 0 92 3 1 0 0 0 
5 0 0 92 3 1 0 0 0 
5 0 0 92 3 1 0 0 0 
5 0 0 92 3 1 0 0 0 
10 0 0 87 3 1 0 0 0 
10 0 0 87 3 1 0 0 0 
10 0 0 87 3 1 0 0 0 
1 0 0 96 3 1 0 0 0 
1 0 0 96 3 1 0 0 0 
1 0 0 96 3 1 0 0 0 
4 0 0 95 1 1 0 0 0 
4 0 0 95 1 1 0 0 0 
4 0 0 95 1 1 0 0 0 
11 0 0 88 1 1 0 0 0 
11 0 0 88 1 1 0 0 0 
11 0 0 88 1 1 0 0 0 
5 0 0 94 1 1 0 0 0 
5 0 0 94 1 1 0 0 0 
5 0 0 94 1 1 0 0 0 
5 0 0 94 1 1 0 0 0 
5 0 0 94 1 1 0 0 0 
5 0 0 94 1 1 0 0 0 
5 0 0 94 1 1 0 0 0 
5 0 0 94 1 1 0 0 0 
5 0 0 94 1 1 0 0 0 
10 0 0 89 1 1 0 0 0 
10 0 0 89 1 1 0 0 0 
10 0 0 89 1 1 0 0 0 
1 0 0 98 1 1 0 0 0 
1 0 0 98 1 1 0 0 0 
1 0 0 1 98 1 0 0 0 
4 0 0 93 3 1 0 0 0 
4 0 0 93 3 1 0 0 0 
4 0 0 93 3 1 0 0 0 
11 0 0 86 3 1 0 0 0 
11 0 0 86 3 1 0 0 0 
11 0 0 86 3 1 0 0 0 
5 0 0 92 3 1 0 0 0 
5 0 0 92 3 1 0 0 0 
5 0 0 92 3 1 0 0 0 
5 0 0 92 3 1 0 0 0 
5 0 0 92 3 1 0 0 0 
5 0 0 92 3 1 0 0 0 
5 0 0 92 3 1 0 0 0 
5 0 0 92 3 1 0 0 0 
5 0 0 92 3 1 0 0 0 
10 0 0 87 3 1 0 0 0 
10 0 0 87 3 1 0 0 0 
10 0 0 87 3 1 0 0 0 
1 0 0 96 3 1 0 0 0 
1 0 0 96 3 1 0 0 0 
1 0 0 96 3 1 0 0 0 
4 0 0 95 1 1 0 0 0 
4 0 0 95 1 1 0 0 0 
4 0 0 95 1 1 0 0 0 
11 0 0 88 1 1 0 0 0 
11 0 0 88 1 1 0 0 0 
11 0 0 88 1 1 0 0 0 
5 0 0 94 1 1 0 0 0 
5 0 0 94 1 1 0 0 0 
5 0 0 94 1 1 0 0 0 
5 0 0 94 1 1 0 0 0 
5 0 0 94 1 1 0 0 0 
5 0 0 94 1 1 0 0 0 
5 0 0 94 1 1 0 0 0 
5 0 0 94 1 1 0 0 0 
5 0 0 94 1 1 0 0 0 
10 0 0 89 1 1 0 0 0 
10 0 0 89 1 1 0 0 0 
10 0 0 89 1 1 0 0 0 
1 0 0 98 1 1 0 0 0 
1 0 0 98 1 1 0 0 0 
1 0 0 1 98 1 0 0 0 
4 0 0 93 3 1 0 0 0 
4 0 0 93 3 1 0 0 0 
4 0 0 93 3 1 0 0 0 
11 0 0 86 3 1 0 0 0 
11 0 0 86 3 1 0 0 0 
11 0 0 86 3 1 0 0 0 
5 0 0 92 3 1 0 0 0 
5 0 0 92 3 1 0 0 0 
5 0 0 92 3 1 0 0 0 
5 0 0 92 3 1 0 0 0 
5 0 0 92 3 1 0 0 0 
5 0 0 92 3 1 0 0 0 
5 0 0 92 3 1 0 0 0 
5 0 0 92 3 1 0 0 0 
5 0 0 92 3 1 0 0 0 
10 0 0 87 3 1 0 0 0 
10 0 0 87 3 1 0 0 0 
10 0 0 87 3 1 0 0 0 
1 0 0 96 3 1 0 0 0 
1 0 0 96 3 1 0 0 0 
1 0 0 96 3 1 0 0 0 
4 0 0 95 1 1 0 0 0 
4 0 0 95 1 1 0 0 0 
4 0 0 95 1 1 0 0 0 
11 0 0 88 1 1 0 0 0 
11 0 0 88 1 1 0 0 0 
11 0 0 88 1 1 0 0 0 
5 0 0 94 1 1 0 0 0 
5 0 0 94 1 1 0 0 0 
5 0 0 94 1 1 0 0 0 
5 0 0 94 1 1 0 0 0 
5 0 0 94 1 1 0 0 0 
5 0 0 94 1 1 0 0 0 
5 0 0 94 1 1 0 0 0 
5 0 0 94 1 1 0 0 0 
5 0 0 94 1 1 0 0 0 
10 0 0 89 1 1 0 0 0 
10 0 0 89 1 1 0 0 0 
10 0 0 89 1 1 0 0 0 
1 0 0 98 1 1 0 0 0 
1 0 0 98 1 1 0 0 0 
1 0 0 1 98 1 0 0 0 
4 0 0 93 3 1 0 0 0 
4 0 0 93 3 1 0 0 0 
4 0 0 93 3 1 0 0 0 
11 0 0 86 3 1 0 0 0 
11 0 0 86 3 1 0 0 0 
11 0 0 86 3 1 0 0 0 
5 0 0 92 3 1 0 0 0 
5 0 0 92 3 1 0 0 0 
5 0 0 92 3 1 0 0 0 
5 0 0 92 3 1 0 0 0 
5 0 0 92 3 1 0 0 0 
5 0 0 92 3 1 0 0 0 
5 0 0 92 3 1 0 0 0 
5 0 0 92 3 1 0 0 0 
5 0 0 92 3 1 0 0 0 
10 0 0 87 3 1 0 0 0 
10 0 0 87 3 1 0 0 0 
10 0 0 87 3 1 0 0 0 
1 0 0 96 3 1 0 0 0 
1 0 0 96 3 1 0 0 0 
1 0 0 96 3 1 0 0 0 
4 0 0 95 1 1 0 0 0 
4 0 0 95 1 1 0 0 0 
4 0 0 95 1 1 0 0 0 
11 0 0 88 1 1 0 0 0 
11 0 0 88 1 1 0 0 0 
11 0 0 88 1 1 0 0 0 
5 0 0 94 1 1 0 0 0 
5 0 0 94 1 1 0 0 0 
5 0 0 94 1 1 0 0 0 
5 0 0 94 1 1 0 0 0 
5 0 0 94 1 1 0 0 0 
5 0 0 94 1 1 0 0 0 
5 0 0 94 1 1 0 0 0 
5 0 0 94 1 1 0 0 0 
5 0 0 94 1 1 0 0 0 
10 0 0 89 1 1 0 0 0 
10 0 0 89 1 1 0 0 0 
10 0 0 89 1 1 0 0 0 
1 0 0 98 1 1 0 0 0 
1 0 0 98 1 1 0 0 0 
1 0 0 1 98 1 0 0 0 
4 0 0 93 3 1 0 0 0 
4 0 0 93 3 1 0 0 0 
4 0 0 93 3 1 0 0 0 
11 0 0 86 3 1 0 0 0 
11 0 0 86 3 1 0 0 0 
11 0 0 86 3 1 0 0 0 
5 0 0 92 3 1 0 0 0 
5 0 0 92 3 1 0 0 0 
5 0 0 92 3 1 0 0 0 
5 0 0 92 3 1 0 0 0 
5 0 0 92 3 1 0 0 0 
5 0 0 92 3 1 0 0 0 
5 0 0 92 3 1 0 0 0 
5 0 0 92 3 1 0 0 0 
5 0 0 92 3 1 0 0 0 
10 0 0 87 3 1 0 0 0 
10 0 0 87 3 1 0 0 0 
10 0 0 87 3 1 0 0 0 
1 0 0 96 3 1 0 0 0 
1 0 0 96 3 1 0 0 0 
1 0 0 96 3 1 0 0 0 
4 0 0 93 3 1 0 0 0 
4 0 0 93 3 1 0 0 0 
4 0 0 93 3 1 0 0 0 
11 0 0 86 3 1 0 0 0 
11 0 0 86 3 1 0 0 0 
11 0 0 86 3 1 0 0 0 
5 0 0 92 3 1 0 0 0 
5 0 0 92 3 1 0 0 0 
5 0 0 92 3 1 0 0 0 
5 0 0 92 3 1 0 0 0 
5 0 0 92 3 1 0 0 0 
5 0 0 92 3 1 0 0 0 
5 0 0 92 3 1 0 0 0 
5 0 0 92 3 1 0 0 0 
5 0 0 92 3 1 0 0 0 
10 0 0 87 3 1 0 0 0 
10 0 0 87 3 1 0 0 0 
10 0 0 87 3 1 0 0 0 
1 0 0 96 3 1 0 0 0 
1 0 0 96 3 1 0 0 0 
1 0 0 96 3 1 0 0 0 
4 0 0 95 1 1 0 0 0 
4 0 0 95 1 1 0 0 0 
4 0 0 95 1 1 0 0 0 
11 0 0 88 1 1 0 0 0 
11 0 0 88 1 1 0 0 0 
11 0 0 88 1 1 0 0 0 
5 0 0 94 1 1 0 0 0 
5 0 0 94 1 1 0 0 0 
5 0 0 94 1 1 0 0 0 
5 0 0 94 1 1 0 0 0 
5 0 0 94 1 1 0 0 0 
5 0 0 94 1 1 0 0 0 
5 0 0 94 1 1 0 0 0 
5 0 0 94 1 1 0 0 0 
5 0 0 94 1 1 0 0 0 
10 0 0 89 1 1 0 0 0 
10 0 0 89 1 1 0 0 0 
10 0 0 89 1 1 0 0 0 
1 0 0 98 1 1 0 0 0 
1 0 0 98 1 1 0 0 0 
1 0 0 1 98 1 0 0 0 
4 0 0 93 3 1 0 0 0 
4 0 0 93 3 1 0 0 0 
4 0 0 93 3 1 0 0 0 
11 0 0 86 3 1 0 0 0 
11 0 0 86 3 1 0 0 0 
11 0 0 86 3 1 0 0 0 
5 0 0 92 3 1 0 0 0 
5 0 0 92 3 1 0 0 0 
5 0 0 92 3 1 0 0 0 
5 0 0 92 3 1 0 0 0 
5 0 0 92 3 1 0 0 0 
5 0 0 92 3 1 0 0 0 
5 0 0 92 3 1 0 0 0 
5 0 0 92 3 1 0 0 0 
5 0 0 92 3 1 0 0 0 
10 0 0 87 3 1 0 0 0 
10 0 0 87 3 1 0 0 0 
10 0 0 87 3 1 0 0 0 
1 0 0 96 3 1 0 0 0 
1 0 0 96 3 1 0 0 0 
1 0 0 96 3 1 0 0 0 
4 0 0 95 1 1 0 0 0 
4 0 0 95 1 1 0 0 0 
4 0 0 95 1 1 0 0 0 
11 0 0 88 1 1 0 0 0 
11 0 0 88 1 1 0 0 0 
11 0 0 88 1 1 0 0 0 
5 0 0 94 1 1 0 0 0 
5 0 0 94 1 1 0 0 0 
5 0 0 94 1 1 0 0 0 
5 0 0 94 1 1 0 0 0 
5 0 0 94 1 1 0 0 0 
5 0 0 94 1 1 0 0 0 
5 0 0 94 1 1 0 0 0 
5 0 0 94 1 1 0 0 0 
5 0 0 94 1 1 0 0 0 
10 0 0 89 1 1 0 0 0 
10 0 0 89 1 1 0 0 0 
10 0 0 89 1 1 0 0 0 
1 0 0 98 1 1 0 0 0 
1 0 0 98 1 1 0 0 0 
1 0 0 1 98 1 0 0 0 
