{
  "id": "chill",
  "title": "Chill",
  "description": "The Chill system for FoundryVTT!",
  "version": "1.0.0",
  "compatibility": {
    "minimum": 10,
    "verified": "10.291",
    "maximum": 10
  },
  "authors": [{
    "name": "Tungs10"
  }],
  "esmodules": ["module/chill.mjs"],
  "styles": ["css/chill.css"],
  "scripts": [],
  "packs": [],
  "languages": [
    {
      "lang": "fr",
      "name": "Français",
      "path": "lang/fr.json"
    }
  ],
  "gridDistance": 1,
  "gridUnits": "m",
  "primaryTokenAttribute": "health",
  "secondaryTokenAttribute": "power",
  "url": "https://gitlab.com/morel.timothy/chill",
  "manifest": "",
  "download": "",
  "license": "LICENSE.txt",
  "changelog": "CHANGELOG.md"
}
