^C:\USERS\משתמש\DOCUMENTS\עקרונות למתקדמים סמסטר א שנה ב\שיעור 1\Q2_STACK\Q2_STACK\LINKEDLIST.CPP|C:\USERS\משתמש\DOCUMENTS\עקרונות למתקדמים סמסטר א שנה ב\שיעור 1\Q2_STACK\Q2_STACK\Q2_STACK.CPP|C:\USERS\משתמש\DOCUMENTS\עקרונות למתקדמים סמסטר א שנה ב\שיעור 1\Q2_STACK\Q2_STACK\STACK.CPP
C:\USERS\משתמש\DOCUMENTS\עקרונות למתקדמים סמסטר א שנה ב\שיעור 1\Q2_STACK\Q2_STACK\DEBUG\VC142.PDB
C:\USERS\משתמש\DOCUMENTS\עקרונות למתקדמים סמסטר א שנה ב\שיעור 1\Q2_STACK\Q2_STACK\DEBUG\VC142.IDB
C:\USERS\משתמש\DOCUMENTS\עקרונות למתקדמים סמסטר א שנה ב\שיעור 1\Q2_STACK\Q2_STACK\DEBUG\Q2_STACK.OBJ
C:\USERS\משתמש\DOCUMENTS\עקרונות למתקדמים סמסטר א שנה ב\שיעור 1\Q2_STACK\Q2_STACK\DEBUG\LINKEDLIST.OBJ
^C:\USERS\משתמש\DOCUMENTS\עקרונות למתקדמים סמסטר א שנה ב\שיעור 1\Q2_STACK\Q2_STACK\LINKEDLIST.CPP
C:\USERS\משתמש\DOCUMENTS\עקרונות למתקדמים סמסטר א שנה ב\שיעור 1\Q2_STACK\Q2_STACK\DEBUG\LINKEDLIST.OBJ
^C:\USERS\משתמש\DOCUMENTS\עקרונות למתקדמים סמסטר א שנה ב\שיעור 1\Q2_STACK\Q2_STACK\Q2_STACK.CPP|C:\USERS\משתמש\DOCUMENTS\עקרונות למתקדמים סמסטר א שנה ב\שיעור 1\Q2_STACK\Q2_STACK\STACK.CPP
C:\USERS\משתמש\DOCUMENTS\עקרונות למתקדמים סמסטר א שנה ב\שיעור 1\Q2_STACK\Q2_STACK\DEBUG\VC142.PDB
C:\USERS\משתמש\DOCUMENTS\עקרונות למתקדמים סמסטר א שנה ב\שיעור 1\Q2_STACK\Q2_STACK\DEBUG\VC142.IDB
C:\USERS\משתמש\DOCUMENTS\עקרונות למתקדמים סמסטר א שנה ב\שיעור 1\Q2_STACK\Q2_STACK\DEBUG\STACK.OBJ
C:\USERS\משתמש\DOCUMENTS\עקרונות למתקדמים סמסטר א שנה ב\שיעור 1\Q2_STACK\Q2_STACK\DEBUG\Q2_STACK.OBJ
^C:\USERS\משתמש\DOCUMENTS\עקרונות למתקדמים סמסטר א שנה ב\שיעור 1\Q2_STACK\Q2_STACK\STACK.CPP
C:\USERS\משתמש\DOCUMENTS\עקרונות למתקדמים סמסטר א שנה ב\שיעור 1\Q2_STACK\Q2_STACK\DEBUG\VC142.PDB
C:\USERS\משתמש\DOCUMENTS\עקרונות למתקדמים סמסטר א שנה ב\שיעור 1\Q2_STACK\Q2_STACK\DEBUG\VC142.IDB
C:\USERS\משתמש\DOCUMENTS\עקרונות למתקדמים סמסטר א שנה ב\שיעור 1\Q2_STACK\Q2_STACK\DEBUG\STACK.OBJ
^C:\USERS\משתמש\DOCUMENTS\עקרונות למתקדמים סמסטר א שנה ב\שיעור 1\Q2_STACK\Q2_STACK\Q2_STACK.CPP|C:\USERS\משתמש\DOCUMENTS\עקרונות למתקדמים סמסטר א שנה ב\שיעור 1\Q2_STACK\Q2_STACK\UTILS.CPP
C:\USERS\משתמש\DOCUMENTS\עקרונות למתקדמים סמסטר א שנה ב\שיעור 1\Q2_STACK\Q2_STACK\DEBUG\VC142.PDB
C:\USERS\משתמש\DOCUMENTS\עקרונות למתקדמים סמסטר א שנה ב\שיעור 1\Q2_STACK\Q2_STACK\DEBUG\VC142.IDB
C:\USERS\משתמש\DOCUMENTS\עקרונות למתקדמים סמסטר א שנה ב\שיעור 1\Q2_STACK\Q2_STACK\DEBUG\UTILS.OBJ
C:\USERS\משתמש\DOCUMENTS\עקרונות למתקדמים סמסטר א שנה ב\שיעור 1\Q2_STACK\Q2_STACK\DEBUG\Q2_STACK.OBJ
^C:\USERS\משתמש\DOCUMENTS\עקרונות למתקדמים סמסטר א שנה ב\שיעור 1\Q2_STACK\Q2_STACK\Q2_STACK.CPP
C:\USERS\משתמש\DOCUMENTS\עקרונות למתקדמים סמסטר א שנה ב\שיעור 1\Q2_STACK\Q2_STACK\DEBUG\VC142.PDB
^C:\USERS\משתמש\DOCUMENTS\עקרונות למתקדמים סמסטר א שנה ב\שיעור 1\Q2_STACK\Q2_STACK\UTILS.CPP
C:\USERS\משתמש\DOCUMENTS\עקרונות למתקדמים סמסטר א שנה ב\שיעור 1\Q2_STACK\Q2_STACK\DEBUG\VC142.PDB
