^C:\USERS\משתמש\DOCUMENTS\עקרונות למתקדמים סמסטר א שנה ב\שיעור 7\CHESS\CHESS2\CHESS_P\CHESS_P\DEBUG\BISHOP.OBJ|C:\USERS\משתמש\DOCUMENTS\עקרונות למתקדמים סמסטר א שנה ב\שיעור 7\CHESS\CHESS2\CHESS_P\CHESS_P\DEBUG\BOARD.OBJ|C:\USERS\משתמש\DOCUMENTS\עקרונות למתקדמים סמסטר א שנה ב\שיעור 7\CHESS\CHESS2\CHESS_P\CHESS_P\DEBUG\KING.OBJ|C:\USERS\משתמש\DOCUMENTS\עקרונות למתקדמים סמסטר א שנה ב\שיעור 7\CHESS\CHESS2\CHESS_P\CHESS_P\DEBUG\KNIGHT.OBJ|C:\USERS\משתמש\DOCUMENTS\עקרונות למתקדמים סמסטר א שנה ב\שיעור 7\CHESS\CHESS2\CHESS_P\CHESS_P\DEBUG\MAIN.OBJ|C:\USERS\משתמש\DOCUMENTS\עקרונות למתקדמים סמסטר א שנה ב\שיעור 7\CHESS\CHESS2\CHESS_P\CHESS_P\DEBUG\PAWN.OBJ|C:\USERS\משתמש\DOCUMENTS\עקרונות למתקדמים סמסטר א שנה ב\שיעור 7\CHESS\CHESS2\CHESS_P\CHESS_P\DEBUG\POINT.OBJ|C:\USERS\משתמש\DOCUMENTS\עקרונות למתקדמים סמסטר א שנה ב\שיעור 7\CHESS\CHESS2\CHESS_P\CHESS_P\DEBUG\QUEEN.OBJ|C:\USERS\משתמש\DOCUMENTS\עקרונות למתקדמים סמסטר א שנה ב\שיעור 7\CHESS\CHESS2\CHESS_P\CHESS_P\DEBUG\ROOK.OBJ|C:\USERS\משתמש\DOCUMENTS\עקרונות למתקדמים סמסטר א שנה ב\שיעור 7\CHESS\CHESS2\CHESS_P\CHESS_P\DEBUG\TROOP.OBJ
C:\USERS\משתמש\DOCUMENTS\עקרונות למתקדמים סמסטר א שנה ב\שיעור 7\CHESS\CHESS2\CHESS_P\DEBUG\CHESS_P.ILK
C:\USERS\משתמש\DOCUMENTS\עקרונות למתקדמים סמסטר א שנה ב\שיעור 7\CHESS\CHESS2\CHESS_P\DEBUG\CHESS_P.EXE
C:\USERS\משתמש\DOCUMENTS\עקרונות למתקדמים סמסטר א שנה ב\שיעור 7\CHESS\CHESS2\CHESS_P\DEBUG\CHESS_P.PDB
^C:\USERS\משתמש\DOCUMENTS\עקרונות למתקדמים סמסטר א שנה ב\שיעור 7\CHESS\CHESS_P\CHESS_P\DEBUG\BISHOP.OBJ|C:\USERS\משתמש\DOCUMENTS\עקרונות למתקדמים סמסטר א שנה ב\שיעור 7\CHESS\CHESS_P\CHESS_P\DEBUG\BOARD.OBJ|C:\USERS\משתמש\DOCUMENTS\עקרונות למתקדמים סמסטר א שנה ב\שיעור 7\CHESS\CHESS_P\CHESS_P\DEBUG\KING.OBJ|C:\USERS\משתמש\DOCUMENTS\עקרונות למתקדמים סמסטר א שנה ב\שיעור 7\CHESS\CHESS_P\CHESS_P\DEBUG\KNIGHT.OBJ|C:\USERS\משתמש\DOCUMENTS\עקרונות למתקדמים סמסטר א שנה ב\שיעור 7\CHESS\CHESS_P\CHESS_P\DEBUG\MAIN.OBJ|C:\USERS\משתמש\DOCUMENTS\עקרונות למתקדמים סמסטר א שנה ב\שיעור 7\CHESS\CHESS_P\CHESS_P\DEBUG\PAWN.OBJ|C:\USERS\משתמש\DOCUMENTS\עקרונות למתקדמים סמסטר א שנה ב\שיעור 7\CHESS\CHESS_P\CHESS_P\DEBUG\POINT.OBJ|C:\USERS\משתמש\DOCUMENTS\עקרונות למתקדמים סמסטר א שנה ב\שיעור 7\CHESS\CHESS_P\CHESS_P\DEBUG\QUEEN.OBJ|C:\USERS\משתמש\DOCUMENTS\עקרונות למתקדמים סמסטר א שנה ב\שיעור 7\CHESS\CHESS_P\CHESS_P\DEBUG\ROOK.OBJ|C:\USERS\משתמש\DOCUMENTS\עקרונות למתקדמים סמסטר א שנה ב\שיעור 7\CHESS\CHESS_P\CHESS_P\DEBUG\TROOP.OBJ
C:\USERS\משתמש\DOCUMENTS\עקרונות למתקדמים סמסטר א שנה ב\שיעור 7\CHESS\CHESS_P\DEBUG\CHESS_P.ILK
C:\USERS\משתמש\DOCUMENTS\עקרונות למתקדמים סמסטר א שנה ב\שיעור 7\CHESS\CHESS_P\DEBUG\CHESS_P.EXE
C:\USERS\משתמש\DOCUMENTS\עקרונות למתקדמים סמסטר א שנה ב\שיעור 7\CHESS\CHESS_P\DEBUG\CHESS_P.PDB
