^C:\USERS\משתמש\DOCUMENTS\עקרונות למתקדמים סמסטר א שנה ב\שיעור 7\CHESS\CHESS2\CHESS_P\CHESS_P\DEBUG\BISHOP.OBJ|C:\USERS\משתמש\DOCUMENTS\עקרונות למתקדמים סמסטר א שנה ב\שיעור 7\CHESS\CHESS2\CHESS_P\CHESS_P\DEBUG\BOARD.OBJ|C:\USERS\משתמש\DOCUMENTS\עקרונות למתקדמים סמסטר א שנה ב\שיעור 7\CHESS\CHESS2\CHESS_P\CHESS_P\DEBUG\KING.OBJ|C:\USERS\משתמש\DOCUMENTS\עקרונות למתקדמים סמסטר א שנה ב\שיעור 7\CHESS\CHESS2\CHESS_P\CHESS_P\DEBUG\KNIGHT.OBJ|C:\USERS\משתמש\DOCUMENTS\עקרונות למתקדמים סמסטר א שנה ב\שיעור 7\CHESS\CHESS2\CHESS_P\CHESS_P\DEBUG\MAIN.OBJ|C:\USERS\משתמש\DOCUMENTS\עקרונות למתקדמים סמסטר א שנה ב\שיעור 7\CHESS\CHESS2\CHESS_P\CHESS_P\DEBUG\PAWN.OBJ|C:\USERS\משתמש\DOCUMENTS\עקרונות למתקדמים סמסטר א שנה ב\שיעור 7\CHESS\CHESS2\CHESS_P\CHESS_P\DEBUG\POINT.OBJ|C:\USERS\משתמש\DOCUMENTS\עקרונות למתקדמים סמסטר א שנה ב\שיעור 7\CHESS\CHESS2\CHESS_P\CHESS_P\DEBUG\QUEEN.OBJ|C:\USERS\משתמש\DOCUMENTS\עקרונות למתקדמים סמסטר א שנה ב\שיעור 7\CHESS\CHESS2\CHESS_P\CHESS_P\DEBUG\ROOK.OBJ|C:\USERS\משתמש\DOCUMENTS\עקרונות למתקדמים סמסטר א שנה ב\שיעור 7\CHESS\CHESS2\CHESS_P\CHESS_P\DEBUG\TROOP.OBJ
/OUT:"C:\USERS\משתמש\DOCUMENTS\עקרונות למתקדמים סמסטר א שנה ב\שיעור 7\CHESS\CHESS2\CHESS_P\DEBUG\CHESS_P.EXE" /INCREMENTAL /NOLOGO KERNEL32.LIB USER32.LIB GDI32.LIB WINSPOOL.LIB COMDLG32.LIB ADVAPI32.LIB SHELL32.LIB OLE32.LIB OLEAUT32.LIB UUID.LIB ODBC32.LIB ODBCCP32.LIB /MANIFEST /MANIFESTUAC:"level='asInvoker' uiAccess='false'" /manifest:embed /DEBUG:FASTLINK /PDB:"C:\USERS\משתמש\DOCUMENTS\עקרונות למתקדמים סמסטר א שנה ב\שיעור 7\CHESS\CHESS2\CHESS_P\DEBUG\CHESS_P.PDB" /SUBSYSTEM:CONSOLE /TLBID:1 /DYNAMICBASE /NXCOMPAT /IMPLIB:"C:\USERS\משתמש\DOCUMENTS\עקרונות למתקדמים סמסטר א שנה ב\שיעור 7\CHESS\CHESS2\CHESS_P\DEBUG\CHESS_P.LIB" /MACHINE:X86 DEBUG\BISHOP.OBJDEBUG\BOARD.OBJDEBUG\KING.OBJDEBUG\KNIGHT.OBJDEBUG\MAIN.OBJDEBUG\PAWN.OBJDEBUG\POINT.OBJDEBUG\QUEEN.OBJDEBUG\ROOK.OBJDEBUG\TROOP.OBJ
^C:\USERS\משתמש\DOCUMENTS\עקרונות למתקדמים סמסטר א שנה ב\שיעור 7\CHESS\CHESS_P\CHESS_P\DEBUG\BISHOP.OBJ|C:\USERS\משתמש\DOCUMENTS\עקרונות למתקדמים סמסטר א שנה ב\שיעור 7\CHESS\CHESS_P\CHESS_P\DEBUG\BOARD.OBJ|C:\USERS\משתמש\DOCUMENTS\עקרונות למתקדמים סמסטר א שנה ב\שיעור 7\CHESS\CHESS_P\CHESS_P\DEBUG\KING.OBJ|C:\USERS\משתמש\DOCUMENTS\עקרונות למתקדמים סמסטר א שנה ב\שיעור 7\CHESS\CHESS_P\CHESS_P\DEBUG\KNIGHT.OBJ|C:\USERS\משתמש\DOCUMENTS\עקרונות למתקדמים סמסטר א שנה ב\שיעור 7\CHESS\CHESS_P\CHESS_P\DEBUG\MAIN.OBJ|C:\USERS\משתמש\DOCUMENTS\עקרונות למתקדמים סמסטר א שנה ב\שיעור 7\CHESS\CHESS_P\CHESS_P\DEBUG\PAWN.OBJ|C:\USERS\משתמש\DOCUMENTS\עקרונות למתקדמים סמסטר א שנה ב\שיעור 7\CHESS\CHESS_P\CHESS_P\DEBUG\POINT.OBJ|C:\USERS\משתמש\DOCUMENTS\עקרונות למתקדמים סמסטר א שנה ב\שיעור 7\CHESS\CHESS_P\CHESS_P\DEBUG\QUEEN.OBJ|C:\USERS\משתמש\DOCUMENTS\עקרונות למתקדמים סמסטר א שנה ב\שיעור 7\CHESS\CHESS_P\CHESS_P\DEBUG\ROOK.OBJ|C:\USERS\משתמש\DOCUMENTS\עקרונות למתקדמים סמסטר א שנה ב\שיעור 7\CHESS\CHESS_P\CHESS_P\DEBUG\TROOP.OBJ
/OUT:"C:\USERS\משתמש\DOCUMENTS\עקרונות למתקדמים סמסטר א שנה ב\שיעור 7\CHESS\CHESS_P\DEBUG\CHESS_P.EXE" /INCREMENTAL /NOLOGO KERNEL32.LIB USER32.LIB GDI32.LIB WINSPOOL.LIB COMDLG32.LIB ADVAPI32.LIB SHELL32.LIB OLE32.LIB OLEAUT32.LIB UUID.LIB ODBC32.LIB ODBCCP32.LIB /MANIFEST /MANIFESTUAC:"level='asInvoker' uiAccess='false'" /manifest:embed /DEBUG:FASTLINK /PDB:"C:\USERS\משתמש\DOCUMENTS\עקרונות למתקדמים סמסטר א שנה ב\שיעור 7\CHESS\CHESS_P\DEBUG\CHESS_P.PDB" /SUBSYSTEM:CONSOLE /TLBID:1 /DYNAMICBASE /NXCOMPAT /IMPLIB:"C:\USERS\משתמש\DOCUMENTS\עקרונות למתקדמים סמסטר א שנה ב\שיעור 7\CHESS\CHESS_P\DEBUG\CHESS_P.LIB" /MACHINE:X86 DEBUG\BISHOP.OBJDEBUG\BOARD.OBJDEBUG\KING.OBJDEBUG\KNIGHT.OBJDEBUG\MAIN.OBJDEBUG\PAWN.OBJDEBUG\POINT.OBJDEBUG\QUEEN.OBJDEBUG\ROOK.OBJDEBUG\TROOP.OBJ
