^C:\USERS\משתמש\DESKTOP\CHESS2\CHESS\BISHOP.CPP|C:\USERS\משתמש\DESKTOP\CHESS2\CHESS\BOARD.CPP|C:\USERS\משתמש\DESKTOP\CHESS2\CHESS\KING.CPP|C:\USERS\משתמש\DESKTOP\CHESS2\CHESS\KNIGHT.CPP|C:\USERS\משתמש\DESKTOP\CHESS2\CHESS\MAIN.CPP|C:\USERS\משתמש\DESKTOP\CHESS2\CHESS\PAWN.CPP|C:\USERS\משתמש\DESKTOP\CHESS2\CHESS\POINT.CPP|C:\USERS\משתמש\DESKTOP\CHESS2\CHESS\QUEEN.CPP|C:\USERS\משתמש\DESKTOP\CHESS2\CHESS\ROOK.CPP|C:\USERS\משתמש\DESKTOP\CHESS2\CHESS\TROOP.CPP
C:\USERS\משתמש\DESKTOP\CHESS2\CHESS_P\CHESS_P\X64\DEBUG\VC142.PDB
C:\USERS\משתמש\DESKTOP\CHESS2\CHESS_P\CHESS_P\X64\DEBUG\VC142.IDB
C:\USERS\משתמש\DESKTOP\CHESS2\CHESS_P\CHESS_P\X64\DEBUG\TROOP.OBJ
C:\USERS\משתמש\DESKTOP\CHESS2\CHESS_P\CHESS_P\X64\DEBUG\ROOK.OBJ
C:\USERS\משתמש\DESKTOP\CHESS2\CHESS_P\CHESS_P\X64\DEBUG\QUEEN.OBJ
C:\USERS\משתמש\DESKTOP\CHESS2\CHESS_P\CHESS_P\X64\DEBUG\POINT.OBJ
C:\USERS\משתמש\DESKTOP\CHESS2\CHESS_P\CHESS_P\X64\DEBUG\MAIN.OBJ
C:\USERS\משתמש\DESKTOP\CHESS2\CHESS_P\CHESS_P\X64\DEBUG\KNIGHT.OBJ
C:\USERS\משתמש\DESKTOP\CHESS2\CHESS_P\CHESS_P\X64\DEBUG\KING.OBJ
C:\USERS\משתמש\DESKTOP\CHESS2\CHESS_P\CHESS_P\X64\DEBUG\BOARD.OBJ
C:\USERS\משתמש\DESKTOP\CHESS2\CHESS_P\CHESS_P\X64\DEBUG\BISHOP.OBJ
^C:\USERS\משתמש\DESKTOP\CHESS2\CHESS\BISHOP.CPP
C:\USERS\משתמש\DESKTOP\CHESS2\CHESS_P\CHESS_P\X64\DEBUG\BISHOP.OBJ
^C:\USERS\משתמש\DESKTOP\CHESS2\CHESS\BOARD.CPP
C:\USERS\משתמש\DESKTOP\CHESS2\CHESS_P\CHESS_P\X64\DEBUG\BOARD.OBJ
^C:\USERS\משתמש\DESKTOP\CHESS2\CHESS\KING.CPP
C:\USERS\משתמש\DESKTOP\CHESS2\CHESS_P\CHESS_P\X64\DEBUG\KING.OBJ
^C:\USERS\משתמש\DESKTOP\CHESS2\CHESS\KNIGHT.CPP
C:\USERS\משתמש\DESKTOP\CHESS2\CHESS_P\CHESS_P\X64\DEBUG\KNIGHT.OBJ
^C:\USERS\משתמש\DESKTOP\CHESS2\CHESS\MAIN.CPP
C:\USERS\משתמש\DESKTOP\CHESS2\CHESS_P\CHESS_P\X64\DEBUG\MAIN.OBJ
^C:\USERS\משתמש\DESKTOP\CHESS2\CHESS\POINT.CPP
C:\USERS\משתמש\DESKTOP\CHESS2\CHESS_P\CHESS_P\X64\DEBUG\POINT.OBJ
^C:\USERS\משתמש\DESKTOP\CHESS2\CHESS\QUEEN.CPP
C:\USERS\משתמש\DESKTOP\CHESS2\CHESS_P\CHESS_P\X64\DEBUG\QUEEN.OBJ
^C:\USERS\משתמש\DESKTOP\CHESS2\CHESS\ROOK.CPP
C:\USERS\משתמש\DESKTOP\CHESS2\CHESS_P\CHESS_P\X64\DEBUG\ROOK.OBJ
^C:\USERS\משתמש\DESKTOP\CHESS2\CHESS\PAWN.CPP|C:\USERS\משתמש\DESKTOP\CHESS2\CHESS\TROOP.CPP
C:\USERS\משתמש\DESKTOP\CHESS2\CHESS_P\CHESS_P\X64\DEBUG\VC142.PDB
C:\USERS\משתמש\DESKTOP\CHESS2\CHESS_P\CHESS_P\X64\DEBUG\VC142.IDB
C:\USERS\משתמש\DESKTOP\CHESS2\CHESS_P\CHESS_P\X64\DEBUG\TROOP.OBJ
C:\USERS\משתמש\DESKTOP\CHESS2\CHESS_P\CHESS_P\X64\DEBUG\PAWN.OBJ
^C:\USERS\משתמש\DESKTOP\CHESS2\CHESS\PAWN.CPP
C:\USERS\משתמש\DESKTOP\CHESS2\CHESS_P\CHESS_P\X64\DEBUG\VC142.PDB
^C:\USERS\משתמש\DESKTOP\CHESS2\CHESS\TROOP.CPP
C:\USERS\משתמש\DESKTOP\CHESS2\CHESS_P\CHESS_P\X64\DEBUG\VC142.PDB
