^C:\USERS\משתמש\DOCUMENTS\עקרונות למתקדמים סמסטר א שנה ב\שיעור 7\CHESS\CHESS2\CHESS\BISHOP.CPP
/c /ZI /JMC /nologo /W3 /WX- /diagnostics:classic /sdl /Od /Oy- /D _MBCS /Gm- /EHsc /RTC1 /MDd /GS /fp:precise /permissive- /Zc:wchar_t /Zc:forScope /Zc:inline /Fo"DEBUG\\" /Fd"DEBUG\VC142.PDB" /Gd /TP /analyze- /FC C:\USERS\משתמש\DOCUMENTS\עקרונות למתקדמים סמסטר א שנה ב\שיעור 7\CHESS\CHESS2\CHESS\BISHOP.CPP
^C:\USERS\משתמש\DOCUMENTS\עקרונות למתקדמים סמסטר א שנה ב\שיעור 7\CHESS\CHESS2\CHESS\BOARD.CPP
/c /ZI /JMC /nologo /W3 /WX- /diagnostics:classic /sdl /Od /Oy- /D _MBCS /Gm- /EHsc /RTC1 /MDd /GS /fp:precise /permissive- /Zc:wchar_t /Zc:forScope /Zc:inline /Fo"DEBUG\\" /Fd"DEBUG\VC142.PDB" /Gd /TP /analyze- /FC C:\USERS\משתמש\DOCUMENTS\עקרונות למתקדמים סמסטר א שנה ב\שיעור 7\CHESS\CHESS2\CHESS\BOARD.CPP
^C:\USERS\משתמש\DOCUMENTS\עקרונות למתקדמים סמסטר א שנה ב\שיעור 7\CHESS\CHESS2\CHESS\KING.CPP
/c /ZI /JMC /nologo /W3 /WX- /diagnostics:classic /sdl /Od /Oy- /D _MBCS /Gm- /EHsc /RTC1 /MDd /GS /fp:precise /permissive- /Zc:wchar_t /Zc:forScope /Zc:inline /Fo"DEBUG\\" /Fd"DEBUG\VC142.PDB" /Gd /TP /analyze- /FC C:\USERS\משתמש\DOCUMENTS\עקרונות למתקדמים סמסטר א שנה ב\שיעור 7\CHESS\CHESS2\CHESS\KING.CPP
^C:\USERS\משתמש\DOCUMENTS\עקרונות למתקדמים סמסטר א שנה ב\שיעור 7\CHESS\CHESS2\CHESS\KNIGHT.CPP
/c /ZI /JMC /nologo /W3 /WX- /diagnostics:classic /sdl /Od /Oy- /D _MBCS /Gm- /EHsc /RTC1 /MDd /GS /fp:precise /permissive- /Zc:wchar_t /Zc:forScope /Zc:inline /Fo"DEBUG\\" /Fd"DEBUG\VC142.PDB" /Gd /TP /analyze- /FC C:\USERS\משתמש\DOCUMENTS\עקרונות למתקדמים סמסטר א שנה ב\שיעור 7\CHESS\CHESS2\CHESS\KNIGHT.CPP
^C:\USERS\משתמש\DOCUMENTS\עקרונות למתקדמים סמסטר א שנה ב\שיעור 7\CHESS\CHESS2\CHESS\MAIN.CPP
/c /ZI /JMC /nologo /W3 /WX- /diagnostics:classic /sdl /Od /Oy- /D _MBCS /Gm- /EHsc /RTC1 /MDd /GS /fp:precise /permissive- /Zc:wchar_t /Zc:forScope /Zc:inline /Fo"DEBUG\\" /Fd"DEBUG\VC142.PDB" /Gd /TP /analyze- /FC C:\USERS\משתמש\DOCUMENTS\עקרונות למתקדמים סמסטר א שנה ב\שיעור 7\CHESS\CHESS2\CHESS\MAIN.CPP
^C:\USERS\משתמש\DOCUMENTS\עקרונות למתקדמים סמסטר א שנה ב\שיעור 7\CHESS\CHESS2\CHESS\PAWN.CPP
/c /ZI /JMC /nologo /W3 /WX- /diagnostics:classic /sdl /Od /Oy- /D _MBCS /Gm- /EHsc /RTC1 /MDd /GS /fp:precise /permissive- /Zc:wchar_t /Zc:forScope /Zc:inline /Fo"DEBUG\\" /Fd"DEBUG\VC142.PDB" /Gd /TP /analyze- /FC C:\USERS\משתמש\DOCUMENTS\עקרונות למתקדמים סמסטר א שנה ב\שיעור 7\CHESS\CHESS2\CHESS\PAWN.CPP
^C:\USERS\משתמש\DOCUMENTS\עקרונות למתקדמים סמסטר א שנה ב\שיעור 7\CHESS\CHESS2\CHESS\POINT.CPP
/c /ZI /JMC /nologo /W3 /WX- /diagnostics:classic /sdl /Od /Oy- /D _MBCS /Gm- /EHsc /RTC1 /MDd /GS /fp:precise /permissive- /Zc:wchar_t /Zc:forScope /Zc:inline /Fo"DEBUG\\" /Fd"DEBUG\VC142.PDB" /Gd /TP /analyze- /FC C:\USERS\משתמש\DOCUMENTS\עקרונות למתקדמים סמסטר א שנה ב\שיעור 7\CHESS\CHESS2\CHESS\POINT.CPP
^C:\USERS\משתמש\DOCUMENTS\עקרונות למתקדמים סמסטר א שנה ב\שיעור 7\CHESS\CHESS2\CHESS\QUEEN.CPP
/c /ZI /JMC /nologo /W3 /WX- /diagnostics:classic /sdl /Od /Oy- /D _MBCS /Gm- /EHsc /RTC1 /MDd /GS /fp:precise /permissive- /Zc:wchar_t /Zc:forScope /Zc:inline /Fo"DEBUG\\" /Fd"DEBUG\VC142.PDB" /Gd /TP /analyze- /FC C:\USERS\משתמש\DOCUMENTS\עקרונות למתקדמים סמסטר א שנה ב\שיעור 7\CHESS\CHESS2\CHESS\QUEEN.CPP
^C:\USERS\משתמש\DOCUMENTS\עקרונות למתקדמים סמסטר א שנה ב\שיעור 7\CHESS\CHESS2\CHESS\ROOK.CPP
/c /ZI /JMC /nologo /W3 /WX- /diagnostics:classic /sdl /Od /Oy- /D _MBCS /Gm- /EHsc /RTC1 /MDd /GS /fp:precise /permissive- /Zc:wchar_t /Zc:forScope /Zc:inline /Fo"DEBUG\\" /Fd"DEBUG\VC142.PDB" /Gd /TP /analyze- /FC C:\USERS\משתמש\DOCUMENTS\עקרונות למתקדמים סמסטר א שנה ב\שיעור 7\CHESS\CHESS2\CHESS\ROOK.CPP
^C:\USERS\משתמש\DOCUMENTS\עקרונות למתקדמים סמסטר א שנה ב\שיעור 7\CHESS\CHESS2\CHESS\TROOP.CPP
/c /ZI /JMC /nologo /W3 /WX- /diagnostics:classic /sdl /Od /Oy- /D _MBCS /Gm- /EHsc /RTC1 /MDd /GS /fp:precise /permissive- /Zc:wchar_t /Zc:forScope /Zc:inline /Fo"DEBUG\\" /Fd"DEBUG\VC142.PDB" /Gd /TP /analyze- /FC C:\USERS\משתמש\DOCUMENTS\עקרונות למתקדמים סמסטר א שנה ב\שיעור 7\CHESS\CHESS2\CHESS\TROOP.CPP
^C:\USERS\משתמש\DOCUMENTS\עקרונות למתקדמים סמסטר א שנה ב\שיעור 7\CHESS\CHESS\BISHOP.CPP
/c /ZI /JMC /nologo /W3 /WX- /diagnostics:classic /sdl /Od /Oy- /D _MBCS /Gm- /EHsc /RTC1 /MDd /GS /fp:precise /permissive- /Zc:wchar_t /Zc:forScope /Zc:inline /Fo"DEBUG\\" /Fd"DEBUG\VC142.PDB" /Gd /TP /analyze- /FC C:\USERS\משתמש\DOCUMENTS\עקרונות למתקדמים סמסטר א שנה ב\שיעור 7\CHESS\CHESS\BISHOP.CPP
^C:\USERS\משתמש\DOCUMENTS\עקרונות למתקדמים סמסטר א שנה ב\שיעור 7\CHESS\CHESS\BOARD.CPP
/c /ZI /JMC /nologo /W3 /WX- /diagnostics:classic /sdl /Od /Oy- /D _MBCS /Gm- /EHsc /RTC1 /MDd /GS /fp:precise /permissive- /Zc:wchar_t /Zc:forScope /Zc:inline /Fo"DEBUG\\" /Fd"DEBUG\VC142.PDB" /Gd /TP /analyze- /FC C:\USERS\משתמש\DOCUMENTS\עקרונות למתקדמים סמסטר א שנה ב\שיעור 7\CHESS\CHESS\BOARD.CPP
^C:\USERS\משתמש\DOCUMENTS\עקרונות למתקדמים סמסטר א שנה ב\שיעור 7\CHESS\CHESS\KING.CPP
/c /ZI /JMC /nologo /W3 /WX- /diagnostics:classic /sdl /Od /Oy- /D _MBCS /Gm- /EHsc /RTC1 /MDd /GS /fp:precise /permissive- /Zc:wchar_t /Zc:forScope /Zc:inline /Fo"DEBUG\\" /Fd"DEBUG\VC142.PDB" /Gd /TP /analyze- /FC C:\USERS\משתמש\DOCUMENTS\עקרונות למתקדמים סמסטר א שנה ב\שיעור 7\CHESS\CHESS\KING.CPP
^C:\USERS\משתמש\DOCUMENTS\עקרונות למתקדמים סמסטר א שנה ב\שיעור 7\CHESS\CHESS\KNIGHT.CPP
/c /ZI /JMC /nologo /W3 /WX- /diagnostics:classic /sdl /Od /Oy- /D _MBCS /Gm- /EHsc /RTC1 /MDd /GS /fp:precise /permissive- /Zc:wchar_t /Zc:forScope /Zc:inline /Fo"DEBUG\\" /Fd"DEBUG\VC142.PDB" /Gd /TP /analyze- /FC C:\USERS\משתמש\DOCUMENTS\עקרונות למתקדמים סמסטר א שנה ב\שיעור 7\CHESS\CHESS\KNIGHT.CPP
^C:\USERS\משתמש\DOCUMENTS\עקרונות למתקדמים סמסטר א שנה ב\שיעור 7\CHESS\CHESS\MAIN.CPP
/c /ZI /JMC /nologo /W3 /WX- /diagnostics:classic /sdl /Od /Oy- /D _MBCS /Gm- /EHsc /RTC1 /MDd /GS /fp:precise /permissive- /Zc:wchar_t /Zc:forScope /Zc:inline /Fo"DEBUG\\" /Fd"DEBUG\VC142.PDB" /Gd /TP /analyze- /FC C:\USERS\משתמש\DOCUMENTS\עקרונות למתקדמים סמסטר א שנה ב\שיעור 7\CHESS\CHESS\MAIN.CPP
^C:\USERS\משתמש\DOCUMENTS\עקרונות למתקדמים סמסטר א שנה ב\שיעור 7\CHESS\CHESS\PAWN.CPP
/c /ZI /JMC /nologo /W3 /WX- /diagnostics:classic /sdl /Od /Oy- /D _MBCS /Gm- /EHsc /RTC1 /MDd /GS /fp:precise /permissive- /Zc:wchar_t /Zc:forScope /Zc:inline /Fo"DEBUG\\" /Fd"DEBUG\VC142.PDB" /Gd /TP /analyze- /FC C:\USERS\משתמש\DOCUMENTS\עקרונות למתקדמים סמסטר א שנה ב\שיעור 7\CHESS\CHESS\PAWN.CPP
^C:\USERS\משתמש\DOCUMENTS\עקרונות למתקדמים סמסטר א שנה ב\שיעור 7\CHESS\CHESS\POINT.CPP
/c /ZI /JMC /nologo /W3 /WX- /diagnostics:classic /sdl /Od /Oy- /D _MBCS /Gm- /EHsc /RTC1 /MDd /GS /fp:precise /permissive- /Zc:wchar_t /Zc:forScope /Zc:inline /Fo"DEBUG\\" /Fd"DEBUG\VC142.PDB" /Gd /TP /analyze- /FC C:\USERS\משתמש\DOCUMENTS\עקרונות למתקדמים סמסטר א שנה ב\שיעור 7\CHESS\CHESS\POINT.CPP
^C:\USERS\משתמש\DOCUMENTS\עקרונות למתקדמים סמסטר א שנה ב\שיעור 7\CHESS\CHESS\QUEEN.CPP
/c /ZI /JMC /nologo /W3 /WX- /diagnostics:classic /sdl /Od /Oy- /D _MBCS /Gm- /EHsc /RTC1 /MDd /GS /fp:precise /permissive- /Zc:wchar_t /Zc:forScope /Zc:inline /Fo"DEBUG\\" /Fd"DEBUG\VC142.PDB" /Gd /TP /analyze- /FC C:\USERS\משתמש\DOCUMENTS\עקרונות למתקדמים סמסטר א שנה ב\שיעור 7\CHESS\CHESS\QUEEN.CPP
^C:\USERS\משתמש\DOCUMENTS\עקרונות למתקדמים סמסטר א שנה ב\שיעור 7\CHESS\CHESS\ROOK.CPP
/c /ZI /JMC /nologo /W3 /WX- /diagnostics:classic /sdl /Od /Oy- /D _MBCS /Gm- /EHsc /RTC1 /MDd /GS /fp:precise /permissive- /Zc:wchar_t /Zc:forScope /Zc:inline /Fo"DEBUG\\" /Fd"DEBUG\VC142.PDB" /Gd /TP /analyze- /FC C:\USERS\משתמש\DOCUMENTS\עקרונות למתקדמים סמסטר א שנה ב\שיעור 7\CHESS\CHESS\ROOK.CPP
^C:\USERS\משתמש\DOCUMENTS\עקרונות למתקדמים סמסטר א שנה ב\שיעור 7\CHESS\CHESS\TROOP.CPP
/c /ZI /JMC /nologo /W3 /WX- /diagnostics:classic /sdl /Od /Oy- /D _MBCS /Gm- /EHsc /RTC1 /MDd /GS /fp:precise /permissive- /Zc:wchar_t /Zc:forScope /Zc:inline /Fo"DEBUG\\" /Fd"DEBUG\VC142.PDB" /Gd /TP /analyze- /FC C:\USERS\משתמש\DOCUMENTS\עקרונות למתקדמים סמסטר א שנה ב\שיעור 7\CHESS\CHESS\TROOP.CPP
