<?xml version="1.0" encoding="UTF-8"?>

<grit base_dir="." current_release="1" latest_public_release="0"
      output_all_resource_defines="false" enc_check="möl" source_lang_id="en">
  <outputs>
     <!-- For Platform app usage -->
    <output filename="${out_camera_app_dir}/_locales/am/messages.json" type="chrome_messages_json" lang="am"/>
    <output filename="${out_camera_app_dir}/_locales/ar/messages.json" type="chrome_messages_json" lang="ar"/>
    <output filename="${out_camera_app_dir}/_locales/bg/messages.json" type="chrome_messages_json" lang="bg"/>
    <output filename="${out_camera_app_dir}/_locales/bn/messages.json" type="chrome_messages_json" lang="bn"/>
    <output filename="${out_camera_app_dir}/_locales/ca/messages.json" type="chrome_messages_json" lang="ca"/>
    <output filename="${out_camera_app_dir}/_locales/cs/messages.json" type="chrome_messages_json" lang="cs"/>
    <output filename="${out_camera_app_dir}/_locales/da/messages.json" type="chrome_messages_json" lang="da"/>
    <output filename="${out_camera_app_dir}/_locales/de/messages.json" type="chrome_messages_json" lang="de"/>
    <output filename="${out_camera_app_dir}/_locales/el/messages.json" type="chrome_messages_json" lang="el"/>
    <output filename="${out_camera_app_dir}/_locales/en_GB/messages.json" type="chrome_messages_json" lang="en-GB"/>
    <output filename="${out_camera_app_dir}/_locales/en/messages.json" type="chrome_messages_json" lang="en"/>
    <output filename="${out_camera_app_dir}/_locales/es/messages.json" type="chrome_messages_json" lang="es"/>
    <output filename="${out_camera_app_dir}/_locales/es_419/messages.json" type="chrome_messages_json" lang="es-419"/>
    <output filename="${out_camera_app_dir}/_locales/et/messages.json" type="chrome_messages_json" lang="et"/>
    <output filename="${out_camera_app_dir}/_locales/fa/messages.json" type="chrome_messages_json" lang="fa"/>
    <output filename="${out_camera_app_dir}/_locales/fi/messages.json" type="chrome_messages_json" lang="fi"/>
    <output filename="${out_camera_app_dir}/_locales/fil/messages.json" type="chrome_messages_json" lang="fil"/>
    <output filename="${out_camera_app_dir}/_locales/fr/messages.json" type="chrome_messages_json" lang="fr"/>
    <output filename="${out_camera_app_dir}/_locales/gu/messages.json" type="chrome_messages_json" lang="gu"/>
    <output filename="${out_camera_app_dir}/_locales/he/messages.json" type="chrome_messages_json" lang="he"/>
    <output filename="${out_camera_app_dir}/_locales/hi/messages.json" type="chrome_messages_json" lang="hi"/>
    <output filename="${out_camera_app_dir}/_locales/hr/messages.json" type="chrome_messages_json" lang="hr"/>
    <output filename="${out_camera_app_dir}/_locales/hu/messages.json" type="chrome_messages_json" lang="hu"/>
    <output filename="${out_camera_app_dir}/_locales/id/messages.json" type="chrome_messages_json" lang="id"/>
    <output filename="${out_camera_app_dir}/_locales/it/messages.json" type="chrome_messages_json" lang="it"/>
    <output filename="${out_camera_app_dir}/_locales/ja/messages.json" type="chrome_messages_json" lang="ja"/>
    <output filename="${out_camera_app_dir}/_locales/kn/messages.json" type="chrome_messages_json" lang="kn"/>
    <output filename="${out_camera_app_dir}/_locales/ko/messages.json" type="chrome_messages_json" lang="ko"/>
    <output filename="${out_camera_app_dir}/_locales/lt/messages.json" type="chrome_messages_json" lang="lt"/>
    <output filename="${out_camera_app_dir}/_locales/lv/messages.json" type="chrome_messages_json" lang="lv"/>
    <output filename="${out_camera_app_dir}/_locales/ml/messages.json" type="chrome_messages_json" lang="ml"/>
    <output filename="${out_camera_app_dir}/_locales/mr/messages.json" type="chrome_messages_json" lang="mr"/>
    <output filename="${out_camera_app_dir}/_locales/ms/messages.json" type="chrome_messages_json" lang="ms"/>
    <output filename="${out_camera_app_dir}/_locales/nl/messages.json" type="chrome_messages_json" lang="nl"/>
    <output filename="${out_camera_app_dir}/_locales/nb/messages.json" type="chrome_messages_json" lang="no"/>
    <output filename="${out_camera_app_dir}/_locales/pl/messages.json" type="chrome_messages_json" lang="pl"/>
    <output filename="${out_camera_app_dir}/_locales/pt_BR/messages.json" type="chrome_messages_json" lang="pt-BR"/>
    <output filename="${out_camera_app_dir}/_locales/pt_PT/messages.json" type="chrome_messages_json" lang="pt-PT"/>
    <output filename="${out_camera_app_dir}/_locales/ro/messages.json" type="chrome_messages_json" lang="ro"/>
    <output filename="${out_camera_app_dir}/_locales/ru/messages.json" type="chrome_messages_json" lang="ru"/>
    <output filename="${out_camera_app_dir}/_locales/sk/messages.json" type="chrome_messages_json" lang="sk"/>
    <output filename="${out_camera_app_dir}/_locales/sl/messages.json" type="chrome_messages_json" lang="sl"/>
    <output filename="${out_camera_app_dir}/_locales/sr/messages.json" type="chrome_messages_json" lang="sr"/>
    <output filename="${out_camera_app_dir}/_locales/sv/messages.json" type="chrome_messages_json" lang="sv"/>
    <output filename="${out_camera_app_dir}/_locales/sw/messages.json" type="chrome_messages_json" lang="sw"/>
    <output filename="${out_camera_app_dir}/_locales/ta/messages.json" type="chrome_messages_json" lang="ta"/>
    <output filename="${out_camera_app_dir}/_locales/te/messages.json" type="chrome_messages_json" lang="te"/>
    <output filename="${out_camera_app_dir}/_locales/th/messages.json" type="chrome_messages_json" lang="th"/>
    <output filename="${out_camera_app_dir}/_locales/tr/messages.json" type="chrome_messages_json" lang="tr"/>
    <output filename="${out_camera_app_dir}/_locales/uk/messages.json" type="chrome_messages_json" lang="uk"/>
    <output filename="${out_camera_app_dir}/_locales/vi/messages.json" type="chrome_messages_json" lang="vi"/>
    <output filename="${out_camera_app_dir}/_locales/zh_CN/messages.json" type="chrome_messages_json" lang="zh-CN"/>
    <output filename="${out_camera_app_dir}/_locales/zh_TW/messages.json" type="chrome_messages_json" lang="zh-TW"/>

    <!-- For SWA usage -->
    <output filename="${gen_camera_app_dir}/strings/grit/chromeos_camera_app_strings.h" type="rc_header">
      <emit emit_type='prepend'></emit>
    </output>
    <output filename="${gen_camera_app_dir}/strings/chromeos_camera_app_strings_am.pak" type="data_package" lang="am" />
    <output filename="${gen_camera_app_dir}/strings/chromeos_camera_app_strings_ar.pak" type="data_package" lang="ar" />
    <output filename="${gen_camera_app_dir}/strings/chromeos_camera_app_strings_bg.pak" type="data_package" lang="bg" />
    <output filename="${gen_camera_app_dir}/strings/chromeos_camera_app_strings_bn.pak" type="data_package" lang="bn" />
    <output filename="${gen_camera_app_dir}/strings/chromeos_camera_app_strings_ca.pak" type="data_package" lang="ca" />
    <output filename="${gen_camera_app_dir}/strings/chromeos_camera_app_strings_cs.pak" type="data_package" lang="cs" />
    <output filename="${gen_camera_app_dir}/strings/chromeos_camera_app_strings_da.pak" type="data_package" lang="da" />
    <output filename="${gen_camera_app_dir}/strings/chromeos_camera_app_strings_de.pak" type="data_package" lang="de" />
    <output filename="${gen_camera_app_dir}/strings/chromeos_camera_app_strings_el.pak" type="data_package" lang="el" />
    <output filename="${gen_camera_app_dir}/strings/chromeos_camera_app_strings_en-GB.pak" type="data_package" lang="en-GB" />
    <output filename="${gen_camera_app_dir}/strings/chromeos_camera_app_strings_en-US.pak" type="data_package" lang="en" />
    <output filename="${gen_camera_app_dir}/strings/chromeos_camera_app_strings_es.pak" type="data_package" lang="es" />
    <output filename="${gen_camera_app_dir}/strings/chromeos_camera_app_strings_es-419.pak" type="data_package" lang="es-419" />
    <output filename="${gen_camera_app_dir}/strings/chromeos_camera_app_strings_et.pak" type="data_package" lang="et" />
    <output filename="${gen_camera_app_dir}/strings/chromeos_camera_app_strings_fa.pak" type="data_package" lang="fa" />
    <output filename="${gen_camera_app_dir}/strings/chromeos_camera_app_strings_fake-bidi.pak" type="data_package" lang="fake-bidi" />
    <output filename="${gen_camera_app_dir}/strings/chromeos_camera_app_strings_fi.pak" type="data_package" lang="fi" />
    <output filename="${gen_camera_app_dir}/strings/chromeos_camera_app_strings_fil.pak" type="data_package" lang="fil" />
    <output filename="${gen_camera_app_dir}/strings/chromeos_camera_app_strings_fr.pak" type="data_package" lang="fr" />
    <output filename="${gen_camera_app_dir}/strings/chromeos_camera_app_strings_gu.pak" type="data_package" lang="gu" />
    <output filename="${gen_camera_app_dir}/strings/chromeos_camera_app_strings_he.pak" type="data_package" lang="he" />
    <output filename="${gen_camera_app_dir}/strings/chromeos_camera_app_strings_hi.pak" type="data_package" lang="hi" />
    <output filename="${gen_camera_app_dir}/strings/chromeos_camera_app_strings_hr.pak" type="data_package" lang="hr" />
    <output filename="${gen_camera_app_dir}/strings/chromeos_camera_app_strings_hu.pak" type="data_package" lang="hu" />
    <output filename="${gen_camera_app_dir}/strings/chromeos_camera_app_strings_id.pak" type="data_package" lang="id" />
    <output filename="${gen_camera_app_dir}/strings/chromeos_camera_app_strings_it.pak" type="data_package" lang="it" />
    <output filename="${gen_camera_app_dir}/strings/chromeos_camera_app_strings_ja.pak" type="data_package" lang="ja" />
    <output filename="${gen_camera_app_dir}/strings/chromeos_camera_app_strings_kn.pak" type="data_package" lang="kn" />
    <output filename="${gen_camera_app_dir}/strings/chromeos_camera_app_strings_ko.pak" type="data_package" lang="ko" />
    <output filename="${gen_camera_app_dir}/strings/chromeos_camera_app_strings_lt.pak" type="data_package" lang="lt" />
    <output filename="${gen_camera_app_dir}/strings/chromeos_camera_app_strings_lv.pak" type="data_package" lang="lv" />
    <output filename="${gen_camera_app_dir}/strings/chromeos_camera_app_strings_ml.pak" type="data_package" lang="ml" />
    <output filename="${gen_camera_app_dir}/strings/chromeos_camera_app_strings_mr.pak" type="data_package" lang="mr" />
    <output filename="${gen_camera_app_dir}/strings/chromeos_camera_app_strings_ms.pak" type="data_package" lang="ms" />
    <output filename="${gen_camera_app_dir}/strings/chromeos_camera_app_strings_nl.pak" type="data_package" lang="nl" />
    <!-- The translation console uses 'no' for Norwegian Bokmål. It should
         be 'nb'. -->
    <output filename="${gen_camera_app_dir}/strings/chromeos_camera_app_strings_nb.pak" type="data_package" lang="no" />
    <output filename="${gen_camera_app_dir}/strings/chromeos_camera_app_strings_pl.pak" type="data_package" lang="pl" />
    <output filename="${gen_camera_app_dir}/strings/chromeos_camera_app_strings_pt-BR.pak" type="data_package" lang="pt-BR" />
    <output filename="${gen_camera_app_dir}/strings/chromeos_camera_app_strings_pt-PT.pak" type="data_package" lang="pt-PT" />
    <output filename="${gen_camera_app_dir}/strings/chromeos_camera_app_strings_ro.pak" type="data_package" lang="ro" />
    <output filename="${gen_camera_app_dir}/strings/chromeos_camera_app_strings_ru.pak" type="data_package" lang="ru" />
    <output filename="${gen_camera_app_dir}/strings/chromeos_camera_app_strings_sk.pak" type="data_package" lang="sk" />
    <output filename="${gen_camera_app_dir}/strings/chromeos_camera_app_strings_sl.pak" type="data_package" lang="sl" />
    <output filename="${gen_camera_app_dir}/strings/chromeos_camera_app_strings_sr.pak" type="data_package" lang="sr" />
    <output filename="${gen_camera_app_dir}/strings/chromeos_camera_app_strings_sv.pak" type="data_package" lang="sv" />
    <output filename="${gen_camera_app_dir}/strings/chromeos_camera_app_strings_sw.pak" type="data_package" lang="sw" />
    <output filename="${gen_camera_app_dir}/strings/chromeos_camera_app_strings_ta.pak" type="data_package" lang="ta" />
    <output filename="${gen_camera_app_dir}/strings/chromeos_camera_app_strings_te.pak" type="data_package" lang="te" />
    <output filename="${gen_camera_app_dir}/strings/chromeos_camera_app_strings_th.pak" type="data_package" lang="th" />
    <output filename="${gen_camera_app_dir}/strings/chromeos_camera_app_strings_tr.pak" type="data_package" lang="tr" />
    <output filename="${gen_camera_app_dir}/strings/chromeos_camera_app_strings_uk.pak" type="data_package" lang="uk" />
    <output filename="${gen_camera_app_dir}/strings/chromeos_camera_app_strings_vi.pak" type="data_package" lang="vi" />
    <output filename="${gen_camera_app_dir}/strings/chromeos_camera_app_strings_zh-CN.pak" type="data_package" lang="zh-CN" />
    <output filename="${gen_camera_app_dir}/strings/chromeos_camera_app_strings_zh-TW.pak" type="data_package" lang="zh-TW" />
  </outputs>
  <translations>
    <file path="camera_strings_af.xtb" lang="af" />
    <file path="camera_strings_am.xtb" lang="am" />
    <file path="camera_strings_ar.xtb" lang="ar" />
    <file path="camera_strings_as.xtb" lang="as" />
    <file path="camera_strings_az.xtb" lang="az" />
    <file path="camera_strings_be.xtb" lang="be" />
    <file path="camera_strings_bg.xtb" lang="bg" />
    <file path="camera_strings_bn.xtb" lang="bn" />
    <file path="camera_strings_bs.xtb" lang="bs" />
    <file path="camera_strings_ca.xtb" lang="ca" />
    <file path="camera_strings_cs.xtb" lang="cs" />
    <file path="camera_strings_da.xtb" lang="da" />
    <file path="camera_strings_de.xtb" lang="de" />
    <file path="camera_strings_el.xtb" lang="el" />
    <file path="camera_strings_en-GB.xtb" lang="en-GB" />
    <file path="camera_strings_es.xtb" lang="es" />
    <file path="camera_strings_es-419.xtb" lang="es-419" />
    <file path="camera_strings_et.xtb" lang="et" />
    <file path="camera_strings_eu.xtb" lang="eu" />
    <file path="camera_strings_fa.xtb" lang="fa" />
    <file path="camera_strings_fi.xtb" lang="fi" />
    <file path="camera_strings_fil.xtb" lang="fil" />
    <file path="camera_strings_fr.xtb" lang="fr" />
    <file path="camera_strings_fr-CA.xtb" lang="fr-CA" />
    <file path="camera_strings_gl.xtb" lang="gl" />
    <file path="camera_strings_gu.xtb" lang="gu" />
    <file path="camera_strings_hi.xtb" lang="hi" />
    <file path="camera_strings_hr.xtb" lang="hr" />
    <file path="camera_strings_hu.xtb" lang="hu" />
    <file path="camera_strings_hy.xtb" lang="hy" />
    <file path="camera_strings_id.xtb" lang="id" />
    <file path="camera_strings_is.xtb" lang="is" />
    <file path="camera_strings_it.xtb" lang="it" />
    <!-- The translation console uses 'iw' for Hebrew, but we use 'he'. -->
    <file path="camera_strings_iw.xtb" lang="he" />
    <file path="camera_strings_ja.xtb" lang="ja" />
    <file path="camera_strings_ka.xtb" lang="ka" />
    <file path="camera_strings_kk.xtb" lang="kk" />
    <file path="camera_strings_km.xtb" lang="km" />
    <file path="camera_strings_kn.xtb" lang="kn" />
    <file path="camera_strings_ko.xtb" lang="ko" />
    <file path="camera_strings_ky.xtb" lang="ky" />
    <file path="camera_strings_lo.xtb" lang="lo" />
    <file path="camera_strings_lt.xtb" lang="lt" />
    <file path="camera_strings_lv.xtb" lang="lv" />
    <file path="camera_strings_mk.xtb" lang="mk" />
    <file path="camera_strings_ml.xtb" lang="ml" />
    <file path="camera_strings_mn.xtb" lang="mn" />
    <file path="camera_strings_mr.xtb" lang="mr" />
    <file path="camera_strings_ms.xtb" lang="ms" />
    <file path="camera_strings_my.xtb" lang="my" />
    <file path="camera_strings_ne.xtb" lang="ne" />
    <file path="camera_strings_nl.xtb" lang="nl" />
    <file path="camera_strings_no.xtb" lang="no" />
    <file path="camera_strings_or.xtb" lang="or" />
    <file path="camera_strings_pa.xtb" lang="pa" />
    <file path="camera_strings_pl.xtb" lang="pl" />
    <file path="camera_strings_pt-BR.xtb" lang="pt-BR" />
    <file path="camera_strings_pt-PT.xtb" lang="pt-PT" />
    <file path="camera_strings_ro.xtb" lang="ro" />
    <file path="camera_strings_ru.xtb" lang="ru" />
    <file path="camera_strings_si.xtb" lang="si" />
    <file path="camera_strings_sk.xtb" lang="sk" />
    <file path="camera_strings_sl.xtb" lang="sl" />
    <file path="camera_strings_sq.xtb" lang="sq" />
    <file path="camera_strings_sr.xtb" lang="sr" />
    <file path="camera_strings_sr-Latn.xtb" lang="sr-Latn" />
    <file path="camera_strings_sv.xtb" lang="sv" />
    <file path="camera_strings_sw.xtb" lang="sw" />
    <file path="camera_strings_ta.xtb" lang="ta" />
    <file path="camera_strings_te.xtb" lang="te" />
    <file path="camera_strings_th.xtb" lang="th" />
    <file path="camera_strings_tr.xtb" lang="tr" />
    <file path="camera_strings_uk.xtb" lang="uk" />
    <file path="camera_strings_ur.xtb" lang="ur" />
    <file path="camera_strings_uz.xtb" lang="uz" />
    <file path="camera_strings_vi.xtb" lang="vi" />
    <file path="camera_strings_zh-CN.xtb" lang="zh-CN" />
    <file path="camera_strings_zh-HK.xtb" lang="zh-HK" />
    <file path="camera_strings_zh-TW.xtb" lang="zh-TW" />
    <file path="camera_strings_zu.xtb" lang="zu" />
  </translations>
  <release allow_pseudo="false" seq="1">
    <messages fallback_to_english="true">
      <message desc="Label for timer-duration: 10 seconds." name="IDS_LABEL_TIMER_10S">
        10 seconds
      </message>
      <message desc="Label for the help button." name="IDS_HELP_BUTTON">
        Help
      </message>
      <message desc="Label for the dismissing button in the dialog." name="IDS_DIALOG_CANCEL_BUTTON">
        Cancel
      </message>
      <message desc="Label for the printing button." name="IDS_PRINT_BUTTON">
        Print
      </message>
      <message desc="Label for the gallery button." name="IDS_GALLERY_BUTTON">
        Go to gallery
      </message>
      <message desc="Error message shown when saving/adding a image or video to the file system failed." name="IDS_ERROR_MSG_SAVE_FILE_FAILED">
        Unable to save the file
      </message>
      <message desc="Label for the exporting button." name="IDS_EXPORT_BUTTON">
        Export to disk
      </message>
      <message desc="Label for the checkbox to toggle the 3 seconds countdown timer." name="IDS_TOGGLE_TIMER_3S_BUTTON">
        3 seconds timer
      </message>
      <message desc="Label for the checkbox to toggle the 10 seconds countdown timer." name="IDS_TOGGLE_TIMER_10S_BUTTON">
        10 seconds timer
      </message>
      <message desc="Message shown before moving all photos and videos stored in the Camera App to the Downloads folder." name="IDS_MIGRATE_PICTURES_MSG">
        Photos and videos taken with the camera will be moved to the Downloads folder. You can access them in Files.

        Apps with storage permissions will have access to your photos and videos.
      </message>
      <message desc="Label for spoken feedback to read out grid-type: 3x3." name="IDS_ARIA_GRID_3X3">
        3 by 3
      </message>
      <message desc="Label for the shutter button to take video snapshot." name="IDS_TAKE_VIDEO_SNAPSHOT_BUTTON">
        Take video snapshot
      </message>
      <message desc="Label for the shutter button to start recording." name="IDS_RECORD_VIDEO_START_BUTTON">
        Start recording
      </message>
      <message desc="Label for the shutter button to stop recording." name="IDS_RECORD_VIDEO_STOP_BUTTON">
        Stop recording
      </message>
      <message desc="Label for the shutter button to pause recording." name="IDS_RECORD_VIDEO_PAUSE_BUTTON">
        Pause recording
      </message>
      <message desc="Label for the shutter button to resume recording." name="IDS_RECORD_VIDEO_RESUME_BUTTON">
        Resume recording
      </message>
      <message desc="Label for the button to switch to next connected camera. Eg. switching from front facing to back facing, or a camera connected via USB. The button is shown only when more than one camera is connected." name="IDS_SWITCH_CAMERA_BUTTON">
        Switch to next camera
      </message>
      <message desc="Label for the button of timer-duration options." name="IDS_TIMER_DURATION_BUTTON">
        Timer duration
      </message>
      <message desc="Label for timer-duration: 3 seconds." name="IDS_LABEL_TIMER_3S">
        3 seconds
      </message>
      <message desc="Status message for spoken feedback when video recording has been stopped." name="IDS_STATUS_MSG_RECORDING_STOPPED">
        Recording stopped
      </message>
      <message desc="Label for spoken feedback to read out grid-type: 4x4." name="IDS_ARIA_GRID_4X4">
        4 by 4
      </message>
      <message desc="Label for for grid-type: 4x4." name="IDS_LABEL_GRID_4X4">
        4 x 4
      </message>
      <message desc="Label for the button of camera-resolution options." name="IDS_CAMERA_RESOLUTION_BUTTON">
        Camera resolution
      </message>
      <message desc="Label for the button of photo-resolution options." name="IDS_PHOTO_RESOLUTION_BUTTON">
        Photo resolution
      </message>
      <message desc="Label for the button of video-resolution options." name="IDS_VIDEO_RESOLUTION_BUTTON">
        Video resolution
      </message>
      <message desc="Label for front camera." name="IDS_LABEL_FRONT_CAMERA">
        Front camera
      </message>
      <message desc="Label for back camera." name="IDS_LABEL_BACK_CAMERA">
        Back camera
      </message>
      <message desc="Label for external camera." name="IDS_LABEL_EXTERNAL_CAMERA">
        External camera
      </message>
      <message desc="Label for photo resolution options of specific resolution." name="IDS_LABEL_PHOTO_RESOLUTION">
        (<ph name="aspect_ratio_width">$1<ex>16</ex></ph>:<ph name="aspect_ratio_height">$2<ex>9</ex></ph>) <ph name="megapixel">$3<ex>0.9</ex></ph> mega pixel
      </message>
      <message desc="Label for detail photo resolution options of specific resolution." name="IDS_LABEL_DETAIL_PHOTO_RESOLUTION">
        (<ph name="aspect_ratio_width">$1<ex>16</ex></ph>:<ph name="aspect_ratio_height">$2<ex>9</ex></ph> - <ph name="width">$3<ex>1920</ex></ph>x<ph name="height">$4<ex>1080</ex></ph>) <ph name="megapixel">$5<ex>0.9</ex></ph> mega pixel
      </message>
      <message desc="Label for video resolution options of specific resolution." name="IDS_LABEL_VIDEO_RESOLUTION">
        HD <ph name="height">$1<ex>720</ex></ph>p (<ph name="width">$2<ex>1280</ex></ph>:<ph name="height">$1<ex>720</ex></ph>)
      </message>
      <message desc="Confirmation message before removing a selected item from the gallery. Expects a file name to be passed in." name="IDS_DELETE_CONFIRMATION_MSG">
        Do you really want to remove <ph name="file">$1<ex>IMG_20160520_000000.jpg</ex></ph>?
      </message>
      <message desc="Label for spoken feedback to read out switch to take photo mode button." name="IDS_SWITCH_TAKE_PHOTO_BUTTON">
        Switch to take photo
      </message>
      <message desc="Label for switch to take photo mode button." name="IDS_LABEL_SWITCH_TAKE_PHOTO_BUTTON">
        Photo
      </message>
      <message desc="Label for the checkbox to toggle the grid shown on preview." name="IDS_TOGGLE_GRID_BUTTON">
        Grid
      </message>
      <message desc="Label for the shutter button to take photo." name="IDS_TAKE_PHOTO_BUTTON">
        Take photo
      </message>
      <message desc="Error message shown when it was impossible to connect to the camera due to unavailability." name="IDS_ERROR_MSG_NO_CAMERA">
        Your camera is currently unavailable.
        Please check if the camera is properly connected.
      </message>
      <message desc="Error message shown when failing to start recording video." name="IDS_ERROR_MSG_RECORD_START_FAILED">
        Unable to start recording
      </message>
      <message desc="Label for the checkbox to toggle the microphone for recording video." name="IDS_TOGGLE_MIC_BUTTON">
        Microphone
      </message>
      <message desc="Label for the checkbox to toggle barcode (QR code) scanning in photo mode." name="IDS_TOGGLE_BARCODE_BUTTON">
        QR code
      </message>
      <message desc="Label for the copy button of the barcode url chip." name="IDS_BARCODE_COPY_LINK_BUTTON">
        Copy link address
      </message>
      <message desc="Label for the copy button of the barcode text chip." name="IDS_BARCODE_COPY_TEXT_BUTTON">
        Copy text
      </message>
      <message desc="Label for detected link on the barcode chip." name="IDS_BARCODE_LINK_DETECTED">
        Link detected. <ph name="hostname">$1<ex>www.google.com</ex></ph>
      </message>
      <message desc="Label for detected text on the barcode chip." name="IDS_BARCODE_TEXT_DETECTED">
        Text detected.
      </message>
      <message desc="Label for the button of expert mode options." name="IDS_EXPERT_MODE_BUTTON">
        Expert mode
      </message>
      <message desc="Label for expert mode option: preview metadata." name="IDS_EXPERT_PREVIEW_METADATA">
        Preview metadata
      </message>
      <message desc="Label for expert mode option: save metadata." name="IDS_EXPERT_SAVE_METADATA">
        Save metadata
      </message>
      <message desc="Label for expert mode option: print performance logs." name="IDS_EXPERT_PRINT_PERFORMANCE_LOGS">
        Print performance logs
      </message>
      <message desc="Label for expert mode option: scan barcode." name="IDS_EXPERT_SCAN_BARCODE">
        Scan barcode
      </message>
      <message desc="Label for snackbar message when a link is copied" name="IDS_SNACKBAR_LINK_COPIED">
        Link copied
      </message>
      <message desc="Label for snackbar message when a link is copied" name="IDS_SNACKBAR_TEXT_COPIED">
        Text copied
      </message>
      <message desc="Error message when the device does not support expert mode but tries to enable it." name="IDS_ERROR_MSG_EXPERT_MODE_NOT_SUPPORTED">
        Expert mode is not supported on this device
      </message>
      <message desc="Label for the feedback button." name="IDS_FEEDBACK_BUTTON">
        Send feedback
      </message>
      <message desc="Error message shown when failing to take photo." name="IDS_ERROR_MSG_TAKE_PHOTO_FAILED">
        Unable to take photo
      </message>
      <message desc="Error message shown when failing to take portrait photo." name="IDS_ERROR_MSG_TAKE_PORTRAIT_PHOTO_FAILED">
        Unable to take portrait photo
      </message>
      <message desc="Short description of the Camera App." name="IDS_DESCRIPTION">
        Take photos and record videos with your camera.
      </message>
      <message desc="Label for for grid-type: 3x3." name="IDS_LABEL_GRID_3X3">
        3 x 3
      </message>
      <message desc="Label for the shutter button to cancel countdown timer and stop taking photo." name="IDS_TAKE_PHOTO_CANCEL_BUTTON">
        Stop taking photo
      </message>
      <message desc="Label for the delete button." name="IDS_DELETE_BUTTON">
        Delete
      </message>
      <message desc="Error message shown when no data is recorded for a recording and it won't be added to the gallery." name="IDS_ERROR_MSG_EMPTY_RECORDING">
        Nothing recorded
      </message>
      <message desc="Confirmation message before removing multiple selected items from the gallery. Expects a file count to be passed in." name="IDS_DELETE_MULTI_CONFIRMATION_MSG">
        Do you really want to remove <ph name="count">$1<ex>20</ex></ph> items?
      </message>
      <message desc="Text to speech label for the gallery list." name="IDS_GALLERY_IMAGES">
        Gallery images
      </message>
      <message desc="Error message shown when exporting to an external directory failed. Expects a file name to be passed in." name="IDS_ERROR_MSG_GALLERY_EXPORT_FAILED">
        Unable to export <ph name="file">$1<ex>IMG_20160520_000000.jpg</ex></ph>
      </message>
      <message desc="Status message for spoken feedback when switching over to another camera." name="IDS_STATUS_MSG_CAMERA_SWITCHED">
        <ph name="camera">$1<ex>USB WebCam (12ab:5678) User-facing</ex></ph> active
      </message>
      <message desc="Name of the Camera App." name="IDS_NAME">
        Camera
      </message>
      <message desc="Error message shown when failing to read or write the file system." name="IDS_ERROR_MSG_FILE_SYSTEM_FAILED">
        File system errors.
      </message>
      <message desc="Label for the settings button." name="IDS_SETTINGS_BUTTON">
        Settings
      </message>
      <message desc="Label for the accepting button in the dialog." name="IDS_DIALOG_OK_BUTTON">
        OK
      </message>
      <message desc="Label for grid-type: golden ratio." name="IDS_LABEL_GRID_GOLDEN">
        Golden ratio
      </message>
      <message desc="Label for spoken feedback to read out switch to record video mode button." name="IDS_SWITCH_RECORD_VIDEO_BUTTON">
        Switch to record video
      </message>
      <message desc="Label for switch to record video mode button." name="IDS_LABEL_SWITCH_RECORD_VIDEO_BUTTON">
        Video
      </message>
      <message desc="Label for the checkbox to toggle the preview mirroring. Eg. if mirroring is toggled on, preview will be flipped horizontally." name="IDS_TOGGLE_MIRROR_BUTTON">
        Mirroring
      </message>
      <message desc="Label for the button of grid-type options." name="IDS_GRID_TYPE_BUTTON">
        Grid type
      </message>
      <message desc="Label showing current state of 30 FPS on tooltip of toggle 60 FPS recording checkbox." name="IDS_LABEL_30FPS">
        30 FPS
      </message>
      <message desc="Label showing current state of 60 FPS on tooltip of toggle 60 FPS recording checkbox." name="IDS_LABEL_60FPS">
        60 FPS
      </message>
      <message desc="Label for the checkbox to toggle 60 FPS recording." name="IDS_TOGGLE_60FPS_BUTTON">
        60 FPS
      </message>
      <message desc="Label for the back button." name="IDS_BACK_BUTTON">
        Go back
      </message>
      <message desc="Label for spoken feedback to read out switch to take square photo mode button." name="IDS_SWITCH_TAKE_SQUARE_PHOTO_BUTTON">
        Switch to take square photo
      </message>
      <message desc="Label for switch to take square photo mode button." name="IDS_LABEL_SWITCH_TAKE_SQUARE_PHOTO_BUTTON">
        Square
      </message>
      <message desc="Label for spoken feedback to read out switch to take portrait photo mode button." name="IDS_SWITCH_TAKE_PORTRAIT_PHOTO_BUTTON">
        Switch to take portrait photo
      </message>
      <message desc="Label for switch to take portrait photo mode button." name="IDS_LABEL_SWITCH_TAKE_PORTRAIT_PHOTO_BUTTON">
        Portrait
      </message>
      <message desc="Label for the confirm button to confirm with the reviewed photo or video." name="IDS_CONFIRM_REVIEW_BUTTON">
        Confirm
      </message>
      <message desc="Label for the cancel button to cancel with the reviewed photo or video." name="IDS_CANCEL_REVIEW_BUTTON">
        Cancel
      </message>
      <message desc="Label for the button to play video." name="IDS_PLAY_RESULT_VIDEO_BUTTON">
        Play video
      </message>
      <message desc="Indicator message for recording paused." name="IDS_RECORD_VIDEO_PAUSED_MSG">
        PAUSED
      </message>
      <message desc="Provide a template for providing good feedback to the Camera team and encourage users to attach a sample photo if reasonable." name="IDS_FEEDBACK_DESCRIPTION_PLACEHOLDER">
        Thanks for giving feedback on the Camera app.

If your feedback is about image or video quality, please attach a sample photo or video and describe what's wrong. (For example, photo is too dark or subject isn’t in focus.)
      </message>
      <message desc="Headline that photos and videos will be stored in a new folder" name="IDS_BANNER_TITLE">
        Your photos and videos have a new home
      </message>
      <message desc="Explain that new photos and videos will be in the new folder located at My Files > Camera." name="IDS_BANNER_MSG">
        New photos and videos will now be saved to a folder in the Files app: My files > Camera
      </message>
      <message desc="Label for close introducing new camera App UI banner button." name="IDS_BANNER_CLOSE_BUTTON">
        Close
      </message>
      <message desc="Error message shown when the camera is being used by some other instance." name="IDS_ERROR_MSG_CAMERA_BEING_USED">
        Your camera is being used by another app
      </message>
    </messages>
  </release>
</grit>
