{
  "schema": "pedal_concepts_runtime",
  "schema_version": 1,
  "data_version": 15538875,
  "tokenize_characters": " -",
  "dictionary": [
    "chrome",
    "google",
    "अंदर",
    "अनुवाद",
    "अपग्रेड",
    "अपडेट",
    "इंस्टॉल",
    "इतिहास",
    "एक",
    "करना",
    "करें",
    "कार्ड",
    "की",
    "कुकी",
    "के",
    "कैश",
    "कैसे",
    "को",
    "कोई",
    "क्रेडिट",
    "क्रेडेंशियल",
    "खोलें",
    "गुप्त",
    "चुकाएं",
    "चुकाने",
    "जानकारी",
    "टैब",
    "डालें",
    "डेटा",
    "तरीके",
    "दिखाएं",
    "देखें",
    "निजी",
    "पर",
    "पासवर्ड",
    "पेज",
    "पैसे",
    "प्रबंधक",
    "प्रबंधित",
    "बदलाव",
    "बदलें",
    "बनाएं",
    "ब्राउज़",
    "ब्राउज़र",
    "भाषा",
    "भुगतान",
    "मिटाएं",
    "मिटाएंं",
    "में",
    "मेमोरी",
    "मेरा",
    "मेरी",
    "मेरे",
    "मैं",
    "मैनेजर",
    "मोड",
    "यह",
    "लॉन्च",
    "वह",
    "वाइप",
    "विंडो",
    "शुरू",
    "सेव",
    "हटाएं"
  ],
  "pedals": [
    {
      "name": "CLEAR_BROWSING_DATA",
      "id": 1,
      "groups": [
        {
          "required": false,
          "single": true,
          "synonyms": [
            [
              1,
              0
            ],
            [
              42
            ],
            [
              43
            ],
            [
              0
            ]
          ]
        },
        {
          "required": true,
          "single": true,
          "synonyms": [
            [
              59
            ],
            [
              47
            ],
            [
              46
            ],
            [
              63
            ]
          ]
        },
        {
          "required": true,
          "single": true,
          "synonyms": [
            [
              15,
              49
            ],
            [
              25
            ],
            [
              7
            ],
            [
              13
            ],
            [
              28
            ]
          ]
        }
      ]
    },
    {
      "name": "MANAGE_PASSWORDS",
      "id": 2,
      "groups": [
        {
          "required": false,
          "single": true,
          "synonyms": [
            [
              1,
              0
            ],
            [
              43
            ],
            [
              0
            ]
          ]
        },
        {
          "required": true,
          "single": true,
          "synonyms": [
            [
              38
            ],
            [
              5
            ],
            [
              39
            ],
            [
              62
            ],
            [
              37
            ],
            [
              30
            ],
            [
              54
            ],
            [
              31
            ],
            [
              40
            ]
          ]
        },
        {
          "required": true,
          "single": true,
          "synonyms": [
            [
              20
            ],
            [
              34
            ]
          ]
        }
      ]
    },
    {
      "name": "UPDATE_CREDIT_CARD",
      "id": 3,
      "groups": [
        {
          "required": false,
          "single": true,
          "synonyms": [
            [
              1,
              0
            ],
            [
              43
            ],
            [
              0
            ]
          ]
        },
        {
          "required": true,
          "single": true,
          "synonyms": [
            [
              38
            ],
            [
              5
            ],
            [
              39
            ],
            [
              62
            ],
            [
              40
            ]
          ]
        },
        {
          "required": true,
          "single": true,
          "synonyms": [
            [
              19,
              11,
              12,
              25
            ],
            [
              36,
              24,
              14,
              29
            ],
            [
              11,
              12,
              25
            ],
            [
              19,
              11
            ],
            [
              36,
              23
            ],
            [
              45
            ],
            [
              11
            ]
          ]
        }
      ]
    },
    {
      "name": "LAUNCH_INCOGNITO",
      "id": 4,
      "groups": [
        {
          "required": false,
          "single": true,
          "synonyms": [
            [
              1,
              0
            ],
            [
              43
            ],
            [
              0
            ]
          ]
        },
        {
          "required": false,
          "single": true,
          "synonyms": [
            [
              57
            ],
            [
              61
            ],
            [
              21
            ],
            [
              27
            ],
            [
              41
            ]
          ]
        },
        {
          "required": true,
          "single": true,
          "synonyms": [
            [
              22,
              60
            ],
            [
              32,
              60
            ],
            [
              22,
              26
            ],
            [
              22,
              55
            ],
            [
              32,
              26
            ],
            [
              32,
              55
            ],
            [
              22
            ]
          ]
        }
      ]
    },
    {
      "name": "TRANSLATE",
      "id": 5,
      "groups": [
        {
          "required": false,
          "single": true,
          "synonyms": [
            [
              1,
              0
            ],
            [
              43
            ],
            [
              0
            ]
          ]
        },
        {
          "required": true,
          "single": true,
          "synonyms": [
            [
              44,
              40
            ],
            [
              3
            ]
          ]
        },
        {
          "required": true,
          "single": true,
          "synonyms": [
            [
              56,
              35
            ],
            [
              35
            ],
            [
              56
            ]
          ]
        }
      ]
    },
    {
      "name": "UPDATE_CHROME",
      "id": 6,
      "groups": [
        {
          "required": true,
          "single": true,
          "synonyms": [
            [
              1,
              0
            ],
            [
              43
            ],
            [
              0
            ]
          ]
        },
        {
          "required": true,
          "single": true,
          "synonyms": [
            [
              4
            ],
            [
              6
            ],
            [
              5
            ]
          ]
        }
      ]
    }
  ],
  "ignore_group": {
    "required": false,
    "single": false,
    "synonyms": [
      [
        14,
        2
      ],
      [
        2
      ],
      [
        16
      ],
      [
        9
      ],
      [
        10
      ],
      [
        50
      ],
      [
        51
      ],
      [
        52
      ],
      [
        18
      ],
      [
        48
      ],
      [
        48
      ],
      [
        53
      ],
      [
        58
      ],
      [
        8
      ],
      [
        33
      ],
      [
        17
      ],
      [
        8
      ]
    ]
  },
  "max_tokens": 32
}