[
    {
        "duration": "30.0",
        "name": "loading.mobile/Dramaq"
    },
    {
        "duration": "27.0",
        "name": "loading.mobile/Facebook"
    },
    {
        "duration": "22.0",
        "name": "loading.mobile/FranceTVInfo"
    },
    {
        "duration": "28.0",
        "name": "loading.mobile/GoogleIndia"
    },
    {
        "duration": "25.0",
        "name": "loading.mobile/Hongkiat"
    },
    {
        "duration": "25.0",
        "name": "loading.mobile/LocalMoxie"
    },
    {
        "duration": "168.0",
        "name": "startup.mobile/cct:coldish:bbc"
    },
    {
        "duration": "191.0",
        "name": "startup.mobile/intent:coldish:bbc"
    },
    {
        "duration": "138.0",
        "name": "startup.mobile/intent:warm:bbc"
    },
    {
        "duration": "0.0",
        "name": "startup.mobile/maps_pwa:with_http_cache"
    },
    {
        "duration": "38.0",
        "name": "system_health.common_mobile/background:social:facebook:2019"
    },
    {
        "duration": "54.0",
        "name": "system_health.common_mobile/background:tools:gmail:2019"
    },
    {
        "duration": "139.0",
        "name": "system_health.common_mobile/browse:news:cnn:2020"
    },
    {
        "duration": "112.0",
        "name": "system_health.common_mobile/browse:news:reddit:2019"
    },
    {
        "duration": "8.0",
        "name": "system_health.common_mobile/browse:social:pinterest_infinite_scroll:2019"
    },
    {
        "duration": "105.0",
        "name": "system_health.common_mobile/browse:social:tumblr_infinite_scroll:2018"
    },
    {
        "duration": "93.0",
        "name": "system_health.common_mobile/browse:social:twitter:2019"
    },
    {
        "duration": "61.0",
        "name": "system_health.common_mobile/browse:tools:maps:2019"
    },
    {
        "duration": "35.0",
        "name": "system_health.common_mobile/load:media:youtube:2018"
    },
    {
        "duration": "46.0",
        "name": "system_health.common_mobile/load:news:cnn:2020"
    },
    {
        "duration": "50.0",
        "name": "system_health.common_mobile/load:tools:gmail:2019"
    },
    {
        "duration": "35.0",
        "name": "system_health.common_mobile/load:tools:weather:2019"
    },
    {
        "duration": "100.0",
        "name": "components_perftests/_gtest_"
    },
    {
        "duration": "45.0",
        "name": "gpu_perftests/_gtest_"
    },
    {
        "duration": "55.0",
        "name": "tracing_perftests/_gtest_"
    }
]