{
  "schema": "pedal_concepts_runtime",
  "schema_version": 1,
  "data_version": 15538875,
  "tokenize_characters": " -",
  "dictionary": [
    "a",
    "an",
    "chrome",
    "do",
    "google",
    "the",
    "анонімна",
    "анонімне",
    "анонімний",
    "анонімного",
    "в",
    "веб",
    "видалити",
    "вилучити",
    "витерти",
    "вкладка",
    "всередині",
    "відкрити",
    "вікно",
    "дані",
    "диспетчер",
    "для",
    "до",
    "запустити",
    "зберегти",
    "змінити",
    "картка",
    "картки",
    "керувати",
    "кеш",
    "кредитна",
    "кредитної",
    "кредитні",
    "межах",
    "мову",
    "моя",
    "моє",
    "мої",
    "мій",
    "на",
    "облікові",
    "оновити",
    "оновлення",
    "оплата",
    "оплати",
    "очистити",
    "пароль",
    "паролі",
    "перегляд",
    "переглядач",
    "перегляду",
    "переглянути",
    "переклад",
    "перекладач",
    "перекласти",
    "платежі",
    "платіж",
    "показати",
    "приватна",
    "редагувати",
    "режим",
    "режимі",
    "способи",
    "створити",
    "стерти",
    "сторінка",
    "сторінки",
    "сторінку",
    "у",
    "увійти",
    "увімкнути",
    "установити",
    "цю",
    "цієї",
    "я",
    "як",
    "інформація",
    "історія"
  ],
  "pedals": [
    {
      "name": "CLEAR_BROWSING_DATA",
      "id": 1,
      "groups": [
        {
          "required": false,
          "single": true,
          "synonyms": [
            [
              11,
              49
            ],
            [
              11,
              48
            ],
            [
              4,
              2
            ],
            [
              2
            ]
          ]
        },
        {
          "required": true,
          "single": true,
          "synonyms": [
            [
              12
            ],
            [
              13
            ],
            [
              45
            ],
            [
              14
            ],
            [
              64
            ]
          ]
        },
        {
          "required": true,
          "single": true,
          "synonyms": [
            [
              76
            ],
            [
              77
            ],
            [
              19
            ],
            [
              29
            ]
          ]
        }
      ]
    },
    {
      "name": "MANAGE_PASSWORDS",
      "id": 2,
      "groups": [
        {
          "required": false,
          "single": true,
          "synonyms": [
            [
              11,
              49
            ],
            [
              4,
              2
            ],
            [
              2
            ]
          ]
        },
        {
          "required": true,
          "single": true,
          "synonyms": [
            [
              51
            ],
            [
              59
            ],
            [
              20
            ],
            [
              24
            ],
            [
              28
            ],
            [
              57
            ],
            [
              25
            ],
            [
              41
            ]
          ]
        },
        {
          "required": true,
          "single": true,
          "synonyms": [
            [
              40,
              19
            ],
            [
              46
            ],
            [
              47
            ]
          ]
        }
      ]
    },
    {
      "name": "UPDATE_CREDIT_CARD",
      "id": 3,
      "groups": [
        {
          "required": false,
          "single": true,
          "synonyms": [
            [
              11,
              49
            ],
            [
              4,
              2
            ],
            [
              2
            ]
          ]
        },
        {
          "required": true,
          "single": true,
          "synonyms": [
            [
              59
            ],
            [
              24
            ],
            [
              28
            ],
            [
              25
            ],
            [
              41
            ]
          ]
        },
        {
          "required": true,
          "single": true,
          "synonyms": [
            [
              19,
              31,
              27
            ],
            [
              30,
              26
            ],
            [
              32,
              27
            ],
            [
              62,
              44
            ],
            [
              19,
              27
            ],
            [
              55
            ],
            [
              27
            ],
            [
              43
            ],
            [
              56
            ]
          ]
        }
      ]
    },
    {
      "name": "LAUNCH_INCOGNITO",
      "id": 4,
      "groups": [
        {
          "required": false,
          "single": true,
          "synonyms": [
            [
              11,
              49
            ],
            [
              4,
              2
            ],
            [
              2
            ]
          ]
        },
        {
          "required": false,
          "single": true,
          "synonyms": [
            [
              23
            ],
            [
              70
            ],
            [
              17
            ],
            [
              63
            ],
            [
              69
            ]
          ]
        },
        {
          "required": true,
          "single": true,
          "synonyms": [
            [
              18,
              61,
              9,
              50
            ],
            [
              60,
              9,
              50
            ],
            [
              8,
              48
            ],
            [
              6,
              15
            ],
            [
              58,
              15
            ],
            [
              8,
              60
            ],
            [
              7,
              18
            ]
          ]
        }
      ]
    },
    {
      "name": "TRANSLATE",
      "id": 5,
      "groups": [
        {
          "required": false,
          "single": true,
          "synonyms": [
            [
              11,
              49
            ],
            [
              4,
              2
            ],
            [
              2
            ]
          ]
        },
        {
          "required": true,
          "single": true,
          "synonyms": [
            [
              25,
              34
            ],
            [
              53
            ],
            [
              54
            ],
            [
              52
            ]
          ]
        },
        {
          "required": true,
          "single": true,
          "synonyms": [
            [
              73,
              66
            ],
            [
              72,
              67
            ],
            [
              65
            ],
            [
              73
            ],
            [
              72
            ]
          ]
        }
      ]
    },
    {
      "name": "UPDATE_CHROME",
      "id": 6,
      "groups": [
        {
          "required": true,
          "single": true,
          "synonyms": [
            [
              11,
              49
            ],
            [
              4,
              2
            ],
            [
              2
            ]
          ]
        },
        {
          "required": true,
          "single": true,
          "synonyms": [
            [
              71
            ],
            [
              42
            ],
            [
              41
            ]
          ]
        }
      ]
    }
  ],
  "ignore_group": {
    "required": false,
    "single": false,
    "synonyms": [
      [
        10,
        33
      ],
      [
        68,
        33
      ],
      [
        16
      ],
      [
        21
      ],
      [
        38
      ],
      [
        35
      ],
      [
        36
      ],
      [
        37
      ],
      [
        75
      ],
      [
        39
      ],
      [
        22
      ],
      [
        5
      ],
      [
        1
      ],
      [
        3
      ],
      [
        10
      ],
      [
        68
      ],
      [
        74
      ],
      [
        0
      ]
    ]
  },
  "max_tokens": 32
}