{
    "0": {
        "benchmarks": {
            "blink_perf.accessibility": {
                "abridged": false
            },
            "blink_perf.bindings": {
                "abridged": false
            },
            "blink_perf.css": {
                "abridged": false
            },
            "blink_perf.dom": {
                "abridged": false
            },
            "blink_perf.events": {
                "abridged": false
            },
            "blink_perf.image_decoder": {
                "abridged": false
            },
            "blink_perf.layout": {
                "end": 46,
                "abridged": false
            }
        }
    },
    "1": {
        "benchmarks": {
            "blink_perf.layout": {
                "begin": 46,
                "abridged": false
            },
            "blink_perf.owp_storage": {
                "abridged": false
            },
            "blink_perf.paint": {
                "abridged": false
            },
            "blink_perf.parser": {
                "abridged": false
            },
            "blink_perf.shadow_dom": {
                "abridged": false
            },
            "blink_perf.svg": {
                "abridged": false
            },
            "blink_perf.webaudio": {
                "end": 1,
                "abridged": false
            }
        }
    },
    "2": {
        "benchmarks": {
            "blink_perf.webaudio": {
                "begin": 1,
                "abridged": false
            },
            "dromaeo": {
                "abridged": false
            },
            "dummy_benchmark.noisy_benchmark_1": {
                "abridged": false
            },
            "dummy_benchmark.stable_benchmark_1": {
                "abridged": false
            },
            "jetstream": {
                "abridged": false
            },
            "jetstream2": {
                "abridged": false
            },
            "kraken": {
                "abridged": false
            },
            "loading.desktop": {
                "end": 15,
                "abridged": false
            }
        }
    },
    "3": {
        "benchmarks": {
            "loading.desktop": {
                "begin": 15,
                "end": 38,
                "abridged": false
            }
        }
    },
    "4": {
        "benchmarks": {
            "loading.desktop": {
                "begin": 38,
                "end": 57,
                "abridged": false
            }
        }
    },
    "5": {
        "benchmarks": {
            "loading.desktop": {
                "begin": 57,
                "end": 80,
                "abridged": false
            }
        }
    },
    "6": {
        "benchmarks": {
            "loading.desktop": {
                "begin": 80,
                "abridged": false
            },
            "media.desktop": {
                "end": 2,
                "abridged": false
            }
        }
    },
    "7": {
        "benchmarks": {
            "media.desktop": {
                "begin": 2,
                "abridged": false
            },
            "memory.desktop": {
                "abridged": false
            }
        }
    },
    "8": {
        "benchmarks": {
            "octane": {
                "abridged": false
            },
            "power.desktop": {
                "abridged": false
            },
            "rasterize_and_record_micro.top_25": {
                "abridged": false
            },
            "rendering.desktop": {
                "end": 22,
                "abridged": false
            }
        }
    },
    "9": {
        "benchmarks": {
            "rendering.desktop": {
                "begin": 22,
                "end": 80,
                "abridged": false
            }
        }
    },
    "10": {
        "benchmarks": {
            "rendering.desktop": {
                "begin": 80,
                "end": 135,
                "abridged": false
            }
        }
    },
    "11": {
        "benchmarks": {
            "rendering.desktop": {
                "begin": 135,
                "end": 189,
                "abridged": false
            }
        }
    },
    "12": {
        "benchmarks": {
            "rendering.desktop": {
                "begin": 189,
                "end": 240,
                "abridged": false
            }
        }
    },
    "13": {
        "benchmarks": {
            "rendering.desktop": {
                "begin": 240,
                "end": 290,
                "abridged": false
            }
        }
    },
    "14": {
        "benchmarks": {
            "rendering.desktop": {
                "begin": 290,
                "abridged": false
            },
            "speedometer": {
                "abridged": false
            },
            "speedometer-future": {
                "abridged": false
            },
            "speedometer2": {
                "abridged": false
            },
            "speedometer2-future": {
                "abridged": false
            },
            "speedometer2-pcscan": {
                "abridged": false
            },
            "system_health.common_desktop": {
                "end": 14,
                "abridged": false
            }
        }
    },
    "15": {
        "benchmarks": {
            "system_health.common_desktop": {
                "begin": 14,
                "end": 66,
                "abridged": false
            }
        }
    },
    "16": {
        "benchmarks": {
            "system_health.common_desktop": {
                "begin": 66,
                "abridged": false
            },
            "system_health.memory_desktop": {
                "end": 13,
                "abridged": false
            }
        }
    },
    "17": {
        "benchmarks": {
            "system_health.memory_desktop": {
                "begin": 13,
                "end": 36,
                "abridged": false
            }
        }
    },
    "18": {
        "benchmarks": {
            "system_health.memory_desktop": {
                "begin": 36,
                "end": 65,
                "abridged": false
            }
        }
    },
    "19": {
        "benchmarks": {
            "system_health.memory_desktop": {
                "begin": 65,
                "abridged": false
            }
        }
    },
    "20": {
        "benchmarks": {
            "desktop_ui": {
                "abridged": false
            },
            "tab_switching.typical_25": {
                "abridged": false
            },
            "tracing.tracing_with_background_memory_infra": {
                "abridged": false
            },
            "v8.browsing_desktop": {
                "end": 4,
                "abridged": false
            }
        }
    },
    "21": {
        "benchmarks": {
            "v8.browsing_desktop": {
                "begin": 4,
                "abridged": false
            },
            "v8.browsing_desktop-future": {
                "end": 3,
                "abridged": false
            }
        }
    },
    "22": {
        "benchmarks": {
            "v8.browsing_desktop-future": {
                "begin": 3,
                "abridged": false
            },
            "v8.runtime_stats.top_25": {
                "end": 1,
                "abridged": false
            }
        }
    },
    "23": {
        "benchmarks": {
            "v8.runtime_stats.top_25": {
                "begin": 1,
                "end": 47,
                "abridged": false
            }
        }
    },
    "24": {
        "benchmarks": {
            "v8.runtime_stats.top_25": {
                "begin": 47,
                "end": 92,
                "abridged": false
            }
        }
    },
    "25": {
        "benchmarks": {
            "v8.runtime_stats.top_25": {
                "begin": 92,
                "abridged": false
            },
            "webrtc": {
                "abridged": false
            }
        }
    },
    "extra_infos": {
        "num_stories": 1212,
        "predicted_min_shard_time": 2195.0,
        "predicted_min_shard_index": 1,
        "predicted_max_shard_time": 2373.0,
        "predicted_max_shard_index": 7,
        "shard #0": 2258.0,
        "shard #1": 2195.0,
        "shard #2": 2285.0,
        "shard #3": 2322.0,
        "shard #4": 2312.0,
        "shard #5": 2216.0,
        "shard #6": 2270.0,
        "shard #7": 2373.0,
        "shard #8": 2252.0,
        "shard #9": 2268.0,
        "shard #10": 2247.0,
        "shard #11": 2251.0,
        "shard #12": 2261.0,
        "shard #13": 2262.0,
        "shard #14": 2234.0,
        "shard #15": 2241.0,
        "shard #16": 2241.0,
        "shard #17": 2250.0,
        "shard #18": 2217.0,
        "shard #19": 2241.0,
        "shard #20": 2222.0,
        "shard #21": 2211.0,
        "shard #22": 2290.0,
        "shard #23": 2276.0,
        "shard #24": 2245.0,
        "shard #25": 2306.0
    }
}