{
    "0": {
        "benchmarks": {
            "startup.mobile": {
                "abridged": false
            },
            "system_health.common_mobile": {
                "end": 11,
                "abridged": true
            }
        }
    },
    "1": {
        "benchmarks": {
            "system_health.common_mobile": {
                "begin": 11,
                "abridged": true
            },
            "system_health.memory_mobile": {
                "end": 6,
                "abridged": true
            }
        }
    },
    "2": {
        "benchmarks": {
            "system_health.memory_mobile": {
                "begin": 6,
                "end": 11,
                "abridged": true
            }
        }
    },
    "3": {
        "benchmarks": {
            "system_health.memory_mobile": {
                "begin": 11,
                "abridged": true
            },
            "system_health.weblayer_startup": {
                "abridged": false
            }
        }
    },
    "extra_infos": {
        "num_stories": 29,
        "predicted_min_shard_time": 498.0,
        "predicted_min_shard_index": 2,
        "predicted_max_shard_time": 699.0,
        "predicted_max_shard_index": 3,
        "shard #0": 658.0,
        "shard #1": 636.0,
        "shard #2": 498.0,
        "shard #3": 699.0
    }
}