{
  "schema": "pedal_concepts_runtime",
  "schema_version": 1,
  "data_version": 15538875,
  "tokenize_characters": " -",
  "dictionary": [
    "aç",
    "başlat",
    "benim",
    "bilgi",
    "bilgileri",
    "bilgilerini",
    "bilgisi",
    "bilgisini",
    "bir",
    "bu",
    "bunu",
    "card",
    "chrome",
    "chrome'u",
    "credit",
    "değiştir",
    "dili",
    "düzenle",
    "erase",
    "geç",
    "geçir",
    "geçmiş",
    "geçmişi",
    "gizli",
    "google",
    "görüntüle",
    "göster",
    "güncelle",
    "info",
    "information",
    "içinde",
    "kaldır",
    "kart",
    "kartlar",
    "kartları",
    "kartlarını",
    "kartı",
    "kartını",
    "kaydet",
    "kimlik",
    "kredi",
    "mod",
    "moda",
    "mode",
    "nasıl",
    "oluştur",
    "ona",
    "pencere",
    "pencereye",
    "private",
    "sayfa",
    "sayfayı",
    "sekme",
    "sekmeye",
    "sil",
    "sürüme",
    "tab",
    "tarama",
    "tarayıcı",
    "tarayıcı'yı",
    "temizle",
    "veri",
    "verileri",
    "veriyi",
    "window",
    "wipe",
    "yeni",
    "yönet",
    "yönetici",
    "yöntemleri",
    "yöntemlerini",
    "yükle",
    "çerezler",
    "çerezleri",
    "çevir",
    "ödeme",
    "ödemeler",
    "ödemeleri",
    "ödemeyi",
    "önbellek",
    "önbelleği",
    "üzerinde",
    "şifre",
    "şifreler",
    "şifreleri",
    "şifreyi"
  ],
  "pedals": [
    {
      "name": "CLEAR_BROWSING_DATA",
      "id": 1,
      "groups": [
        {
          "required": false,
          "single": true,
          "synonyms": [
            [
              24,
              12
            ],
            [
              58
            ],
            [
              12
            ],
            [
              57
            ]
          ]
        },
        {
          "required": true,
          "single": true,
          "synonyms": [
            [
              31
            ],
            [
              60
            ],
            [
              18
            ],
            [
              65
            ],
            [
              54
            ]
          ]
        },
        {
          "required": true,
          "single": true,
          "synonyms": [
            [
              80
            ],
            [
              73
            ],
            [
              4
            ],
            [
              22
            ],
            [
              72
            ],
            [
              79
            ],
            [
              21
            ],
            [
              62
            ],
            [
              63
            ],
            [
              3
            ],
            [
              28
            ],
            [
              61
            ]
          ]
        }
      ]
    },
    {
      "name": "MANAGE_PASSWORDS",
      "id": 2,
      "groups": [
        {
          "required": false,
          "single": true,
          "synonyms": [
            [
              24,
              12
            ],
            [
              58
            ],
            [
              12
            ]
          ]
        },
        {
          "required": true,
          "single": true,
          "synonyms": [
            [
              25
            ],
            [
              15
            ],
            [
              27
            ],
            [
              68
            ],
            [
              17
            ],
            [
              26
            ],
            [
              38
            ],
            [
              67
            ]
          ]
        },
        {
          "required": true,
          "single": true,
          "synonyms": [
            [
              39,
              5
            ],
            [
              39,
              4
            ],
            [
              84
            ],
            [
              83
            ],
            [
              85
            ],
            [
              82
            ]
          ]
        }
      ]
    },
    {
      "name": "UPDATE_CREDIT_CARD",
      "id": 3,
      "groups": [
        {
          "required": false,
          "single": true,
          "synonyms": [
            [
              24,
              12
            ],
            [
              58
            ],
            [
              12
            ]
          ]
        },
        {
          "required": true,
          "single": true,
          "synonyms": [
            [
              15
            ],
            [
              27
            ],
            [
              17
            ],
            [
              38
            ],
            [
              67
            ]
          ]
        },
        {
          "required": true,
          "single": true,
          "synonyms": [
            [
              14,
              11,
              29
            ],
            [
              40,
              36,
              7
            ],
            [
              40,
              36,
              6
            ],
            [
              75,
              70
            ],
            [
              40,
              35
            ],
            [
              75,
              69
            ],
            [
              11,
              29
            ],
            [
              40,
              34
            ],
            [
              40,
              37
            ],
            [
              32,
              7
            ],
            [
              32,
              6
            ],
            [
              40,
              36
            ],
            [
              77
            ],
            [
              34
            ],
            [
              76
            ],
            [
              78
            ],
            [
              33
            ],
            [
              75
            ]
          ]
        }
      ]
    },
    {
      "name": "LAUNCH_INCOGNITO",
      "id": 4,
      "groups": [
        {
          "required": false,
          "single": true,
          "synonyms": [
            [
              24,
              12
            ],
            [
              58
            ],
            [
              12
            ]
          ]
        },
        {
          "required": false,
          "single": true,
          "synonyms": [
            [
              45
            ],
            [
              1
            ],
            [
              19
            ],
            [
              0
            ]
          ]
        },
        {
          "required": true,
          "single": true,
          "synonyms": [
            [
              23,
              48
            ],
            [
              49,
              64
            ],
            [
              23,
              47
            ],
            [
              23,
              53
            ],
            [
              49,
              43
            ],
            [
              23,
              52
            ],
            [
              49,
              56
            ],
            [
              23,
              42
            ],
            [
              23,
              41
            ],
            [
              23
            ]
          ]
        }
      ]
    },
    {
      "name": "TRANSLATE",
      "id": 5,
      "groups": [
        {
          "required": false,
          "single": true,
          "synonyms": [
            [
              24,
              12
            ],
            [
              58
            ],
            [
              12
            ]
          ]
        },
        {
          "required": true,
          "single": true,
          "synonyms": [
            [
              16,
              15
            ],
            [
              74
            ]
          ]
        },
        {
          "required": true,
          "single": true,
          "synonyms": [
            [
              9,
              51
            ],
            [
              9,
              50
            ],
            [
              51
            ],
            [
              50
            ],
            [
              10
            ],
            [
              9
            ]
          ]
        }
      ]
    },
    {
      "name": "UPDATE_CHROME",
      "id": 6,
      "groups": [
        {
          "required": true,
          "single": true,
          "synonyms": [
            [
              24,
              12
            ],
            [
              58
            ],
            [
              12
            ]
          ]
        },
        {
          "required": true,
          "single": true,
          "synonyms": [
            [
              66,
              55,
              20
            ],
            [
              24,
              13
            ],
            [
              59
            ],
            [
              27
            ],
            [
              13
            ],
            [
              71
            ]
          ]
        }
      ]
    }
  ],
  "ignore_group": {
    "required": false,
    "single": false,
    "synonyms": [
      [
        81
      ],
      [
        30
      ],
      [
        30
      ],
      [
        30
      ],
      [
        44
      ],
      [
        2
      ],
      [
        8
      ],
      [
        46
      ],
      [
        8
      ]
    ]
  },
  "max_tokens": 32
}