{
  "schema": "pedal_concepts_runtime",
  "schema_version": 1,
  "data_version": 15538875,
  "tokenize_characters": " -",
  "dictionary": [
    "a",
    "ako",
    "aktualizovať",
    "an",
    "anonymný",
    "chrome",
    "cookie",
    "do",
    "google",
    "heslo",
    "heslá",
    "história",
    "i",
    "informácie",
    "inkognito",
    "inovovať",
    "inštalovať",
    "jazyk",
    "k",
    "karta",
    "karte",
    "karty",
    "kreditnej",
    "kreditná",
    "kreditné",
    "moja",
    "moje",
    "mojej",
    "moji",
    "mojich",
    "môj",
    "môjho",
    "na",
    "o",
    "odstrániť",
    "okno",
    "otvoriť",
    "pamäť",
    "platba",
    "platby",
    "pre",
    "prehliadanie",
    "prehliadač",
    "preložiť",
    "prihlasovacie",
    "režim",
    "rámci",
    "spravovať",
    "správca",
    "spustiť",
    "spôsoby",
    "stránku",
    "súbory",
    "súkromná",
    "súkromné",
    "súkromný",
    "the",
    "túto",
    "uložiť",
    "upraviť",
    "v",
    "vymazať",
    "vyrovnávacia",
    "vytvoriť",
    "zadať",
    "začať",
    "zmeniť",
    "zobraziť",
    "údaje"
  ],
  "pedals": [
    {
      "name": "CLEAR_BROWSING_DATA",
      "id": 1,
      "groups": [
        {
          "required": false,
          "single": true,
          "synonyms": [
            [
              8,
              5
            ],
            [
              41
            ],
            [
              42
            ],
            [
              5
            ]
          ]
        },
        {
          "required": true,
          "single": true,
          "synonyms": [
            [
              34
            ],
            [
              61
            ]
          ]
        },
        {
          "required": true,
          "single": true,
          "synonyms": [
            [
              62,
              37
            ],
            [
              52,
              6
            ],
            [
              13
            ],
            [
              11
            ],
            [
              68
            ]
          ]
        }
      ]
    },
    {
      "name": "MANAGE_PASSWORDS",
      "id": 2,
      "groups": [
        {
          "required": false,
          "single": true,
          "synonyms": [
            [
              8,
              5
            ],
            [
              42
            ],
            [
              5
            ]
          ]
        },
        {
          "required": true,
          "single": true,
          "synonyms": [
            [
              2
            ],
            [
              47
            ],
            [
              67
            ],
            [
              48
            ],
            [
              58
            ],
            [
              59
            ],
            [
              66
            ]
          ]
        },
        {
          "required": true,
          "single": true,
          "synonyms": [
            [
              44,
              68
            ],
            [
              10
            ],
            [
              9
            ]
          ]
        }
      ]
    },
    {
      "name": "UPDATE_CREDIT_CARD",
      "id": 3,
      "groups": [
        {
          "required": false,
          "single": true,
          "synonyms": [
            [
              8,
              5
            ],
            [
              42
            ],
            [
              5
            ]
          ]
        },
        {
          "required": true,
          "single": true,
          "synonyms": [
            [
              2
            ],
            [
              47
            ],
            [
              58
            ],
            [
              59
            ],
            [
              66
            ]
          ]
        },
        {
          "required": true,
          "single": true,
          "synonyms": [
            [
              13,
              33,
              22,
              20
            ],
            [
              13,
              33,
              20
            ],
            [
              23,
              19
            ],
            [
              24,
              21
            ],
            [
              50,
              39
            ],
            [
              38
            ],
            [
              39
            ],
            [
              21
            ]
          ]
        }
      ]
    },
    {
      "name": "LAUNCH_INCOGNITO",
      "id": 4,
      "groups": [
        {
          "required": false,
          "single": true,
          "synonyms": [
            [
              8,
              5
            ],
            [
              42
            ],
            [
              5
            ]
          ]
        },
        {
          "required": false,
          "single": true,
          "synonyms": [
            [
              63
            ],
            [
              36
            ],
            [
              49
            ],
            [
              65
            ],
            [
              64
            ]
          ]
        },
        {
          "required": true,
          "single": true,
          "synonyms": [
            [
              55,
              45
            ],
            [
              4,
              45
            ],
            [
              53,
              19
            ],
            [
              19,
              14
            ],
            [
              54,
              35
            ],
            [
              35,
              14
            ],
            [
              4
            ]
          ]
        }
      ]
    },
    {
      "name": "TRANSLATE",
      "id": 5,
      "groups": [
        {
          "required": false,
          "single": true,
          "synonyms": [
            [
              8,
              5
            ],
            [
              42
            ],
            [
              5
            ]
          ]
        },
        {
          "required": true,
          "single": true,
          "synonyms": [
            [
              66,
              17
            ],
            [
              43
            ]
          ]
        },
        {
          "required": true,
          "single": true,
          "synonyms": [
            [
              57,
              51
            ],
            [
              51
            ],
            [
              57
            ]
          ]
        }
      ]
    },
    {
      "name": "UPDATE_CHROME",
      "id": 6,
      "groups": [
        {
          "required": true,
          "single": true,
          "synonyms": [
            [
              8,
              5
            ],
            [
              42
            ],
            [
              5
            ]
          ]
        },
        {
          "required": true,
          "single": true,
          "synonyms": [
            [
              2
            ],
            [
              16
            ],
            [
              15
            ]
          ]
        }
      ]
    }
  ],
  "ignore_group": {
    "required": false,
    "single": false,
    "synonyms": [
      [
        60,
        46
      ],
      [
        31
      ],
      [
        29
      ],
      [
        27
      ],
      [
        30
      ],
      [
        25
      ],
      [
        26
      ],
      [
        28
      ],
      [
        40
      ],
      [
        1
      ],
      [
        56
      ],
      [
        3
      ],
      [
        7
      ],
      [
        32
      ],
      [
        7
      ],
      [
        60
      ],
      [
        60
      ],
      [
        60
      ],
      [
        18
      ],
      [
        0
      ],
      [
        12
      ]
    ]
  },
  "max_tokens": 32
}