{
    "trace_processor_shell": {
        "win": {
            "hash": "19187d1dcb21a846f045c2927a9d588b0f395e09",
            "remote_path": "perfetto_binaries/trace_processor_shell/win/94ca9a9578a7eeb3df93a820955458fb9aff28fd/trace_processor_shell.exe"
        },
        "mac": {
            "hash": "19571150217264641baf978653dd92211ef6b268",
            "remote_path": "perfetto_binaries/trace_processor_shell/mac/94ca9a9578a7eeb3df93a820955458fb9aff28fd/trace_processor_shell"
        },
        "linux": {
            "hash": "240f01ceac4408177109ca356554518088cf0498",
            "remote_path": "perfetto_binaries/trace_processor_shell/linux/2d79f95e908dcbae188e1fedd12e8424cbd14392/trace_processor_shell"
        }
    },
    "power_profile.sql": {
        "hash": "5bc5eae952c72d04403409a56838f66da13394d6",
        "remote_path": "perfetto_data/power_profile.sql/20200713T171147/power_profile.sql"
    }
}