{
  "schema": "pedal_concepts_runtime",
  "schema_version": 1,
  "data_version": 15538875,
  "tokenize_characters": " -",
  "dictionary": [
    "alih",
    "bahasa",
    "buat",
    "buka",
    "bukti",
    "cache",
    "cara",
    "chrome",
    "dalam",
    "data",
    "di",
    "edit",
    "google",
    "halaman",
    "imbas",
    "ini",
    "inkognito",
    "kad",
    "kaedah",
    "kata",
    "kelayakan",
    "keluar",
    "kemas",
    "kepada",
    "kini",
    "kosongkan",
    "kredit",
    "kuki",
    "lakukan",
    "laluan",
    "lancarkan",
    "lihat",
    "maklumat",
    "masuk",
    "menyemak",
    "mod",
    "mula",
    "pada",
    "padam",
    "pasang",
    "pembayaran",
    "pengurus",
    "penyemak",
    "peribadi",
    "saya",
    "sejarah",
    "simpan",
    "tab",
    "terjemah",
    "tetingkap",
    "tingkatkan",
    "tukar",
    "tunjukkan",
    "urus"
  ],
  "pedals": [
    {
      "name": "CLEAR_BROWSING_DATA",
      "id": 1,
      "groups": [
        {
          "required": false,
          "single": true,
          "synonyms": [
            [
              34,
              14
            ],
            [
              42,
              14
            ],
            [
              12,
              7
            ],
            [
              7
            ]
          ]
        },
        {
          "required": true,
          "single": true,
          "synonyms": [
            [
              0,
              21
            ],
            [
              25
            ],
            [
              38
            ]
          ]
        },
        {
          "required": true,
          "single": true,
          "synonyms": [
            [
              32
            ],
            [
              45
            ],
            [
              5
            ],
            [
              9
            ],
            [
              27
            ]
          ]
        }
      ]
    },
    {
      "name": "MANAGE_PASSWORDS",
      "id": 2,
      "groups": [
        {
          "required": false,
          "single": true,
          "synonyms": [
            [
              42,
              14
            ],
            [
              12,
              7
            ],
            [
              7
            ]
          ]
        },
        {
          "required": true,
          "single": true,
          "synonyms": [
            [
              22,
              24
            ],
            [
              52
            ],
            [
              41
            ],
            [
              46
            ],
            [
              31
            ],
            [
              51
            ],
            [
              11
            ],
            [
              53
            ]
          ]
        },
        {
          "required": true,
          "single": true,
          "synonyms": [
            [
              4,
              20
            ],
            [
              19,
              29
            ]
          ]
        }
      ]
    },
    {
      "name": "UPDATE_CREDIT_CARD",
      "id": 3,
      "groups": [
        {
          "required": false,
          "single": true,
          "synonyms": [
            [
              42,
              14
            ],
            [
              12,
              7
            ],
            [
              7
            ]
          ]
        },
        {
          "required": true,
          "single": true,
          "synonyms": [
            [
              22,
              24
            ],
            [
              46
            ],
            [
              51
            ],
            [
              11
            ],
            [
              53
            ]
          ]
        },
        {
          "required": true,
          "single": true,
          "synonyms": [
            [
              32,
              17,
              26
            ],
            [
              18,
              40
            ],
            [
              17,
              26
            ],
            [
              40
            ],
            [
              17
            ]
          ]
        }
      ]
    },
    {
      "name": "LAUNCH_INCOGNITO",
      "id": 4,
      "groups": [
        {
          "required": false,
          "single": true,
          "synonyms": [
            [
              42,
              14
            ],
            [
              12,
              7
            ],
            [
              7
            ]
          ]
        },
        {
          "required": false,
          "single": true,
          "synonyms": [
            [
              30
            ],
            [
              33
            ],
            [
              2
            ],
            [
              3
            ],
            [
              36
            ]
          ]
        },
        {
          "required": true,
          "single": true,
          "synonyms": [
            [
              49,
              16
            ],
            [
              49,
              43
            ],
            [
              35,
              16
            ],
            [
              47,
              16
            ],
            [
              35,
              43
            ],
            [
              47,
              43
            ],
            [
              16
            ]
          ]
        }
      ]
    },
    {
      "name": "TRANSLATE",
      "id": 5,
      "groups": [
        {
          "required": false,
          "single": true,
          "synonyms": [
            [
              42,
              14
            ],
            [
              12,
              7
            ],
            [
              7
            ]
          ]
        },
        {
          "required": true,
          "single": true,
          "synonyms": [
            [
              51,
              1
            ],
            [
              48
            ]
          ]
        },
        {
          "required": true,
          "single": true,
          "synonyms": [
            [
              13,
              15
            ],
            [
              13
            ],
            [
              15
            ]
          ]
        }
      ]
    },
    {
      "name": "UPDATE_CHROME",
      "id": 6,
      "groups": [
        {
          "required": true,
          "single": true,
          "synonyms": [
            [
              42,
              14
            ],
            [
              12,
              7
            ],
            [
              7
            ]
          ]
        },
        {
          "required": true,
          "single": true,
          "synonyms": [
            [
              22,
              24
            ],
            [
              50
            ],
            [
              39
            ]
          ]
        }
      ]
    }
  ],
  "ignore_group": {
    "required": false,
    "single": false,
    "synonyms": [
      [
        10,
        8
      ],
      [
        28
      ],
      [
        23
      ],
      [
        8
      ],
      [
        8
      ],
      [
        6
      ],
      [
        44
      ],
      [
        37
      ],
      [
        44
      ]
    ]
  },
  "max_tokens": 32
}