<?xml version="1.0" encoding="UTF-8"?>
<grit latest_public_release="0" current_release="1" output_all_resource_defines="false">
  <outputs>
    <output filename="grit/chromeos_diagnostics_app_resources.h" type="rc_header">
      <emit emit_type='prepend'></emit>
    </output>
    <output filename="grit/chromeos_diagnostics_app_resources_map.cc"
      type="resource_file_map_source" />
    <output filename="grit/chromeos_diagnostics_app_resources_map.h"
      type="resource_map_header" />
    <output filename="chromeos_diagnostics_app_resources.pak" type="data_package" />
  </outputs>
  <release seq="1">
    <includes>
      <!-- Privileged app host contents. -->
      <include name="IDR_DIAGNOSTICS_APP_ICON" file="app_icon_192.png" type="BINDATA" />
      <include name="IDR_DIAGNOSTICS_APP_INDEX_HTML" file="index.html" type="BINDATA" />
      <include name="IDR_DIAGNOSTICS_APP_JS" file="${root_gen_dir}/chromeos/components/diagnostics_ui/resources/diagnostics_app.js" use_base_dir="false" type="BINDATA"/>
      <include name="IDR_DIAGNOSTICS_BATTERY_STATUS_CARD_JS" file="${root_gen_dir}/chromeos/components/diagnostics_ui/resources/battery_status_card.js" use_base_dir="false" type="BINDATA"/>
      <include name="IDR_DIAGNOSTICS_CARD_JS" file="${root_gen_dir}/chromeos/components/diagnostics_ui/resources/diagnostics_card.js" use_base_dir="false" type="BINDATA"/>
      <include name="IDR_DIAGNOSTICS_CPU_CARD_JS" file="${root_gen_dir}/chromeos/components/diagnostics_ui/resources/cpu_card.js" use_base_dir="false" type="BINDATA"/>
      <include name="IDR_DIAGNOSTICS_DATA_POINT_JS" file="${root_gen_dir}/chromeos/components/diagnostics_ui/resources/data_point.js" use_base_dir="false" type="BINDATA"/>
      <include name="IDR_DIAGNOSTICS_FAKE_DATA_JS" file="fake_data.js" type="BINDATA"/>
      <include name="IDR_DIAGNOSTICS_FAKE_METHOD_RESOLVER_JS" file="fake_method_resolver.js" type="BINDATA"/>
      <include name="IDR_DIAGNOSTICS_FAKE_OBSERVABLES_JS" file="fake_observables.js" type="BINDATA"/>
      <include name="IDR_DIAGNOSTICS_FAKE_SYSTEM_DATA_PROVIDER_JS" file="fake_system_data_provider.js" type="BINDATA"/>
      <include name="IDR_DIAGNOSTICS_FAKE_SYSTEM_ROUTINE_CONTROLLER_JS" file="fake_system_routine_controller.js" type="BINDATA"/>
      <include name="IDR_DIAGNOSTICS_FONTS_CSS_JS" file="${root_gen_dir}/chromeos/components/diagnostics_ui/resources/diagnostics_fonts_css.js" use_base_dir="false" type="BINDATA"/>
      <include name="IDR_DIAGNOSTICS_MEMORY_CARD_JS" file="${root_gen_dir}/chromeos/components/diagnostics_ui/resources/memory_card.js" use_base_dir="false" type="BINDATA"/>
      <include name="IDR_DIAGNOSTICS_MOJO_INTERFACE_PROVIDER_JS" file="mojo_interface_provider.js" type="BINDATA"/>
      <include name="IDR_DIAGNOSTICS_MOJO_UTILS_JS" file="mojo_utils.js" type="BINDATA"/>
      <include name="IDR_DIAGNOSTICS_OVERVIEW_CARD_JS" file="${root_gen_dir}/chromeos/components/diagnostics_ui/resources/overview_card.js" use_base_dir="false" type="BINDATA"/>
      <include name="IDR_DIAGNOSTICS_PERCENT_BAR_CHART_JS" file="${root_gen_dir}/chromeos/components/diagnostics_ui/resources/percent_bar_chart.js" use_base_dir="false" type="BINDATA"/>
      <include name="IDR_DIAGNOSTICS_REALTIME_CPU_CHART_JS" file="${root_gen_dir}/chromeos/components/diagnostics_ui/resources/realtime_cpu_chart.js" use_base_dir="false" type="BINDATA"/>
      <include name="IDR_DIAGNOSTICS_ROUTINE_LIST_EXECUTOR_JS" file="routine_list_executor.js" type="BINDATA"/>
      <include name="IDR_DIAGNOSTICS_ROUTINE_RESULT_ENTRY_JS" file="${root_gen_dir}/chromeos/components/diagnostics_ui/resources/routine_result_entry.js" use_base_dir="false" type="BINDATA"/>
      <include name="IDR_DIAGNOSTICS_ROUTINE_RESULT_LIST_JS" file="${root_gen_dir}/chromeos/components/diagnostics_ui/resources/routine_result_list.js" use_base_dir="false" type="BINDATA"/>
      <include name="IDR_DIAGNOSTICS_ROUTINE_SECTION_JS" file="${root_gen_dir}/chromeos/components/diagnostics_ui/resources/routine_section.js" use_base_dir="false" type="BINDATA"/>
      <include name="IDR_DIAGNOSTICS_SHARED_CSS_JS" file="${root_gen_dir}/chromeos/components/diagnostics_ui/resources/diagnostics_shared_css.js" use_base_dir="false" type="BINDDATA"/>
      <include name="IDR_DIAGNOSTICS_SYSTEM_DATA_PROVIDER_MOJO_LITE_JS" file="${root_gen_dir}/chromeos/components/diagnostics_ui/mojom/system_data_provider.mojom-lite.js" use_base_dir="false" type="BINDATA" />
      <include name="IDR_DIAGNOSTICS_SYSTEM_ROUTINE_CONTROLLER_MOJO_LITE_JS" file="${root_gen_dir}/chromeos/components/diagnostics_ui/mojom/system_routine_controller.mojom-lite.js" use_base_dir="false" type="BINDATA" />
      <include name="IDR_DIAGNOSTICS_TEXT_BADGE_JS" file="${root_gen_dir}/chromeos/components/diagnostics_ui/resources/text_badge.js" use_base_dir="false" type="BINDATA"/>
      <include name="IDR_DIAGNOSTICS_TYPES_JS" file="diagnostics_types.js" type="BINDATA"/>
      <include name="IDR_DIAGNOSTICS_UTILS_JS" file="diagnostics_utils.js" type="BINDATA"/>
      <include name="IDR_D3_SRC_D3_MIN_JS" file="../../../../third_party/d3/src/d3.min.js" type="BINDATA" />
    </includes>
  </release>
</grit>
