{
  "schema": "pedal_concepts_runtime",
  "schema_version": 1,
  "data_version": 15538875,
  "tokenize_characters": " -",
  "dictionary": [
    "a",
    "aggiornare",
    "all'interno",
    "aprire",
    "attivare",
    "avviare",
    "browser",
    "cache",
    "cambiare",
    "cancellare",
    "carta",
    "carte",
    "chrome",
    "come",
    "cookie",
    "creare",
    "credenziali",
    "credito",
    "cronologia",
    "dati",
    "dentro",
    "di",
    "eliminare",
    "eseguire",
    "fare",
    "finestra",
    "gestire",
    "google",
    "il",
    "in",
    "incognito",
    "info",
    "informazioni",
    "installare",
    "io",
    "l'upgrade",
    "la",
    "lanciare",
    "lingua",
    "lo",
    "manager",
    "metodi",
    "mia",
    "mie",
    "miei",
    "mio",
    "modalità",
    "modificare",
    "mostrare",
    "navigazione",
    "negli",
    "nei",
    "nel",
    "nell'",
    "nella",
    "nelle",
    "nello",
    "pagamenti",
    "pagamento",
    "pagina",
    "password",
    "per",
    "privata",
    "questa",
    "resettare",
    "rimuovere",
    "salvare",
    "scheda",
    "su",
    "svuotare",
    "tradurre",
    "un",
    "un'",
    "una",
    "visualizzare"
  ],
  "pedals": [
    {
      "name": "CLEAR_BROWSING_DATA",
      "id": 1,
      "groups": [
        {
          "required": false,
          "single": true,
          "synonyms": [
            [
              27,
              12
            ],
            [
              49
            ],
            [
              6
            ],
            [
              12
            ]
          ]
        },
        {
          "required": true,
          "single": true,
          "synonyms": [
            [
              9
            ],
            [
              22
            ],
            [
              64
            ],
            [
              65
            ],
            [
              69
            ]
          ]
        },
        {
          "required": true,
          "single": true,
          "synonyms": [
            [
              32
            ],
            [
              18
            ],
            [
              14
            ],
            [
              7
            ],
            [
              19
            ],
            [
              31
            ]
          ]
        }
      ]
    },
    {
      "name": "MANAGE_PASSWORDS",
      "id": 2,
      "groups": [
        {
          "required": false,
          "single": true,
          "synonyms": [
            [
              27,
              12
            ],
            [
              6
            ],
            [
              12
            ]
          ]
        },
        {
          "required": true,
          "single": true,
          "synonyms": [
            [
              74
            ],
            [
              1
            ],
            [
              47
            ],
            [
              8
            ],
            [
              48
            ],
            [
              26
            ],
            [
              40
            ],
            [
              66
            ]
          ]
        },
        {
          "required": true,
          "single": true,
          "synonyms": [
            [
              16
            ],
            [
              60
            ]
          ]
        }
      ]
    },
    {
      "name": "UPDATE_CREDIT_CARD",
      "id": 3,
      "groups": [
        {
          "required": false,
          "single": true,
          "synonyms": [
            [
              27,
              12
            ],
            [
              6
            ],
            [
              12
            ]
          ]
        },
        {
          "required": true,
          "single": true,
          "synonyms": [
            [
              1
            ],
            [
              47
            ],
            [
              8
            ],
            [
              26
            ],
            [
              66
            ]
          ]
        },
        {
          "required": true,
          "single": true,
          "synonyms": [
            [
              32,
              21,
              11,
              21,
              17
            ],
            [
              19,
              21,
              11,
              21,
              17
            ],
            [
              32,
              21,
              11
            ],
            [
              41,
              21,
              58
            ],
            [
              10,
              21,
              17
            ],
            [
              11,
              21,
              17
            ],
            [
              19,
              21,
              11
            ],
            [
              57
            ],
            [
              58
            ],
            [
              11
            ]
          ]
        }
      ]
    },
    {
      "name": "LAUNCH_INCOGNITO",
      "id": 4,
      "groups": [
        {
          "required": false,
          "single": true,
          "synonyms": [
            [
              27,
              12
            ],
            [
              6
            ],
            [
              12
            ]
          ]
        },
        {
          "required": false,
          "single": true,
          "synonyms": [
            [
              4
            ],
            [
              37
            ],
            [
              5
            ],
            [
              3
            ],
            [
              15
            ]
          ]
        },
        {
          "required": true,
          "single": true,
          "synonyms": [
            [
              46,
              21,
              49,
              30
            ],
            [
              25,
              21,
              49,
              30
            ],
            [
              67,
              21,
              49,
              30
            ],
            [
              49,
              30
            ],
            [
              46,
              62
            ],
            [
              25,
              62
            ],
            [
              67,
              62
            ]
          ]
        }
      ]
    },
    {
      "name": "TRANSLATE",
      "id": 5,
      "groups": [
        {
          "required": false,
          "single": true,
          "synonyms": [
            [
              27,
              12
            ],
            [
              6
            ],
            [
              12
            ]
          ]
        },
        {
          "required": true,
          "single": true,
          "synonyms": [
            [
              8,
              38
            ],
            [
              70
            ]
          ]
        },
        {
          "required": true,
          "single": true,
          "synonyms": [
            [
              63,
              59
            ],
            [
              59
            ],
            [
              63
            ]
          ]
        }
      ]
    },
    {
      "name": "UPDATE_CHROME",
      "id": 6,
      "groups": [
        {
          "required": true,
          "single": true,
          "synonyms": [
            [
              27,
              12
            ],
            [
              6
            ],
            [
              12
            ]
          ]
        },
        {
          "required": true,
          "single": true,
          "synonyms": [
            [
              23,
              35
            ],
            [
              1
            ],
            [
              33
            ]
          ]
        }
      ]
    }
  ],
  "ignore_group": {
    "required": false,
    "single": false,
    "synonyms": [
      [
        2
      ],
      [
        20
      ],
      [
        53
      ],
      [
        56
      ],
      [
        50
      ],
      [
        54
      ],
      [
        55
      ],
      [
        13
      ],
      [
        24
      ],
      [
        44
      ],
      [
        61
      ],
      [
        45
      ],
      [
        72
      ],
      [
        73
      ],
      [
        52
      ],
      [
        51
      ],
      [
        42
      ],
      [
        43
      ],
      [
        28
      ],
      [
        71
      ],
      [
        29
      ],
      [
        68
      ],
      [
        34
      ],
      [
        39
      ],
      [
        36
      ],
      [
        0
      ]
    ]
  },
  "max_tokens": 32
}