{
    "0": {
        "benchmarks": {
            "blink_perf.accessibility": {
                "abridged": false
            },
            "blink_perf.bindings": {
                "abridged": false
            },
            "blink_perf.css": {
                "abridged": false
            },
            "blink_perf.dom": {
                "abridged": false
            },
            "blink_perf.events": {
                "abridged": false
            },
            "blink_perf.image_decoder": {
                "abridged": false
            },
            "blink_perf.layout": {
                "abridged": false
            },
            "blink_perf.owp_storage": {
                "abridged": false
            },
            "blink_perf.paint": {
                "abridged": false
            },
            "blink_perf.parser": {
                "abridged": false
            },
            "blink_perf.shadow_dom": {
                "abridged": false
            },
            "blink_perf.svg": {
                "abridged": false
            },
            "blink_perf.webaudio": {
                "abridged": false
            },
            "dromaeo": {
                "abridged": false
            },
            "dummy_benchmark.noisy_benchmark_1": {
                "abridged": false
            },
            "dummy_benchmark.stable_benchmark_1": {
                "abridged": false
            },
            "jetstream": {
                "abridged": false
            },
            "jetstream2": {
                "abridged": false
            }
        },
        "executables": {
            "base_perftests": {
                "path": "base_perftests",
                "arguments": [
                    "--test-launcher-jobs=1",
                    "--test-launcher-retry-limit=0"
                ]
            },
            "dawn_perf_tests": {
                "path": "dawn_perf_tests",
                "arguments": [
                    "--test-launcher-jobs=1",
                    "--test-launcher-retry-limit=0"
                ]
            }
        }
    },
    "1": {
        "benchmarks": {
            "kraken": {
                "abridged": false
            },
            "loading.desktop": {
                "end": 84,
                "abridged": false
            }
        }
    },
    "2": {
        "benchmarks": {
            "loading.desktop": {
                "begin": 84,
                "abridged": false
            },
            "media.desktop": {
                "abridged": false
            },
            "memory.desktop": {
                "abridged": false
            },
            "octane": {
                "abridged": false
            },
            "power.desktop": {
                "abridged": false
            },
            "rasterize_and_record_micro.top_25": {
                "abridged": false
            },
            "rendering.desktop": {
                "end": 15,
                "abridged": false
            }
        },
        "executables": {
            "media_perftests": {
                "path": "media_perftests",
                "arguments": [
                    "--single-process-tests",
                    "--test-launcher-retry-limit=0",
                    "--isolated-script-test-filter=*::-*_unoptimized::*_unaligned::*unoptimized_aligned"
                ]
            },
            "performance_browser_tests": {
                "path": "browser_tests",
                "arguments": [
                    "--full-performance-run",
                    "--test-launcher-jobs=1",
                    "--test-launcher-retry-limit=0",
                    "--ui-test-action-timeout=60000",
                    "--ui-test-action-max-timeout=60000",
                    "--test-launcher-timeout=60000",
                    "--gtest_filter=*/TabCapturePerformanceTest.*:*/CastV2PerformanceTest.*"
                ]
            }
        }
    },
    "3": {
        "benchmarks": {
            "rendering.desktop": {
                "begin": 15,
                "end": 178,
                "abridged": false
            }
        }
    },
    "4": {
        "benchmarks": {
            "rendering.desktop": {
                "begin": 178,
                "abridged": false
            },
            "speedometer": {
                "abridged": false
            },
            "speedometer-future": {
                "abridged": false
            },
            "speedometer2": {
                "abridged": false
            },
            "speedometer2-future": {
                "abridged": false
            },
            "speedometer2-pcscan": {
                "abridged": false
            },
            "system_health.common_desktop": {
                "end": 15,
                "abridged": false
            }
        }
    },
    "5": {
        "benchmarks": {
            "system_health.common_desktop": {
                "begin": 15,
                "abridged": false
            },
            "system_health.memory_desktop": {
                "end": 24,
                "abridged": false
            }
        }
    },
    "6": {
        "benchmarks": {
            "system_health.memory_desktop": {
                "begin": 24,
                "end": 78,
                "abridged": false
            }
        }
    },
    "7": {
        "benchmarks": {
            "system_health.memory_desktop": {
                "begin": 78,
                "abridged": false
            },
            "desktop_ui": {
                "abridged": false
            },
            "tab_switching.typical_25": {
                "abridged": false
            },
            "tracing.tracing_with_background_memory_infra": {
                "abridged": false
            },
            "v8.browsing_desktop": {
                "abridged": false
            },
            "v8.browsing_desktop-future": {
                "abridged": false
            },
            "webrtc": {
                "abridged": false
            }
        },
        "executables": {
            "views_perftests": {
                "path": "views_perftests",
                "arguments": [
                    "--xvfb"
                ]
            }
        }
    },
    "extra_infos": {
        "num_stories": 1088,
        "predicted_min_shard_time": 4017.0,
        "predicted_min_shard_index": 6,
        "predicted_max_shard_time": 4154.0,
        "predicted_max_shard_index": 7,
        "shard #0": 4145.0,
        "shard #1": 4101.0,
        "shard #2": 4100.0,
        "shard #3": 4116.0,
        "shard #4": 4127.0,
        "shard #5": 4127.0,
        "shard #6": 4017.0,
        "shard #7": 4154.0
    }
}