{
  "bindings": [
    {
      "command": "previousObject",
      "sequence": {
        "cvoxModifier": true,
        "keys": {
          "keyCode": [37]
        }
      }
    },
    {
      "command": "previousLine",
      "sequence": {
        "cvoxModifier": true,
        "keys": {
          "keyCode": [38]
        }
      }
    },
    {
      "command": "nextObject",
      "sequence": {
        "cvoxModifier": true,
        "keys": {
          "keyCode": [39]
        }
      }
    },
    {
      "command": "nextLine",
      "sequence": {
        "cvoxModifier": true,
        "keys": {
          "keyCode": [40]
        }
      }
    },
    {
      "command": "nextCharacter",
      "sequence": {
        "cvoxModifier": true,
        "keys": {
          "keyCode": [39],
          "shiftKey": [true]
        }
      }
    },
    {
      "command": "previousCharacter",
      "sequence": {
        "cvoxModifier": true,
        "keys": {
          "keyCode": [37],
          "shiftKey": [true]
        }
      }
    },
    {
      "command": "nextWord",
      "sequence": {
        "cvoxModifier": true,
        "keys": {
          "keyCode": [39],
          "ctrlKey": [true],
          "shiftKey": [true]
        }
      }
    },
    {
      "command": "previousWord",
      "sequence": {
        "cvoxModifier": true,
        "keys": {
          "keyCode": [37],
          "ctrlKey": [true],
          "shiftKey": [true]
        }
      }
    },
    {
      "command": "nextButton",
      "sequence": {
        "cvoxModifier": true,
        "keys": {
          "keyCode": [66]
        }
      }
    },
    {
      "command": "previousButton",
      "sequence": {
        "cvoxModifier": true,
        "keys": {
          "keyCode": [66],
          "shiftKey": [true]
        }
      }
    },
    {
      "command": "nextCheckbox",
      "sequence": {
        "cvoxModifier": true,
        "keys": {
          "keyCode": [88]
        }
      }
    },
    {
      "command": "previousCheckbox",
      "sequence": {
        "cvoxModifier": true,
        "keys": {
          "keyCode": [88],
          "shiftKey": [true]
        }
      }
    },
    {
      "command": "nextComboBox",
      "sequence": {
        "cvoxModifier": true,
        "keys": {
          "keyCode": [67]
        }
      }
    },
    {
      "command": "previousComboBox",
      "sequence": {
        "cvoxModifier": true,
        "keys": {
          "keyCode": [67],
          "shiftKey": [true]
        }
      }
    },
    {
      "command": "nextEditText",
      "sequence": {
        "cvoxModifier": true,
        "keys": {
          "keyCode": [69]
        }
      }
    },
    {
      "command": "previousEditText",
      "sequence": {
        "cvoxModifier": true,
        "keys": {
          "keyCode": [69],
          "shiftKey": [true]
        }
      }
    },
    {
      "command": "nextFormField",
      "sequence": {
        "cvoxModifier": true,
        "keys": {
          "keyCode": [70]
        }
      }
    },
    {
      "command": "previousFormField",
      "sequence": {
        "cvoxModifier": true,
        "keys": {
          "keyCode": [70],
          "shiftKey": [true]
        }
      }
    },
    {
      "command": "previousGraphic",
      "sequence": {
        "cvoxModifier": true,
        "keys": {
          "keyCode": [71],
          "shiftKey": [true]
        }
      }
    },
    {
      "command": "nextGraphic",
      "sequence": {
        "cvoxModifier": true,
        "keys": {
          "keyCode": [71]
        }
      }
    },
    {
      "command": "nextHeading",
      "sequence": {
        "cvoxModifier": true,
        "keys": {
          "keyCode": [72]
        }
      }
    },
    {
      "command": "nextHeading1",
      "sequence": {
        "cvoxModifier": true,
        "keys": {
          "keyCode": [49]
        }
      }
    },
    {
      "command": "nextHeading2",
      "sequence": {
        "cvoxModifier": true,
        "keys": {
          "keyCode": [50]
        }
      }
    },
    {
      "command": "nextHeading3",
      "sequence": {
        "cvoxModifier": true,
        "keys": {
          "keyCode": [51]
        }
      }
    },
    {
      "command": "nextHeading4",
      "sequence": {
        "cvoxModifier": true,
        "keys": {
          "keyCode": [52]
        }
      }
    },
    {
      "command": "nextHeading5",
      "sequence": {
        "cvoxModifier": true,
        "keys": {
          "keyCode": [53]
        }
      }
    },
    {
      "command": "nextHeading6",
      "sequence": {
        "cvoxModifier": true,
        "keys": {
          "keyCode": [54]
        }
      }
    },
    {
      "command": "previousHeading",
      "sequence": {
        "cvoxModifier": true,
        "keys": {
          "keyCode": [72],
          "shiftKey": [true]
        }
      }
    },
    {
      "command": "previousHeading1",
      "sequence": {
        "cvoxModifier": true,
        "keys": {
          "keyCode": [49],
          "shiftKey": [true]
        }
      }
    },
    {
      "command": "previousHeading2",
      "sequence": {
        "cvoxModifier": true,
        "keys": {
          "keyCode": [50],
          "shiftKey": [true]
        }
      }
    },
    {
      "command": "previousHeading3",
      "sequence": {
        "cvoxModifier": true,
        "keys": {
          "keyCode": [51],
          "shiftKey": [true]
        }
      }
    },
    {
      "command": "previousHeading4",
      "sequence": {
        "cvoxModifier": true,
        "keys": {
          "keyCode": [52],
          "shiftKey": [true]
        }
      }
    },
    {
      "command": "previousHeading5",
      "sequence": {
        "cvoxModifier": true,
        "keys": {
          "keyCode": [53],
          "shiftKey": [true]
        }
      }
    },
    {
      "command": "previousHeading6",
      "sequence": {
        "cvoxModifier": true,
        "keys": {
          "keyCode": [54],
          "shiftKey": [true]
        }
      }
    },
    {
      "command": "nextLink",
      "sequence": {
        "cvoxModifier": true,
        "keys": {
          "keyCode": [76]
        }
      }
    },
    {
      "command": "previousLink",
      "sequence": {
        "cvoxModifier": true,
        "keys": {
          "keyCode": [76],
          "shiftKey": [true]
        }
      }
    },
    {
      "command": "nextTable",
      "sequence": {
        "cvoxModifier": true,
        "keys": {
          "keyCode": [84]
        }
      }
    },
    {
      "command": "previousTable",
      "sequence": {
        "cvoxModifier": true,
        "keys": {
          "keyCode": [84],
          "shiftKey": [true]
        }
      }
    },
    {
      "command": "nextVisitedLink",
      "sequence": {
        "cvoxModifier": true,
        "keys": {
          "keyCode": [86]
        }
      }
    },
    {
      "command": "previousVisitedLink",
      "sequence": {
        "cvoxModifier": true,
        "keys": {
          "keyCode": [86],
          "shiftKey": [true]
        }
      }
    },
    {
      "command": "nextLandmark",
      "sequence": {
        "cvoxModifier": true,
        "keys": {
          "keyCode": [186]
        }
      }
    },
    {
      "command": "previousLandmark",
      "sequence": {
        "cvoxModifier": true,
        "keys": {
          "keyCode": [186],
          "shiftKey": [true]
        }
      }
    },
    {
      "command": "jumpToBottom",
      "sequence": {
        "cvoxModifier": true,
        "keys": {
          "keyCode": [39],
          "ctrlKey": [true]
        }
      }
    },
    {
      "command": "jumpToTop",
      "sequence": {
        "cvoxModifier": true,
        "keys": {
          "keyCode": [37],
          "ctrlKey": [true]
        }
      }
    },
    {
      "command": "forceClickOnCurrentItem",
      "sequence": {
        "cvoxModifier": true,
        "keys": {
          "keyCode": [32]
        }
      }
    },
    {
      "command": "contextMenu",
      "sequence": {
        "cvoxModifier": true,
        "keys": {
          "keyCode": [77]
        }
      }
    },
    {
      "command": "readFromHere",
      "sequence": {
        "cvoxModifier": true,
        "keys": {
          "keyCode": [82]
        }
      }
    },
    {
      "command": "toggleStickyMode",
      "sequence": {
        "skipStripping": false,
        "doubleTap": true,
        "keys": {
          "keyCode": [91]
        }
      }
    },
    {
      "command": "passThroughMode",
      "sequence": {
        "cvoxModifier": true,
        "keys": {
          "keyCode": [27],
          "shiftKey": [true]
        }
      }
    },
    {
      "command": "toggleKeyboardHelp",
      "sequence": {
        "cvoxModifier": true,
        "keys": {
          "keyCode": [190]
        }
      }
    },
    {
      "command": "stopSpeech",
      "sequence": {
        "cvoxModifier": false,
        "keys": {
          "ctrlKey": [true],
          "keyCode": [17]
        }
      }
    },
    {
      "command": "decreaseTtsRate",
      "sequence": {
        "cvoxModifier": true,
        "keys": {
          "keyCode": [219],
          "shiftKey": [true]
        }
      }
    },
    {
      "command": "increaseTtsRate",
      "sequence": {
        "cvoxModifier": true,
        "keys": {
          "keyCode": [219]
        }
      }
    },
    {
      "command": "decreaseTtsPitch",
      "sequence": {
        "cvoxModifier": true,
        "keys": {
          "keyCode": [221],
          "shiftKey": [true]
        }
      }
    },
    {
      "command": "increaseTtsPitch",
      "sequence": {
        "cvoxModifier": true,
        "keys": {
          "keyCode": [221]
        }
      }
    },
    {
      "command": "stopSpeech",
      "sequence": {
        "keys": {
          "ctrlKey": [true],
          "keyCode": [17]
        }
      }
    },
    {
      "command": "cyclePunctuationEcho",
      "sequence": {
        "cvoxModifier": true,
        "keys": {
          "keyCode": [65, 80]
        }
      }
    },
    {
      "command": "showKbExplorerPage",
      "sequence": {
        "cvoxModifier": true,
        "keys": {
          "keyCode": [79, 75]
        }
      }
    },
    {
      "command": "cycleTypingEcho",
      "sequence": {
        "cvoxModifier": true,
        "keys": {
          "keyCode": [65, 84]
        }
      }
    },
    {
      "command": "showOptionsPage",
      "sequence": {
        "cvoxModifier": true,
        "keys": {
          "keyCode": [79, 79]
        }
      }
    },
    {
      "command": "showLogPage",
      "sequence": {
        "cvoxModifier": true,
        "keys": {
          "keyCode": [79, 87]
        }
      }
    },
    {
      "command": "enableLogging",
      "sequence": {
        "cvoxModifier": true,
        "keys": {
          "keyCode": [79, 69]
        }
      }
    },
    {
      "command": "disableLogging",
      "sequence": {
        "cvoxModifier": true,
        "keys": {
          "keyCode": [79, 68]
        }
      }
    },
    {
      "command": "dumpTree",
      "sequence": {
        "cvoxModifier": true,
        "keys": {
          "keyCode": [68, 84],
          "ctrlKey": [true]
        }
      }
    },
    {
      "command": "help",
      "sequence": {
        "cvoxModifier": true,
        "keys": {
          "keyCode": [79, 84]
        }
      }
    },
    {
      "command": "showNextUpdatePage",
      "sequence": {
        "cvoxModifier": true,
        "keys": {
          "keyCode": [79, 78]
        }
      }
    },
    {
      "command": "toggleEarcons",
      "sequence": {
        "cvoxModifier": true,
        "keys": {
          "keyCode": [65, 69]
        }
      }
    },
    {
      "command": "speakTimeAndDate",
      "sequence": {
        "cvoxModifier": true,
        "keys": {
          "keyCode": [65, 68]}
      }
    },
    {
      "command": "readCurrentTitle",
      "sequence": {
        "cvoxModifier": true,
        "keys": {
          "keyCode": [65, 87]
        }
      }
    },
    {
      "command": "readCurrentURL",
      "sequence": {
        "cvoxModifier": true,
        "keys": {
          "keyCode": [65, 85]
        }
      }
    },
    {
      "command": "reportIssue",
      "sequence": {
        "cvoxModifier": true,
        "keys": {
          "keyCode": [65, 73]
        }
      }
    },
    {
      "command": "toggleSearchWidget",
      "sequence": {
        "cvoxModifier": true,
        "keys": {
          "keyCode": [191]
        }
      }
    },
    {
      "command": "showHeadingsList",
      "sequence": {
        "cvoxModifier": true,
        "keys": {
          "keyCode": [72],
          "ctrlKey": [true]
        }
      }
    },
    {
      "command": "showFormsList",
      "sequence": {
        "cvoxModifier": true,
        "keys": {
          "keyCode": [70],
          "ctrlKey": [true]
        }
      }
    },
    {
      "command": "showLandmarksList",
      "sequence": {
        "cvoxModifier": true,
        "keys": {
          "keyCode": [186],
          "ctrlKey": [true]
        }
      }
    },
    {
      "command": "showLinksList",
      "sequence": {
        "cvoxModifier": true,
        "keys": {
          "keyCode": [76],
          "ctrlKey": [true]
        }
      }
    },
    {
      "command": "showTablesList",
      "sequence": {
        "cvoxModifier": true,
        "keys": {
          "keyCode": [84],
          "ctrlKey": [true]
        }
      }
    },
    {
      "command": "toggleBrailleCaptions",
      "sequence": {
        "cvoxModifier": true,
        "keys": {
          "keyCode": [65, 66]
        }
      }
    },
    {
      "command": "toggleBrailleTable",
      "sequence": {
        "cvoxModifier": true,
        "keys": {
          "keyCode": [65, 71]
        }
      }
    },
    {
      "command": "viewGraphicAsBraille",
      "sequence": {
        "cvoxModifier": true,
        "keys": {
          "keyCode": [71],
          "altKey": [true]
        }
      }
    },
    {
      "command": "toggleSelection",
      "sequence": {
        "cvoxModifier": true,
        "keys": {
          "keyCode": [83]
        }
      }
    },
    {
      "command": "fullyDescribe",
      "sequence": {
        "cvoxModifier": true,
        "keys": {
          "keyCode": [75]
        }
      }
    },
    {
      "command": "previousRow",
      "sequence": {
        "cvoxModifier": true,
        "keys": {
          "keyCode": [38],
          "ctrlKey": [true],
          "altKey": [true]
        }
      }
    },
    {
      "command": "nextRow",
      "sequence": {
        "cvoxModifier": true,
        "keys": {
          "keyCode": [40],
          "ctrlKey": [true],
          "altKey": [true]
        }
      }
    },
    {
      "command": "nextCol",
      "sequence": {
        "cvoxModifier": true,
        "keys": {
          "keyCode": [39],
          "ctrlKey": [true],
          "altKey": [true]
        }
      }
    },
    {
      "command": "previousCol",
      "sequence": {
        "cvoxModifier": true,
        "keys": {
          "keyCode": [37],
          "ctrlKey": [true],
          "altKey": [true]
        }
      }
    },
    {
      "command": "goToRowFirstCell",
      "sequence": {
        "cvoxModifier": true,
        "keys": {
          "keyCode": [37],
          "ctrlKey": [true],
          "altKey": [true],
          "shiftKey": [true]
        }
      }
    },
    {
      "command": "goToColFirstCell",
      "sequence": {
        "cvoxModifier": true,
        "keys": {
          "keyCode": [38],
          "ctrlKey": [true],
          "altKey": [true],
          "shiftKey": [true]
        }
      }
    },
    {
      "command": "goToColLastCell",
      "sequence": {
        "cvoxModifier": true,
        "keys": {
          "keyCode": [40],
          "ctrlKey": [true],
          "altKey": [true],
          "shiftKey": [true]
        }
      }
    },
    {
      "command": "goToFirstCell",
      "sequence": {
        "cvoxModifier": true,
        "keys": {
          "keyCode": [37],
          "altKey": [true],
          "shiftKey": [true]
        }
      }
    },
    {
      "command": "goToLastCell",
      "sequence": {
        "cvoxModifier": true,
        "keys": {
          "keyCode": [39],
          "altKey": [true],
          "shiftKey": [true]
        }
      }
    },
    {
      "command": "goToRowLastCell",
      "sequence": {
        "cvoxModifier": true,
        "keys": {
          "keyCode": [39],
          "ctrlKey": [true],
          "altKey": [true],
          "shiftKey": [true]
        }
      }
    },
    {
      "command": "previousGroup",
      "sequence": {
        "cvoxModifier": true,
        "keys": {
          "keyCode": [38],
          "ctrlKey": [true]
        }
      }
    },
    {
      "command": "nextGroup",
      "sequence": {
        "cvoxModifier": true,
        "keys": {
          "keyCode": [40],
          "ctrlKey": [true]
        }
      }
    },
    {
      "command": "previousSimilarItem",
      "sequence": {
        "cvoxModifier": true,
        "keys": {
          "keyCode": [73],
          "shiftKey": [true]
        }
      }
    },
    {
      "command": "nextSimilarItem",
      "sequence": {
        "cvoxModifier": true,
        "keys": {
          "keyCode": [73]
        }
      }
    },
    {
      "command": "jumpToDetails",
      "sequence": {
        "cvoxModifier": true,
        "keys": {
          "keyCode": [65,74]
        }
      }
    },
    {
      "command": "toggleDarkScreen",
      "sequence": {
        "cvoxModifier": true,
        "keys": {
          "keyCode": [217]
        }
      }
    },
    {
      "command": "toggleSpeechOnOrOff",
      "sequence": {
        "cvoxModifier": true,
        "keys": {
          "keyCode": [173]
        }
      }
    },
    {
      "command": "enableChromeVoxArcSupportForCurrentApp",
      "sequence": {
        "cvoxModifier": true,
        "keys": {
          "keyCode": [65, 219]
        }
      }
    },
    {
      "command": "disableChromeVoxArcSupportForCurrentApp",
      "sequence": {
        "cvoxModifier": true,
        "keys": {
          "keyCode": [65, 221]
        }
      }
    },
    {
      "command": "forceClickOnCurrentItem",
      "sequence": {
        "cvoxModifier": true,
        "keys": {
          "keyCode": [32]
        },
        "doubleTap": true
      }
    },
    {
      "command": "showTtsSettings",
      "sequence": {
        "cvoxModifier": true,
        "keys": {
          "keyCode": [79, 83]
        }
      }
    },
    {
      "command": "announceBatteryDescription",
      "sequence": {
        "cvoxModifier": true,
        "keys": {
          "keyCode": [79, 66]
        }
      }
    },
    {
      "command": "announceRichTextDescription",
      "sequence": {
        "cvoxModifier": true,
        "keys": {
          "keyCode": [65, 70]
        }
      }
    },
    {
      "command": "readPhoneticPronunciation",
      "sequence": {
        "cvoxModifier": true,
        "keys": {
          "keyCode": [65, 67]
        }
      }
    },
    {
      "command": "readLinkURL",
      "sequence": {
        "cvoxModifier": true,
        "keys": {
          "keyCode": [65, 76]
        }
      }
    },
    {
      "command": "nextList",
      "sequence": {
        "cvoxModifier": true,
        "keys": {
          "keyCode": [74, 76]
        }
      }
    },
    {
      "command": "previousList",
      "sequence": {
        "cvoxModifier": true,
        "keys": {
          "keyCode": [74, 76],
          "shiftKey": [true]
        }
      }
    },
    {
      "command": "resetTextToSpeechSettings",
      "sequence": {
        "cvoxModifier": true,
        "keys": {
          "keyCode": [220],
          "ctrlKey": [true],
          "shiftKey": [true]
        }
      }
    },
    {
      "command": "toggleAnnotationsWidget",
      "sequence": {
        "cvoxModifier": true,
        "keys": {
          "keyCode": [65, 79]
        }
      }
    },
    {
      "command": "logLanguageInformationForCurrentNode",
      "sequence": {
        "cvoxModifier": true,
        "keys": {
          "keyCode": [80, 76]
        }
      }
    }
  ]
}
