{
  "schema": "pedal_concepts_runtime",
  "schema_version": 1,
  "data_version": 15538875,
  "tokenize_characters": " -",
  "dictionary": [
    "aktualisieren",
    "anschauen",
    "anzeigen",
    "arbeiten",
    "aus",
    "bearbeiten",
    "browser",
    "browserdaten",
    "browserverlauf",
    "cache",
    "chrome",
    "daten",
    "den",
    "die",
    "diese",
    "ein",
    "entfernen",
    "fenster",
    "google",
    "ich",
    "im",
    "in",
    "inkognito",
    "inkognitofenster",
    "inkognitomodus",
    "installieren",
    "kann",
    "karte",
    "kartendaten",
    "karteninformationen",
    "kredit",
    "kreditkarte",
    "kreditkartendaten",
    "leeren",
    "löschen",
    "man",
    "mein",
    "meine",
    "meinem",
    "meinen",
    "mit",
    "modus",
    "passwort",
    "passwörter",
    "privat",
    "privatmodus",
    "sein",
    "seine",
    "seinem",
    "seinen",
    "seite",
    "sprache",
    "starten",
    "suchverlauf",
    "surfen",
    "update",
    "upgrade",
    "upgraden",
    "verlauf",
    "verwalten",
    "webseite",
    "website",
    "wie",
    "wo",
    "ändern",
    "öffnen",
    "übersetzen"
  ],
  "pedals": [
    {
      "name": "CLEAR_BROWSING_DATA",
      "id": 1,
      "groups": [
        {
          "required": false,
          "single": true,
          "synonyms": [
            [
              18,
              10
            ],
            [
              6
            ],
            [
              10
            ]
          ]
        },
        {
          "required": true,
          "single": true,
          "synonyms": [
            [
              16
            ],
            [
              34
            ],
            [
              33
            ]
          ]
        },
        {
          "required": true,
          "single": true,
          "synonyms": [
            [
              8
            ],
            [
              7
            ],
            [
              53
            ],
            [
              58
            ],
            [
              9
            ],
            [
              11
            ]
          ]
        }
      ]
    },
    {
      "name": "MANAGE_PASSWORDS",
      "id": 2,
      "groups": [
        {
          "required": false,
          "single": true,
          "synonyms": [
            [
              18,
              10
            ],
            [
              6
            ],
            [
              10
            ]
          ]
        },
        {
          "required": true,
          "single": true,
          "synonyms": [
            [
              1
            ],
            [
              59
            ],
            [
              2
            ],
            [
              64
            ]
          ]
        },
        {
          "required": true,
          "single": true,
          "synonyms": [
            [
              43
            ],
            [
              42
            ]
          ]
        }
      ]
    },
    {
      "name": "UPDATE_CREDIT_CARD",
      "id": 3,
      "groups": [
        {
          "required": false,
          "single": true,
          "synonyms": [
            [
              18,
              10
            ],
            [
              6
            ],
            [
              10
            ]
          ]
        },
        {
          "required": true,
          "single": true,
          "synonyms": [
            [
              0
            ],
            [
              5
            ],
            [
              64
            ]
          ]
        },
        {
          "required": true,
          "single": true,
          "synonyms": [
            [
              30,
              27
            ],
            [
              29
            ],
            [
              32
            ],
            [
              28
            ],
            [
              31
            ]
          ]
        }
      ]
    },
    {
      "name": "LAUNCH_INCOGNITO",
      "id": 4,
      "groups": [
        {
          "required": false,
          "single": true,
          "synonyms": [
            [
              18,
              10
            ],
            [
              6
            ],
            [
              10
            ]
          ]
        },
        {
          "required": true,
          "single": true,
          "synonyms": [
            [
              3
            ],
            [
              52
            ],
            [
              65
            ],
            [
              54
            ]
          ]
        },
        {
          "required": true,
          "single": true,
          "synonyms": [
            [
              22,
              17
            ],
            [
              22,
              41
            ],
            [
              44,
              41
            ],
            [
              23
            ],
            [
              24
            ],
            [
              45
            ],
            [
              22
            ],
            [
              44
            ]
          ]
        }
      ]
    },
    {
      "name": "TRANSLATE",
      "id": 5,
      "groups": [
        {
          "required": false,
          "single": true,
          "synonyms": [
            [
              18,
              10
            ],
            [
              6
            ],
            [
              10
            ]
          ]
        },
        {
          "required": true,
          "single": true,
          "synonyms": [
            [
              51,
              64
            ],
            [
              66
            ]
          ]
        },
        {
          "required": true,
          "single": true,
          "synonyms": [
            [
              14,
              60
            ],
            [
              14,
              61
            ],
            [
              14,
              50
            ],
            [
              60
            ],
            [
              61
            ],
            [
              14
            ],
            [
              50
            ]
          ]
        }
      ]
    },
    {
      "name": "UPDATE_CHROME",
      "id": 6,
      "groups": [
        {
          "required": true,
          "single": true,
          "synonyms": [
            [
              18,
              10
            ],
            [
              6
            ],
            [
              10
            ]
          ]
        },
        {
          "required": true,
          "single": true,
          "synonyms": [
            [
              0
            ],
            [
              25
            ],
            [
              57
            ],
            [
              56
            ],
            [
              55
            ]
          ]
        }
      ]
    }
  ],
  "ignore_group": {
    "required": false,
    "single": false,
    "synonyms": [
      [
        38
      ],
      [
        48
      ],
      [
        49
      ],
      [
        39
      ],
      [
        37
      ],
      [
        47
      ],
      [
        26
      ],
      [
        36
      ],
      [
        46
      ],
      [
        62
      ],
      [
        19
      ],
      [
        35
      ],
      [
        13
      ],
      [
        4
      ],
      [
        40
      ],
      [
        12
      ],
      [
        15
      ],
      [
        63
      ],
      [
        21
      ],
      [
        20
      ]
    ]
  },
  "max_tokens": 32
}