{
  "schema": "pedal_concepts_runtime",
  "schema_version": 1,
  "data_version": 15538875,
  "tokenize_characters": " -",
  "dictionary": [
    "chrome",
    "google",
    "ಅಜ್ಞಾತ",
    "ಅದು",
    "ಅನುವಾದಿಸಿ",
    "ಅಪ್‌ಗ್ರೇಡ್",
    "ಅಪ್‌ಡೇಟ್",
    "ಅಳಿಸಿ",
    "ಇತಿಹಾಸ",
    "ಇದರ",
    "ಇದರಲ್ಲಿ",
    "ಇದು",
    "ಇನ್‌ಸ್ಟಾಲ್",
    "ಈ",
    "ಉಳಿಸಿ",
    "ಎಡಿಟ್",
    "ಒಂದು",
    "ಒಳಗೆ",
    "ಕಾರ್ಡ್",
    "ಕಾರ್ಡ್‌",
    "ಕಾರ್ಡ್‌ಗಳು",
    "ಕುಕೀಗಳು",
    "ಕ್ಕೆ",
    "ಕ್ಯಾಷ್",
    "ಕ್ರೆಡಿಟ್",
    "ಖಾಸಗಿ",
    "ಟ್ಯಾಬ್",
    "ಡೇಟಾ",
    "ತೆಗೆದುಹಾಕಿ",
    "ತೆರವುಗೊಳಿಸಿ",
    "ತೆರೆಯಿರಿ",
    "ತೋರಿಸಿ",
    "ನನ್ನ",
    "ನಮೂದಿಸಿ",
    "ನಲ್ಲಿ",
    "ನಾನು",
    "ನಿರ್ವಹಿಸಿ",
    "ನಿರ್ವಾಹಕರು",
    "ಪಾವತಿ",
    "ಪಾವತಿಗಳು",
    "ಪಾಸ್‌ವರ್ಡ್",
    "ಪಾಸ್‌ವರ್ಡ್‌ಗಳು",
    "ಪುಟ",
    "ಪ್ರಾರಂಭಿಸಿ",
    "ಬದಲಾಯಿಸಿ",
    "ಬ್ರೌಸರ್",
    "ಬ್ರೌಸಿಂಗ್",
    "ಭಾಷೆಯನ್ನು",
    "ಮಾಡಿ",
    "ಮಾಹಿತಿ",
    "ಮೋಡ್",
    "ಯಾವುದಾದರೂ",
    "ರಚಿಸಿ",
    "ರುಜುವಾತುಗಳು",
    "ಲಾಂಚ್",
    "ವಿಂಡೋ",
    "ವಿಧಾನಗಳು",
    "ವೀಕ್ಷಿಸಿ",
    "ಹೇಗೆ"
  ],
  "pedals": [
    {
      "name": "CLEAR_BROWSING_DATA",
      "id": 1,
      "groups": [
        {
          "required": false,
          "single": true,
          "synonyms": [
            [
              1,
              0
            ],
            [
              46
            ],
            [
              45
            ],
            [
              0
            ]
          ]
        },
        {
          "required": true,
          "single": true,
          "synonyms": [
            [
              29
            ],
            [
              28
            ],
            [
              7
            ]
          ]
        },
        {
          "required": true,
          "single": true,
          "synonyms": [
            [
              21
            ],
            [
              8
            ],
            [
              23
            ],
            [
              49
            ],
            [
              27
            ]
          ]
        }
      ]
    },
    {
      "name": "MANAGE_PASSWORDS",
      "id": 2,
      "groups": [
        {
          "required": false,
          "single": true,
          "synonyms": [
            [
              1,
              0
            ],
            [
              45
            ],
            [
              0
            ]
          ]
        },
        {
          "required": true,
          "single": true,
          "synonyms": [
            [
              6
            ],
            [
              15
            ],
            [
              37
            ],
            [
              36
            ],
            [
              44
            ],
            [
              57
            ],
            [
              31
            ],
            [
              14
            ]
          ]
        },
        {
          "required": true,
          "single": true,
          "synonyms": [
            [
              41
            ],
            [
              53
            ],
            [
              40
            ]
          ]
        }
      ]
    },
    {
      "name": "UPDATE_CREDIT_CARD",
      "id": 3,
      "groups": [
        {
          "required": false,
          "single": true,
          "synonyms": [
            [
              1,
              0
            ],
            [
              45
            ],
            [
              0
            ]
          ]
        },
        {
          "required": true,
          "single": true,
          "synonyms": [
            [
              6
            ],
            [
              15
            ],
            [
              36
            ],
            [
              44
            ],
            [
              14
            ]
          ]
        },
        {
          "required": true,
          "single": true,
          "synonyms": [
            [
              24,
              18,
              49
            ],
            [
              24,
              20
            ],
            [
              24,
              19
            ],
            [
              38,
              56
            ],
            [
              18,
              49
            ],
            [
              20
            ],
            [
              39
            ],
            [
              38
            ]
          ]
        }
      ]
    },
    {
      "name": "LAUNCH_INCOGNITO",
      "id": 4,
      "groups": [
        {
          "required": false,
          "single": true,
          "synonyms": [
            [
              1,
              0
            ],
            [
              45
            ],
            [
              0
            ]
          ]
        },
        {
          "required": false,
          "single": true,
          "synonyms": [
            [
              54
            ],
            [
              43
            ],
            [
              30
            ],
            [
              33
            ],
            [
              52
            ]
          ]
        },
        {
          "required": true,
          "single": true,
          "synonyms": [
            [
              2,
              26
            ],
            [
              2,
              55
            ],
            [
              25,
              26
            ],
            [
              2,
              50
            ],
            [
              25,
              55
            ],
            [
              25,
              50
            ],
            [
              2
            ]
          ]
        }
      ]
    },
    {
      "name": "TRANSLATE",
      "id": 5,
      "groups": [
        {
          "required": false,
          "single": true,
          "synonyms": [
            [
              1,
              0
            ],
            [
              45
            ],
            [
              0
            ]
          ]
        },
        {
          "required": true,
          "single": true,
          "synonyms": [
            [
              47,
              44
            ],
            [
              4
            ]
          ]
        },
        {
          "required": true,
          "single": true,
          "synonyms": [
            [
              13,
              42
            ],
            [
              11
            ],
            [
              42
            ]
          ]
        }
      ]
    },
    {
      "name": "UPDATE_CHROME",
      "id": 6,
      "groups": [
        {
          "required": true,
          "single": true,
          "synonyms": [
            [
              1,
              0
            ],
            [
              45
            ],
            [
              0
            ]
          ]
        },
        {
          "required": true,
          "single": true,
          "synonyms": [
            [
              5
            ],
            [
              12
            ],
            [
              6
            ]
          ]
        }
      ]
    }
  ],
  "ignore_group": {
    "required": false,
    "single": false,
    "synonyms": [
      [
        9,
        17
      ],
      [
        51
      ],
      [
        10
      ],
      [
        34
      ],
      [
        34
      ],
      [
        17
      ],
      [
        58
      ],
      [
        16
      ],
      [
        48
      ],
      [
        32
      ],
      [
        22
      ],
      [
        16
      ],
      [
        35
      ],
      [
        3
      ]
    ]
  },
  "max_tokens": 32
}