{
  "schema": "pedal_concepts_runtime",
  "schema_version": 1,
  "data_version": 15538875,
  "tokenize_characters": " -",
  "dictionary": [
    "chrome",
    "google",
    "การชำระเงิน",
    "การท่องเว็บ",
    "ของฉัน",
    "ข้อมูล",
    "ข้อมูลบัตร",
    "ข้อมูลบัตรเครดิต",
    "ข้อมูลเข้าสู่ระบบ",
    "ข้อมููลบัตร",
    "ข้างใน",
    "คุกกี้",
    "จัดการ",
    "ฉัน",
    "ดู",
    "ติดตั้ง",
    "ทำ",
    "นำออก",
    "นี้",
    "บน",
    "บัตร",
    "บัตรเครดิต",
    "บันทึก",
    "ประวัติ",
    "ป้อน",
    "ผู้จัดการ",
    "ภายใน",
    "รหัสผ่าน",
    "ลบ",
    "ลบออก",
    "ล้าง",
    "ล้างข้อมูล",
    "วิธี",
    "วิธีการชำระเงิน",
    "สร้าง",
    "สำหรับ",
    "หน้า",
    "หน้าต่างส่วนตัว",
    "หน้าต่างไม่ระบุตัวตน",
    "หน้านี้",
    "อัปเกรด",
    "อัปเดต",
    "เบราว์เซอร์",
    "เปลี่ยนภาษา",
    "เปลี่ยนแปลง",
    "เปิด",
    "เปิดใช้งาน",
    "เริ่มต้น",
    "แก้ไข",
    "แคช",
    "แท็บส่วนตัว",
    "แท็บไม่ระบุตัวตน",
    "แปล",
    "แสดง",
    "โหมดส่วนตัว",
    "โหมดไม่ระบุตัวตน",
    "ใน",
    "ไปยัง",
    "ไม่ระบุตัวตน"
  ],
  "pedals": [
    {
      "name": "CLEAR_BROWSING_DATA",
      "id": 1,
      "groups": [
        {
          "required": false,
          "single": true,
          "synonyms": [
            [
              1,
              0
            ],
            [
              3
            ],
            [
              42
            ],
            [
              0
            ]
          ]
        },
        {
          "required": true,
          "single": true,
          "synonyms": [
            [
              31
            ],
            [
              17
            ],
            [
              29
            ],
            [
              30
            ],
            [
              28
            ]
          ]
        },
        {
          "required": true,
          "single": true,
          "synonyms": [
            [
              23
            ],
            [
              5
            ],
            [
              11
            ],
            [
              49
            ]
          ]
        }
      ]
    },
    {
      "name": "MANAGE_PASSWORDS",
      "id": 2,
      "groups": [
        {
          "required": false,
          "single": true,
          "synonyms": [
            [
              1,
              0
            ],
            [
              42
            ],
            [
              0
            ]
          ]
        },
        {
          "required": true,
          "single": true,
          "synonyms": [
            [
              44
            ],
            [
              25
            ],
            [
              12
            ],
            [
              22
            ],
            [
              41
            ],
            [
              48
            ],
            [
              53
            ],
            [
              14
            ]
          ]
        },
        {
          "required": true,
          "single": true,
          "synonyms": [
            [
              8
            ],
            [
              27
            ]
          ]
        }
      ]
    },
    {
      "name": "UPDATE_CREDIT_CARD",
      "id": 3,
      "groups": [
        {
          "required": false,
          "single": true,
          "synonyms": [
            [
              1,
              0
            ],
            [
              42
            ],
            [
              0
            ]
          ]
        },
        {
          "required": true,
          "single": true,
          "synonyms": [
            [
              44
            ],
            [
              12
            ],
            [
              22
            ],
            [
              41
            ],
            [
              48
            ]
          ]
        },
        {
          "required": true,
          "single": true,
          "synonyms": [
            [
              7
            ],
            [
              33
            ],
            [
              2
            ],
            [
              9
            ],
            [
              6
            ],
            [
              21
            ],
            [
              20
            ]
          ]
        }
      ]
    },
    {
      "name": "LAUNCH_INCOGNITO",
      "id": 4,
      "groups": [
        {
          "required": false,
          "single": true,
          "synonyms": [
            [
              1,
              0
            ],
            [
              42
            ],
            [
              0
            ]
          ]
        },
        {
          "required": false,
          "single": true,
          "synonyms": [
            [
              46
            ],
            [
              47
            ],
            [
              34
            ],
            [
              24
            ],
            [
              45
            ]
          ]
        },
        {
          "required": true,
          "single": true,
          "synonyms": [
            [
              38
            ],
            [
              51
            ],
            [
              55
            ],
            [
              37
            ],
            [
              58
            ],
            [
              50
            ],
            [
              54
            ]
          ]
        }
      ]
    },
    {
      "name": "TRANSLATE",
      "id": 5,
      "groups": [
        {
          "required": false,
          "single": true,
          "synonyms": [
            [
              1,
              0
            ],
            [
              42
            ],
            [
              0
            ]
          ]
        },
        {
          "required": true,
          "single": true,
          "synonyms": [
            [
              43
            ],
            [
              52
            ]
          ]
        },
        {
          "required": true,
          "single": true,
          "synonyms": [
            [
              39
            ],
            [
              36
            ],
            [
              18
            ]
          ]
        }
      ]
    },
    {
      "name": "UPDATE_CHROME",
      "id": 6,
      "groups": [
        {
          "required": true,
          "single": true,
          "synonyms": [
            [
              1,
              0
            ],
            [
              42
            ],
            [
              0
            ]
          ]
        },
        {
          "required": true,
          "single": true,
          "synonyms": [
            [
              15
            ],
            [
              40
            ],
            [
              41
            ]
          ]
        }
      ]
    }
  ],
  "ignore_group": {
    "required": false,
    "single": false,
    "synonyms": [
      [
        10
      ],
      [
        35
      ],
      [
        4
      ],
      [
        26
      ],
      [
        57
      ],
      [
        32
      ],
      [
        13
      ],
      [
        16
      ],
      [
        56
      ],
      [
        19
      ]
    ]
  },
  "max_tokens": 32
}