<?xml version="1.0" encoding="UTF-8"?>

<!--
This file contains the strings for bluetooth.
-->

<grit base_dir="." latest_public_release="0" current_release="1"
      output_all_resource_defines="false" source_lang_id="en" enc_check="möl">
  <outputs>
    <output filename="grit/bluetooth_strings.h" type="rc_header">
      <emit emit_type='prepend'></emit>
    </output>
    <if expr="is_android">
      <output filename="bluetooth_strings_af.pak" type="data_package" lang="af" />
      <output filename="bluetooth_strings_as.pak" type="data_package" lang="as" />
      <output filename="bluetooth_strings_az.pak" type="data_package" lang="az" />
      <output filename="bluetooth_strings_be.pak" type="data_package" lang="be" />
      <output filename="bluetooth_strings_bs.pak" type="data_package" lang="bs" />
      <output filename="bluetooth_strings_eu.pak" type="data_package" lang="eu" />
      <output filename="bluetooth_strings_fr-CA.pak" type="data_package" lang="fr-CA" />
      <output filename="bluetooth_strings_gl.pak" type="data_package" lang="gl" />
      <output filename="bluetooth_strings_hy.pak" type="data_package" lang="hy" />
      <output filename="bluetooth_strings_is.pak" type="data_package" lang="is" />
      <output filename="bluetooth_strings_ka.pak" type="data_package" lang="ka" />
      <output filename="bluetooth_strings_kk.pak" type="data_package" lang="kk" />
      <output filename="bluetooth_strings_km.pak" type="data_package" lang="km" />
      <output filename="bluetooth_strings_ky.pak" type="data_package" lang="ky" />
      <output filename="bluetooth_strings_lo.pak" type="data_package" lang="lo" />
      <output filename="bluetooth_strings_mk.pak" type="data_package" lang="mk" />
      <output filename="bluetooth_strings_mn.pak" type="data_package" lang="mn" />
      <output filename="bluetooth_strings_my.pak" type="data_package" lang="my" />
      <output filename="bluetooth_strings_ne.pak" type="data_package" lang="ne" />
      <output filename="bluetooth_strings_or.pak" type="data_package" lang="or" />
      <output filename="bluetooth_strings_pa.pak" type="data_package" lang="pa" />
      <output filename="bluetooth_strings_si.pak" type="data_package" lang="si" />
      <output filename="bluetooth_strings_sq.pak" type="data_package" lang="sq" />
      <output filename="bluetooth_strings_sr-Latn.pak" type="data_package" lang="sr-Latn" />
      <output filename="bluetooth_strings_ur.pak" type="data_package" lang="ur" />
      <output filename="bluetooth_strings_uz.pak" type="data_package" lang="uz" />
      <output filename="bluetooth_strings_zh-HK.pak" type="data_package" lang="zh-HK" />
      <output filename="bluetooth_strings_zu.pak" type="data_package" lang="zu" />
    </if>
    <output filename="bluetooth_strings_am.pak" type="data_package" lang="am" />
    <output filename="bluetooth_strings_ar.pak" type="data_package" lang="ar" />
    <output filename="bluetooth_strings_bg.pak" type="data_package" lang="bg" />
    <output filename="bluetooth_strings_bn.pak" type="data_package" lang="bn" />
    <output filename="bluetooth_strings_ca.pak" type="data_package" lang="ca" />
    <output filename="bluetooth_strings_cs.pak" type="data_package" lang="cs" />
    <output filename="bluetooth_strings_da.pak" type="data_package" lang="da" />
    <output filename="bluetooth_strings_de.pak" type="data_package" lang="de" />
    <output filename="bluetooth_strings_el.pak" type="data_package" lang="el" />
    <output filename="bluetooth_strings_en-GB.pak" type="data_package" lang="en-GB" />
    <output filename="bluetooth_strings_en-US.pak" type="data_package" lang="en" />
    <output filename="bluetooth_strings_es.pak" type="data_package" lang="es" />
    <if expr="is_ios">
      <!-- iOS uses es-MX for es-419 -->
      <output filename="bluetooth_strings_es-MX.pak" type="data_package" lang="es-419" />
    </if>
    <if expr="not is_ios">
      <output filename="bluetooth_strings_es-419.pak" type="data_package" lang="es-419" />
    </if>
    <output filename="bluetooth_strings_et.pak" type="data_package" lang="et" />
    <output filename="bluetooth_strings_fa.pak" type="data_package" lang="fa" />
    <output filename="bluetooth_strings_fake-bidi.pak" type="data_package" lang="fake-bidi" />
    <output filename="bluetooth_strings_fi.pak" type="data_package" lang="fi" />
    <output filename="bluetooth_strings_fil.pak" type="data_package" lang="fil" />
    <output filename="bluetooth_strings_fr.pak" type="data_package" lang="fr" />
    <output filename="bluetooth_strings_gu.pak" type="data_package" lang="gu" />
    <output filename="bluetooth_strings_he.pak" type="data_package" lang="he" />
    <output filename="bluetooth_strings_hi.pak" type="data_package" lang="hi" />
    <output filename="bluetooth_strings_hr.pak" type="data_package" lang="hr" />
    <output filename="bluetooth_strings_hu.pak" type="data_package" lang="hu" />
    <output filename="bluetooth_strings_id.pak" type="data_package" lang="id" />
    <output filename="bluetooth_strings_it.pak" type="data_package" lang="it" />
    <output filename="bluetooth_strings_ja.pak" type="data_package" lang="ja" />
    <output filename="bluetooth_strings_kn.pak" type="data_package" lang="kn" />
    <output filename="bluetooth_strings_ko.pak" type="data_package" lang="ko" />
    <output filename="bluetooth_strings_lt.pak" type="data_package" lang="lt" />
    <output filename="bluetooth_strings_lv.pak" type="data_package" lang="lv" />
    <output filename="bluetooth_strings_ml.pak" type="data_package" lang="ml" />
    <output filename="bluetooth_strings_mr.pak" type="data_package" lang="mr" />
    <output filename="bluetooth_strings_ms.pak" type="data_package" lang="ms" />
    <output filename="bluetooth_strings_nl.pak" type="data_package" lang="nl" />
    <!-- The translation console uses 'no' for Norwegian Bokmål. It should
         be 'nb'. -->
    <output filename="bluetooth_strings_nb.pak" type="data_package" lang="no" />
    <output filename="bluetooth_strings_pl.pak" type="data_package" lang="pl" />
    <if expr="is_ios">
      <!-- iOS uses pt for pt-BR -->
      <output filename="bluetooth_strings_pt.pak" type="data_package" lang="pt-BR" />
    </if>
    <if expr="not is_ios">
      <output filename="bluetooth_strings_pt-BR.pak" type="data_package" lang="pt-BR" />
    </if>
    <output filename="bluetooth_strings_pt-PT.pak" type="data_package" lang="pt-PT" />
    <output filename="bluetooth_strings_ro.pak" type="data_package" lang="ro" />
    <output filename="bluetooth_strings_ru.pak" type="data_package" lang="ru" />
    <output filename="bluetooth_strings_sk.pak" type="data_package" lang="sk" />
    <output filename="bluetooth_strings_sl.pak" type="data_package" lang="sl" />
    <output filename="bluetooth_strings_sr.pak" type="data_package" lang="sr" />
    <output filename="bluetooth_strings_sv.pak" type="data_package" lang="sv" />
    <output filename="bluetooth_strings_sw.pak" type="data_package" lang="sw" />
    <output filename="bluetooth_strings_ta.pak" type="data_package" lang="ta" />
    <output filename="bluetooth_strings_te.pak" type="data_package" lang="te" />
    <output filename="bluetooth_strings_th.pak" type="data_package" lang="th" />
    <output filename="bluetooth_strings_tr.pak" type="data_package" lang="tr" />
    <output filename="bluetooth_strings_uk.pak" type="data_package" lang="uk" />
    <output filename="bluetooth_strings_vi.pak" type="data_package" lang="vi" />
    <output filename="bluetooth_strings_zh-CN.pak" type="data_package" lang="zh-CN" />
    <output filename="bluetooth_strings_zh-TW.pak" type="data_package" lang="zh-TW" />
  </outputs>
  <translations>
    <file path="strings/bluetooth_strings_af.xtb" lang="af" />
    <file path="strings/bluetooth_strings_am.xtb" lang="am" />
    <file path="strings/bluetooth_strings_ar.xtb" lang="ar" />
    <file path="strings/bluetooth_strings_as.xtb" lang="as" />
    <file path="strings/bluetooth_strings_az.xtb" lang="az" />
    <file path="strings/bluetooth_strings_be.xtb" lang="be" />
    <file path="strings/bluetooth_strings_bg.xtb" lang="bg" />
    <file path="strings/bluetooth_strings_bn.xtb" lang="bn" />
    <file path="strings/bluetooth_strings_bs.xtb" lang="bs" />
    <file path="strings/bluetooth_strings_ca.xtb" lang="ca" />
    <file path="strings/bluetooth_strings_cs.xtb" lang="cs" />
    <file path="strings/bluetooth_strings_da.xtb" lang="da" />
    <file path="strings/bluetooth_strings_de.xtb" lang="de" />
    <file path="strings/bluetooth_strings_el.xtb" lang="el" />
    <file path="strings/bluetooth_strings_en-GB.xtb" lang="en-GB" />
    <file path="strings/bluetooth_strings_es.xtb" lang="es" />
    <file path="strings/bluetooth_strings_es-419.xtb" lang="es-419" />
    <file path="strings/bluetooth_strings_et.xtb" lang="et" />
    <file path="strings/bluetooth_strings_eu.xtb" lang="eu" />
    <file path="strings/bluetooth_strings_fa.xtb" lang="fa" />
    <file path="strings/bluetooth_strings_fi.xtb" lang="fi" />
    <file path="strings/bluetooth_strings_fil.xtb" lang="fil" />
    <file path="strings/bluetooth_strings_fr.xtb" lang="fr" />
    <file path="strings/bluetooth_strings_fr-CA.xtb" lang="fr-CA" />
    <file path="strings/bluetooth_strings_gl.xtb" lang="gl" />
    <file path="strings/bluetooth_strings_gu.xtb" lang="gu" />
    <file path="strings/bluetooth_strings_hi.xtb" lang="hi" />
    <file path="strings/bluetooth_strings_hr.xtb" lang="hr" />
    <file path="strings/bluetooth_strings_hu.xtb" lang="hu" />
    <file path="strings/bluetooth_strings_hy.xtb" lang="hy" />
    <file path="strings/bluetooth_strings_id.xtb" lang="id" />
    <file path="strings/bluetooth_strings_is.xtb" lang="is" />
    <file path="strings/bluetooth_strings_it.xtb" lang="it" />
    <!-- The translation console uses 'iw' for Hebrew, but we use 'he'. -->
    <file path="strings/bluetooth_strings_iw.xtb" lang="he" />
    <file path="strings/bluetooth_strings_ja.xtb" lang="ja" />
    <file path="strings/bluetooth_strings_ka.xtb" lang="ka" />
    <file path="strings/bluetooth_strings_kk.xtb" lang="kk" />
    <file path="strings/bluetooth_strings_km.xtb" lang="km" />
    <file path="strings/bluetooth_strings_kn.xtb" lang="kn" />
    <file path="strings/bluetooth_strings_ko.xtb" lang="ko" />
    <file path="strings/bluetooth_strings_ky.xtb" lang="ky" />
    <file path="strings/bluetooth_strings_lo.xtb" lang="lo" />
    <file path="strings/bluetooth_strings_lt.xtb" lang="lt" />
    <file path="strings/bluetooth_strings_lv.xtb" lang="lv" />
    <file path="strings/bluetooth_strings_mk.xtb" lang="mk" />
    <file path="strings/bluetooth_strings_ml.xtb" lang="ml" />
    <file path="strings/bluetooth_strings_mn.xtb" lang="mn" />
    <file path="strings/bluetooth_strings_mr.xtb" lang="mr" />
    <file path="strings/bluetooth_strings_ms.xtb" lang="ms" />
    <file path="strings/bluetooth_strings_my.xtb" lang="my" />
    <file path="strings/bluetooth_strings_ne.xtb" lang="ne" />
    <file path="strings/bluetooth_strings_nl.xtb" lang="nl" />
    <file path="strings/bluetooth_strings_no.xtb" lang="no" />
    <file path="strings/bluetooth_strings_or.xtb" lang="or" />
    <file path="strings/bluetooth_strings_pa.xtb" lang="pa" />
    <file path="strings/bluetooth_strings_pl.xtb" lang="pl" />
    <file path="strings/bluetooth_strings_pt-BR.xtb" lang="pt-BR" />
    <file path="strings/bluetooth_strings_pt-PT.xtb" lang="pt-PT" />
    <file path="strings/bluetooth_strings_ro.xtb" lang="ro" />
    <file path="strings/bluetooth_strings_ru.xtb" lang="ru" />
    <file path="strings/bluetooth_strings_si.xtb" lang="si" />
    <file path="strings/bluetooth_strings_sk.xtb" lang="sk" />
    <file path="strings/bluetooth_strings_sl.xtb" lang="sl" />
    <file path="strings/bluetooth_strings_sq.xtb" lang="sq" />
    <file path="strings/bluetooth_strings_sr.xtb" lang="sr" />
    <file path="strings/bluetooth_strings_sr-Latn.xtb" lang="sr-Latn" />
    <file path="strings/bluetooth_strings_sv.xtb" lang="sv" />
    <file path="strings/bluetooth_strings_sw.xtb" lang="sw" />
    <file path="strings/bluetooth_strings_ta.xtb" lang="ta" />
    <file path="strings/bluetooth_strings_te.xtb" lang="te" />
    <file path="strings/bluetooth_strings_th.xtb" lang="th" />
    <file path="strings/bluetooth_strings_tr.xtb" lang="tr" />
    <file path="strings/bluetooth_strings_uk.xtb" lang="uk" />
    <file path="strings/bluetooth_strings_ur.xtb" lang="ur" />
    <file path="strings/bluetooth_strings_uz.xtb" lang="uz" />
    <file path="strings/bluetooth_strings_vi.xtb" lang="vi" />
    <file path="strings/bluetooth_strings_zh-CN.xtb" lang="zh-CN" />
    <file path="strings/bluetooth_strings_zh-HK.xtb" lang="zh-HK" />
    <file path="strings/bluetooth_strings_zh-TW.xtb" lang="zh-TW" />
    <file path="strings/bluetooth_strings_zu.xtb" lang="zu" />
  </translations>
  <release seq="1" allow_pseudo="false">
    <messages fallback_to_english="true">
      <message name="IDS_BLUETOOTH_DEVICE_UNKNOWN" desc="Text to identify Bluetooth devices of unknown or unsupported class.">
        Unknown or Unsupported Device (<ph name="ADDRESS">$1<ex>12:34:56:78:9A:BC</ex></ph>)
      </message>
      <message name="IDS_BLUETOOTH_DEVICE_COMPUTER" desc="Text to identify Bluetooth devices of the computer class.">
      Computer (<ph name="ADDRESS">$1<ex>12:34:56:78:9A:BC</ex></ph>)
      </message>
      <message name="IDS_BLUETOOTH_DEVICE_PERIPHERAL" desc="Text to identify Bluetooth devices of the peripheral class.">
      Peripheral (<ph name="ADDRESS">$1<ex>12:34:56:78:9A:BC</ex></ph>)
      </message>
      <message name="IDS_BLUETOOTH_DEVICE_PHONE" desc="Text to identify Bluetooth devices of the phone class.">
      Phone (<ph name="ADDRESS">$1<ex>12:34:56:78:9A:BC</ex></ph>)
      </message>
      <message name="IDS_BLUETOOTH_DEVICE_MODEM" desc="Text to identify Bluetooth devices of the modem class.">
      Modem (<ph name="ADDRESS">$1<ex>12:34:56:78:9A:BC</ex></ph>)
      </message>
      <message name="IDS_BLUETOOTH_DEVICE_AUDIO" desc="Text to identify Bluetooth devices of the audio class.">
      Audio (<ph name="ADDRESS">$1<ex>12:34:56:78:9A:BC</ex></ph>)
      </message>
      <message name="IDS_BLUETOOTH_DEVICE_CAR_AUDIO" desc="Text to identify Bluetooth devices of the car audio class.">
      Car audio (<ph name="ADDRESS">$1<ex>12:34:56:78:9A:BC</ex></ph>)
      </message>
      <message name="IDS_BLUETOOTH_DEVICE_VIDEO" desc="Text to identify Bluetooth devices of the video class.">
      Video (<ph name="ADDRESS">$1<ex>12:34:56:78:9A:BC</ex></ph>)
      </message>
      <message name="IDS_BLUETOOTH_DEVICE_JOYSTICK" desc="Text to identify Bluetooth devices of the joystick class.">
      Joystick (<ph name="ADDRESS">$1<ex>12:34:56:78:9A:BC</ex></ph>)
      </message>
      <message name="IDS_BLUETOOTH_DEVICE_GAMEPAD" desc="Text to identify Bluetooth devices of the gamepad class.">
      Gamepad (<ph name="ADDRESS">$1<ex>12:34:56:78:9A:BC</ex></ph>)
      </message>
      <message name="IDS_BLUETOOTH_DEVICE_KEYBOARD" desc="Text to identify Bluetooth devices of the keyboard class.">
      Keyboard (<ph name="ADDRESS">$1<ex>12:34:56:78:9A:BC</ex></ph>)
      </message>
      <message name="IDS_BLUETOOTH_DEVICE_TABLET" desc="Text to identify Bluetooth devices of the tablet class.">
      Tablet (<ph name="ADDRESS">$1<ex>12:34:56:78:9A:BC</ex></ph>)
      </message>
      <message name="IDS_BLUETOOTH_DEVICE_MOUSE" desc="Text to identify Bluetooth devices of the mouse class.">
      Mouse (<ph name="ADDRESS">$1<ex>12:34:56:78:9A:BC</ex></ph>)
      </message>
      <message name="IDS_BLUETOOTH_DEVICE_KEYBOARD_MOUSE_COMBO" desc="Text to identify Bluetooth devices of both keyboard and mouse class.">
      Keyboard/Mouse (<ph name="ADDRESS">$1<ex>12:34:56:78:9A:BC</ex></ph>)
      </message>
      <message name="IDS_BLUETOOTH_ACCESSIBILITY_DEVICE_TYPE_COMPUTER" desc="accessibility description for a Bluetooth connectable computer device including its type.">
      <ph name="DEVICE_NAME">$1<ex>Device XYZ</ex></ph>, Computer
      </message>
      <message name="IDS_BLUETOOTH_ACCESSIBILITY_DEVICE_TYPE_PHONE" desc="accessibility description for a Bluetooth connectable phone device including its type.">
        <ph name="DEVICE_NAME">$1<ex>Device XYZ</ex></ph>, Phone
      </message>
      <message name="IDS_BLUETOOTH_ACCESSIBILITY_DEVICE_TYPE_MODEM" desc="accessibility description for a Bluetooth connectable modem device including its type.">
        <ph name="DEVICE_NAME">$1<ex>Device XYZ</ex></ph>, Modem
      </message>
      <message name="IDS_BLUETOOTH_ACCESSIBILITY_DEVICE_TYPE_AUDIO" desc="accessibility description for a Bluetooth connectable audio device device including its type. These devices are typically speakers and headphones.">
        <ph name="DEVICE_NAME">$1<ex>Device XYZ</ex></ph>, Audio device
      </message>
      <message name="IDS_BLUETOOTH_ACCESSIBILITY_DEVICE_TYPE_CAR_AUDIO" desc="accessibility description for a Bluetooth connectable car audio device including its type. These devices are typically a car's audio system.">
        <ph name="DEVICE_NAME">$1<ex>Device XYZ</ex></ph>, Car audio device
      </message>
      <message name="IDS_BLUETOOTH_ACCESSIBILITY_DEVICE_TYPE_VIDEO" desc="accessibility description for a Bluetooth connectable video device including its type. These devices are typically a monitor or some other type of video display.">
        <ph name="DEVICE_NAME">$1<ex>Device XYZ</ex></ph>, Video device
      </message>
      <message name="IDS_BLUETOOTH_ACCESSIBILITY_DEVICE_TYPE_PERIPHERAL" desc="accessibility description for a Bluetooth connectable peripheral device including its type. This type is used for a generic external peripheral device.">
        <ph name="DEVICE_NAME">$1<ex>Device XYZ</ex></ph>, Peripheral
      </message>
      <message name="IDS_BLUETOOTH_ACCESSIBILITY_DEVICE_TYPE_JOYSTICK" desc="accessibility description for a Bluetooth connectable joystick device including its type. A joystick is a move-able stick mounted on based that is used to provide input.">
        <ph name="DEVICE_NAME">$1<ex>Device XYZ</ex></ph>, Joystick
      </message>
      <message name="IDS_BLUETOOTH_ACCESSIBILITY_DEVICE_TYPE_GAMEPAD" desc="accessibility description for a Bluetooth connectable gamepad device including its type. A gamepad is a two-handed control device where the fingers and thumbs are used to provide input.">
        <ph name="DEVICE_NAME">$1<ex>Device XYZ</ex></ph>, Gamepad
      </message>
      <message name="IDS_BLUETOOTH_ACCESSIBILITY_DEVICE_TYPE_KEYBOARD" desc="accessibility description for a Bluetooth connectable keyboard device including its type.">
        <ph name="DEVICE_NAME">$1<ex>Device XYZ</ex></ph>, Keyboard
      </message>
      <message name="IDS_BLUETOOTH_ACCESSIBILITY_DEVICE_TYPE_MOUSE" desc="accessibility description for a Bluetooth connectable mouse device including its type.">
        <ph name="DEVICE_NAME">$1<ex>Device XYZ</ex></ph>, Mouse
      </message>
      <message name="IDS_BLUETOOTH_ACCESSIBILITY_DEVICE_TYPE_TABLET" desc="accessibility description for a Bluetooth connectable tablet device including its type.">
        <ph name="DEVICE_NAME">$1<ex>Device XYZ</ex></ph>, Tablet
      </message>
      <message name="IDS_BLUETOOTH_ACCESSIBILITY_DEVICE_TYPE_KEYBOARD_MOUSE_COMBO" desc="accessibility description for a Bluetooth connectable keyboard and mouse combo device including its type.">
        <ph name="DEVICE_NAME">$1<ex>Device XYZ</ex></ph>, Keyboard and mouse combination
      </message>
      <message name="IDS_BLUETOOTH_ACCESSIBILITY_DEVICE_TYPE_UNKNOWN" desc="accessibility description for a device type that is not one of the known/supported device types for Chrome OS">
        <ph name="DEVICE_NAME">$1<ex>Device XYZ</ex></ph>, Unknown device type
      </message>
      <message name="IDS_BLUETOOTH_ACCESSIBILITY_DEVICE_TYPE_AND_CONNECTION_STATUS" desc="accessibility description for a Bluetooth connectable device that includes its status. IDS_BLUETOOTH_ACCESSIBILITY_DEVICE_TYPE_* will be used as an input to DEVICE_NAME_AND_TYPE">
        <ph name="DEVICE_NAME_AND_TYPE">$1<ex>Device XYZ, Audio Device</ex></ph> <ph name="CONNECTION_STATUS">$2<ex>Not connected</ex></ph>
      </message>
    </messages>
  </release>
</grit>

