{
  "iisSettings": {
    "windowsAuthentication": false,
    "anonymousAuthentication": true,
    "iisExpress": {
      "applicationUrl": "http://localhost:64837",
      "sslPort": 44321
    }
  },
  "profiles": {
    "TariffCalculator": {
      "commandName": "Project",
      "launchBrowser": true,
      "launchUrl": "https://localhost:5001/swagger",
      "environmentVariables": {
        "ASPNETCORE_ENVIRONMENT": "Development"
      },
      "applicationUrl": "https://localhost:5001;http://localhost:5000"
    }
  }
}