[
    {
        "id" : 1,
        "name": "Task 1",
        "complixity": null
    },
    {
        "id" : 2,
        "name": "Task 2",
        "complixity": null
    },
    {
        "id" : 3,
        "name": "Task 3",
        "complixity": null
    },
    {
        "id" : 4,
        "name": "Task 4",
        "complixity": null
    },
    {
        "id" : 5,
        "name": "Task 5",
        "complixity": null
    }
]