<?xml version="1.0" encoding="UTF-8"?>
<glyph name="W" format="1">
	<unicode hex="0057"/>
	<advance width="1016"/>
	<outline>
		<contour>
			<point x="249" y="0" type="line"/>
			<point x="332" y="0" type="line"/>
			<point x="524" y="653" type="line"/>
			<point x="482" y="653" type="line"/>
			<point x="690" y="0" type="line"/>
			<point x="770" y="0" type="line"/>
			<point x="986" y="694" type="line"/>
			<point x="903" y="694" type="line"/>
			<point x="711" y="39" type="line"/>
			<point x="756" y="39" type="line"/>
			<point x="555" y="689" type="line"/>
			<point x="462" y="689" type="line"/>
			<point x="273" y="39" type="line"/>
			<point x="313" y="39" type="line"/>
			<point x="126" y="694" type="line"/>
			<point x="30" y="694" type="line"/>
		</contour>
		<contour>
			<point name="bottom" x="505" y="0" type="move"/>
		</contour>
		<contour>
			<point name="top" x="505" y="694" type="move"/>
		</contour>
	</outline>
	<lib>
		<dict>
			<key>com.schriftgestaltung.Glyphs.lastChange</key>
			<string>2018-11-09 16:24:04 +0000</string>
		</dict>
	</lib>
	<note>
		W
	</note>
</glyph>
